hbase-builds mailing list archives

Site index · List index
Message view « Date » · « Thread »
Top « Date » · « Thread »
From Apache Jenkins Server <jenk...@builds.apache.org>
Subject Build failed in Jenkins: HBase-1.2 » latest1.7,Hadoop #47
Date Thu, 02 Jul 2015 05:06:50 GMT
See <https://builds.apache.org/job/HBase-1.2/jdk=latest1.7,label=Hadoop/47/changes>

Changes:

[stack] HBASE-13895 DATALOSS: Region assigned before WAL replay when abort (Enis Soztutar)
-- ADDENDUM

------------------------------------------
[...truncated 42763 lines...]
5/5 KB   28/264 KB   246/246 KB   20/20 KB   
5/5 KB   31/264 KB   246/246 KB   20/20 KB   
                                             
Downloaded: http://repo.maven.apache.org/maven2/org/jamon/jamon-api/2.3.0/jamon-api-2.3.0.jar
(5 KB at 84.8 KB/sec)
                                             
Downloaded: http://repo.maven.apache.org/maven2/org/codehaus/plexus/plexus-compiler-api/1.8.1/plexus-compiler-api-1.8.1.jar
(20 KB at 361.0 KB/sec)
                                             
Downloaded: http://repo.maven.apache.org/maven2/org/codehaus/plexus/plexus-utils/1.5.5/plexus-utils-1.5.5.jar
(246 KB at 3895.0 KB/sec)
35/264 KB                                    
37/264 KB   
41/264 KB   
45/264 KB   
49/264 KB   
50/264 KB   
54/264 KB   
58/264 KB   
62/264 KB   
66/264 KB   
69/264 KB   
73/264 KB   
77/264 KB   
81/264 KB   
85/264 KB   
89/264 KB   
92/264 KB   
            
Downloaded: http://repo.maven.apache.org/maven2/org/jamon/jamon-runtime/2.3.1/jamon-runtime-2.3.1.jar
(0 B at 0.0 KB/sec)
96/264 KB   
100/264 KB   
104/264 KB   
108/264 KB   
112/264 KB   
116/264 KB   
116/264 KB   
120/264 KB   
124/264 KB   
128/264 KB   
132/264 KB   
134/264 KB   
138/264 KB   
142/264 KB   
143/264 KB   
147/264 KB   
147/264 KB   
151/264 KB   
155/264 KB   
159/264 KB   
163/264 KB   
166/264 KB   
170/264 KB   
171/264 KB   
175/264 KB   
178/264 KB   
182/264 KB   
186/264 KB   
190/264 KB   
194/264 KB   
198/264 KB   
202/264 KB   
202/264 KB   
206/264 KB   
209/264 KB   
213/264 KB   
216/264 KB   
220/264 KB   
224/264 KB   
228/264 KB   
232/264 KB   
236/264 KB   
240/264 KB   
243/264 KB   
245/264 KB   
249/264 KB   
253/264 KB   
257/264 KB   
261/264 KB   
264/264 KB   
             
Downloaded: http://repo.maven.apache.org/maven2/org/jamon/jamon-processor/2.3.4/jamon-processor-2.3.4.jar
(264 KB at 887.5 KB/sec)
[INFO] Translating 10 templates from <https://builds.apache.org/job/HBase-1.2/jdk=latest1.7,label=Hadoop/ws/hbase-server/src/main/jamon>
to <https://builds.apache.org/job/HBase-1.2/jdk=latest1.7,label=Hadoop/ws/hbase-server/target/generated-jamon>
[INFO] 
[INFO] --- maven-antrun-plugin:1.6:run (generate) @ hbase-server ---
[INFO] Executing tasks

main:
    [mkdir] Created dir: <https://builds.apache.org/job/HBase-1.2/jdk=latest1.7,label=Hadoop/ws/hbase-server/target/hbase-webapps>
     [copy] Copying 20 files to <https://builds.apache.org/job/HBase-1.2/jdk=latest1.7,label=Hadoop/ws/hbase-server/target/hbase-webapps>
log4j:WARN No appenders could be found for logger (org.mortbay.log).
log4j:WARN Please initialize the log4j system properly.
log4j:WARN See http://logging.apache.org/log4j/1.2/faq.html#noconfig for more info.
    [mkdir] Created dir: <https://builds.apache.org/job/HBase-1.2/jdk=latest1.7,label=Hadoop/ws/hbase-server/target/hbase-webapps/master/WEB-INF>
    [mkdir] Created dir: <https://builds.apache.org/job/HBase-1.2/jdk=latest1.7,label=Hadoop/ws/hbase-server/target/hbase-webapps/regionserver/WEB-INF>
[INFO] Executed tasks
[INFO] 
[INFO] --- maven-remote-resources-plugin:1.4:process (default) @ hbase-server ---
[INFO] 
[INFO] --- maven-resources-plugin:2.6:resources (default-resources) @ hbase-server ---
[INFO] Using 'UTF-8' encoding to copy filtered resources.
[INFO] Copying 22 resources
[INFO] Copying 3 resources
[INFO] 
[INFO] --- maven-compiler-plugin:2.5.1:compile (default-compile) @ hbase-server ---
[INFO] Compiling 782 source files to <https://builds.apache.org/job/HBase-1.2/jdk=latest1.7,label=Hadoop/ws/hbase-server/target/classes>
[INFO] 
[INFO] --- maven-dependency-plugin:2.1:build-classpath (create-mrapp-generated-classpath)
@ hbase-server ---
[INFO] Wrote classpath file '<https://builds.apache.org/job/HBase-1.2/jdk=latest1.7,label=Hadoop/ws/hbase-server/target/test-classes/mrapp-generated-classpath'.>
[INFO] 
[INFO] --- maven-resources-plugin:2.6:testResources (default-testResources) @ hbase-server
---
[INFO] Using 'UTF-8' encoding to copy filtered resources.
[INFO] Copying 12 resources
[INFO] Copying 3 resources
[INFO] 
[INFO] --- maven-compiler-plugin:2.5.1:testCompile (default-testCompile) @ hbase-server ---
[INFO] Compiling 724 source files to <https://builds.apache.org/job/HBase-1.2/jdk=latest1.7,label=Hadoop/ws/hbase-server/target/test-classes>
[INFO] -------------------------------------------------------------
[ERROR] COMPILATION ERROR : 
[INFO] -------------------------------------------------------------
[ERROR] <https://builds.apache.org/job/HBase-1.2/jdk=latest1.7,label=Hadoop/ws/hbase-server/src/test/java/org/apache/hadoop/hbase/master/TestAssignmentManager.java>:[1631,52]
error: cannot find symbol
[ERROR]   symbol:   variable SERVERNAME_B
  location: class TestAssignmentManager
<https://builds.apache.org/job/HBase-1.2/jdk=latest1.7,label=Hadoop/ws/hbase-server/src/test/java/org/apache/hadoop/hbase/master/TestAssignmentManager.java>:[1631,66]
error: cannot find symbol
[ERROR]   symbol:   variable SERVERNAME_B
  location: class TestAssignmentManager
<https://builds.apache.org/job/HBase-1.2/jdk=latest1.7,label=Hadoop/ws/hbase-server/src/test/java/org/apache/hadoop/hbase/master/TestAssignmentManager.java>:[1634,63]
error: cannot find symbol
[ERROR]   symbol:   variable SERVERNAME_B
  location: class TestAssignmentManager
<https://builds.apache.org/job/HBase-1.2/jdk=latest1.7,label=Hadoop/ws/hbase-server/src/test/java/org/apache/hadoop/hbase/master/TestAssignmentManager.java>:[1643,17]
error: cannot find symbol
[ERROR]   symbol:   variable SERVERNAME_B
  location: class TestAssignmentManager
<https://builds.apache.org/job/HBase-1.2/jdk=latest1.7,label=Hadoop/ws/hbase-server/src/test/java/org/apache/hadoop/hbase/master/TestAssignmentManager.java>:[1668,52]
error: cannot find symbol
[ERROR]   symbol:   variable SERVERNAME_B
  location: class TestAssignmentManager
<https://builds.apache.org/job/HBase-1.2/jdk=latest1.7,label=Hadoop/ws/hbase-server/src/test/java/org/apache/hadoop/hbase/master/TestAssignmentManager.java>:[1668,66]
error: cannot find symbol
[ERROR]   symbol:   variable SERVERNAME_B
  location: class TestAssignmentManager
<https://builds.apache.org/job/HBase-1.2/jdk=latest1.7,label=Hadoop/ws/hbase-server/src/test/java/org/apache/hadoop/hbase/master/TestAssignmentManager.java>:[1671,51]
error: cannot find symbol
[ERROR]   symbol:   variable SERVERNAME_B
  location: class TestAssignmentManager
<https://builds.apache.org/job/HBase-1.2/jdk=latest1.7,label=Hadoop/ws/hbase-server/src/test/java/org/apache/hadoop/hbase/master/TestAssignmentManager.java>:[1682,39]
error: cannot find symbol
[INFO] 8 errors 
[INFO] -------------------------------------------------------------
[INFO] ------------------------------------------------------------------------
[INFO] Reactor Summary:
[INFO] 
[INFO] HBase ............................................. SUCCESS [56.554s]
[INFO] HBase - Checkstyle ................................ SUCCESS [5.332s]
[INFO] HBase - Annotations ............................... SUCCESS [0.987s]
[INFO] HBase - Protocol .................................. SUCCESS [16.308s]
[INFO] HBase - Common .................................... SUCCESS [2:27.730s]
[INFO] HBase - Procedure ................................. SUCCESS [1:51.370s]
[INFO] HBase - Client .................................... SUCCESS [1:29.751s]
[INFO] HBase - Hadoop Compatibility ...................... SUCCESS [8.809s]
[INFO] HBase - Hadoop Two Compatibility .................. SUCCESS [11.325s]
[INFO] HBase - Prefix Tree ............................... SUCCESS [9.342s]
[INFO] HBase - Server .................................... FAILURE [50.729s]
[INFO] HBase - Testing Util .............................. SKIPPED
[INFO] HBase - Thrift .................................... SKIPPED
[INFO] HBase - Rest ...................................... SKIPPED
[INFO] HBase - Shell ..................................... SKIPPED
[INFO] HBase - Integration Tests ......................... SKIPPED
[INFO] HBase - Examples .................................. SKIPPED
[INFO] HBase - Assembly .................................. SKIPPED
[INFO] HBase - Shaded .................................... SKIPPED
[INFO] HBase - Shaded - Client ........................... SKIPPED
[INFO] HBase - Shaded - Server ........................... SKIPPED
[INFO] ------------------------------------------------------------------------
[INFO] BUILD FAILURE
[INFO] ------------------------------------------------------------------------
[INFO] Total time: 8:45.933s
[INFO] Finished at: Thu Jul 02 05:05:37 UTC 2015
[INFO] Final Memory: 101M/935M
[INFO] ------------------------------------------------------------------------
[ERROR] Failed to execute goal org.apache.maven.plugins:maven-compiler-plugin:2.5.1:testCompile
(default-testCompile) on project hbase-server: Compilation failure: Compilation failure:
[ERROR] <https://builds.apache.org/job/HBase-1.2/jdk=latest1.7,label=Hadoop/ws/hbase-server/src/test/java/org/apache/hadoop/hbase/master/TestAssignmentManager.java>:[1631,52]
error: cannot find symbol
[ERROR] symbol:   variable SERVERNAME_B
[ERROR] location: class TestAssignmentManager
[ERROR] <https://builds.apache.org/job/HBase-1.2/jdk=latest1.7,label=Hadoop/ws/hbase-server/src/test/java/org/apache/hadoop/hbase/master/TestAssignmentManager.java>:[1631,66]
error: cannot find symbol
[ERROR] symbol:   variable SERVERNAME_B
[ERROR] location: class TestAssignmentManager
[ERROR] <https://builds.apache.org/job/HBase-1.2/jdk=latest1.7,label=Hadoop/ws/hbase-server/src/test/java/org/apache/hadoop/hbase/master/TestAssignmentManager.java>:[1634,63]
error: cannot find symbol
[ERROR] symbol:   variable SERVERNAME_B
[ERROR] location: class TestAssignmentManager
[ERROR] <https://builds.apache.org/job/HBase-1.2/jdk=latest1.7,label=Hadoop/ws/hbase-server/src/test/java/org/apache/hadoop/hbase/master/TestAssignmentManager.java>:[1643,17]
error: cannot find symbol
[ERROR] symbol:   variable SERVERNAME_B
[ERROR] location: class TestAssignmentManager
[ERROR] <https://builds.apache.org/job/HBase-1.2/jdk=latest1.7,label=Hadoop/ws/hbase-server/src/test/java/org/apache/hadoop/hbase/master/TestAssignmentManager.java>:[1668,52]
error: cannot find symbol
[ERROR] symbol:   variable SERVERNAME_B
[ERROR] location: class TestAssignmentManager
[ERROR] <https://builds.apache.org/job/HBase-1.2/jdk=latest1.7,label=Hadoop/ws/hbase-server/src/test/java/org/apache/hadoop/hbase/master/TestAssignmentManager.java>:[1668,66]
error: cannot find symbol
[ERROR] symbol:   variable SERVERNAME_B
[ERROR] location: class TestAssignmentManager
[ERROR] <https://builds.apache.org/job/HBase-1.2/jdk=latest1.7,label=Hadoop/ws/hbase-server/src/test/java/org/apache/hadoop/hbase/master/TestAssignmentManager.java>:[1671,51]
error: cannot find symbol
[ERROR] symbol:   variable SERVERNAME_B
[ERROR] location: class TestAssignmentManager
[ERROR] <https://builds.apache.org/job/HBase-1.2/jdk=latest1.7,label=Hadoop/ws/hbase-server/src/test/java/org/apache/hadoop/hbase/master/TestAssignmentManager.java>:[1682,39]
error: cannot find symbol
[ERROR] -> [Help 1]
[ERROR] 
[ERROR] To see the full stack trace of the errors, re-run Maven with the -e switch.
[ERROR] Re-run Maven using the -X switch to enable full debug logging.
[ERROR] 
[ERROR] For more information about the errors and possible solutions, please read the following
articles:
[ERROR] [Help 1] http://cwiki.apache.org/confluence/display/MAVEN/MojoFailureException
[ERROR] 
[ERROR] After correcting the problems, you can resume the build with the command
[ERROR]   mvn <goals> -rf :hbase-server
Build step 'Invoke top-level Maven targets' marked build as failure
Performing Post build task...
Match found for :.* : True
Logical operation result is TRUE
Running script  :   ZOMBIE_TESTS_COUNT=`jps | grep surefirebooter | wc -l`
  if [[ $ZOMBIE_TESTS_COUNT != 0 ]] ; then
    #It seems sometimes the tests are not dying immediately. Let's give them 10s
    echo "Suspicious java process found - waiting 10s to see if there are just slow to stop"
    sleep 10   
    ZOMBIE_TESTS_COUNT=`jps | grep surefirebooter | wc -l`
    if [[ $ZOMBIE_TESTS_COUNT != 0 ]] ; then
      echo "There are $ZOMBIE_TESTS_COUNT zombie tests, they should have been killed by surefire
but survived"
      echo "************ BEGIN zombies jstack extract"
      ZB_STACK=`jps | grep surefirebooter | cut -d ' ' -f 1 | xargs -n 1 jstack | grep ".test"
| grep "\.java"`
      jps | grep surefirebooter | cut -d ' ' -f 1 | xargs -n 1 jstack
      echo "************ END  zombies jstack extract"
      JIRA_COMMENT="$JIRA_COMMENT

     {color:red}-1 core zombie tests{color}.  There are ${ZOMBIE_TESTS_COUNT} zombie test(s):
${ZB_STACK}"
      BAD=1
      jps | grep surefirebooter | cut -d ' ' -f 1 | xargs kill -9
    else
      echo "We're ok: there is no zombie test, but some tests took some time to stop"
    fi
  else
    echo "We're ok: there is no zombie test"
  fi
[Hadoop] $ /bin/bash -xe /tmp/hudson6837036026082309816.sh
++ jps
++ grep surefirebooter
++ wc -l
+ ZOMBIE_TESTS_COUNT=0
+ [[ 0 != 0 ]]
+ echo 'We'\''re ok: there is no zombie test'
We're ok: there is no zombie test
POST BUILD TASK : SUCCESS
END OF POST BUILD TASK : 0
Archiving artifacts
Sending artifact delta relative to HBase-1.2 » latest1.7,Hadoop #45
Archived 313 artifacts
Archive block size is 32768
Received 2 blocks and 1333162 bytes
Compression is 4.7%
Took 1 min 11 sec

Mime
View raw message