hbase-builds mailing list archives

Site index · List index
Message view « Date » · « Thread »
Top « Date » · « Thread »
From Apache Jenkins Server <jenk...@builds.apache.org>
Subject Build failed in Jenkins: HBase-0.98-on-Hadoop-1.1 #1022
Date Thu, 06 Aug 2015 23:09:53 GMT
See <https://builds.apache.org/job/HBase-0.98-on-Hadoop-1.1/1022/changes>

Changes:

[ndimiduk] HBASE-13865 Increase the default value for hbase.hregion.memstore.block.multipler
from 2 to 4 (part 2)

------------------------------------------
[...truncated 1662 lines...]
Running org.apache.hadoop.hbase.mapred.TestTableSnapshotInputFormat
Tests run: 6, Failures: 0, Errors: 0, Skipped: 0, Time elapsed: 302.375 sec - in org.apache.hadoop.hbase.mapred.TestTableSnapshotInputFormat
Running org.apache.hadoop.hbase.mapred.TestMultiTableSnapshotInputFormat
Tests run: 4, Failures: 0, Errors: 0, Skipped: 0, Time elapsed: 203.872 sec - in org.apache.hadoop.hbase.mapred.TestMultiTableSnapshotInputFormat
Running org.apache.hadoop.hbase.mapred.TestTableMapReduce
Tests run: 2, Failures: 0, Errors: 0, Skipped: 0, Time elapsed: 84.381 sec - in org.apache.hadoop.hbase.mapred.TestTableMapReduce
Running org.apache.hadoop.hbase.mapred.TestTableInputFormat
Tests run: 6, Failures: 0, Errors: 0, Skipped: 0, Time elapsed: 78.197 sec - in org.apache.hadoop.hbase.mapred.TestTableInputFormat
Running org.apache.hadoop.hbase.zookeeper.TestZKTable
Tests run: 1, Failures: 0, Errors: 0, Skipped: 0, Time elapsed: 0.464 sec - in org.apache.hadoop.hbase.zookeeper.TestZKTable
Running org.apache.hadoop.hbase.zookeeper.TestHQuorumPeer
Tests run: 3, Failures: 0, Errors: 0, Skipped: 0, Time elapsed: 0.613 sec - in org.apache.hadoop.hbase.zookeeper.TestHQuorumPeer
Running org.apache.hadoop.hbase.zookeeper.TestZooKeeperNodeTracker
Tests run: 3, Failures: 0, Errors: 0, Skipped: 0, Time elapsed: 0.572 sec - in org.apache.hadoop.hbase.zookeeper.TestZooKeeperNodeTracker
Running org.apache.hadoop.hbase.zookeeper.lock.TestZKInterProcessReadWriteLock
Tests run: 6, Failures: 0, Errors: 0, Skipped: 0, Time elapsed: 24.404 sec - in org.apache.hadoop.hbase.zookeeper.lock.TestZKInterProcessReadWriteLock
Running org.apache.hadoop.hbase.zookeeper.TestZooKeeperACL
Tests run: 6, Failures: 0, Errors: 0, Skipped: 0, Time elapsed: 0.214 sec - in org.apache.hadoop.hbase.zookeeper.TestZooKeeperACL
Running org.apache.hadoop.hbase.zookeeper.TestZKMulti
Tests run: 12, Failures: 0, Errors: 0, Skipped: 0, Time elapsed: 1.331 sec - in org.apache.hadoop.hbase.zookeeper.TestZKMulti
Running org.apache.hadoop.hbase.zookeeper.TestRecoverableZooKeeper
Tests run: 1, Failures: 0, Errors: 0, Skipped: 0, Time elapsed: 1.238 sec - in org.apache.hadoop.hbase.zookeeper.TestRecoverableZooKeeper
Running org.apache.hadoop.hbase.zookeeper.TestZKLeaderManager
Tests run: 1, Failures: 0, Errors: 0, Skipped: 0, Time elapsed: 0.114 sec - in org.apache.hadoop.hbase.zookeeper.TestZKLeaderManager
Running org.apache.hadoop.hbase.client.TestHTablePool$TestHTableThreadLocalPool
Tests run: 9, Failures: 0, Errors: 0, Skipped: 0, Time elapsed: 4.868 sec - in org.apache.hadoop.hbase.client.TestHTablePool$TestHTableThreadLocalPool
Running org.apache.hadoop.hbase.client.TestScannersFromClientSide
Tests run: 7, Failures: 0, Errors: 0, Skipped: 0, Time elapsed: 10.66 sec - in org.apache.hadoop.hbase.client.TestScannersFromClientSide
Running org.apache.hadoop.hbase.client.TestHCM
Tests run: 15, Failures: 0, Errors: 0, Skipped: 3, Time elapsed: 47.29 sec - in org.apache.hadoop.hbase.client.TestHCM
Running org.apache.hadoop.hbase.client.TestClientOperationInterrupt
Tests run: 1, Failures: 0, Errors: 0, Skipped: 0, Time elapsed: 55.494 sec - in org.apache.hadoop.hbase.client.TestClientOperationInterrupt
Running org.apache.hadoop.hbase.client.TestRestoreSnapshotFromClient
Tests run: 5, Failures: 0, Errors: 0, Skipped: 0, Time elapsed: 84.878 sec - in org.apache.hadoop.hbase.client.TestRestoreSnapshotFromClient
Running org.apache.hadoop.hbase.client.TestMultipleTimestamps
Tests run: 8, Failures: 0, Errors: 0, Skipped: 0, Time elapsed: 16.796 sec - in org.apache.hadoop.hbase.client.TestMultipleTimestamps
Running org.apache.hadoop.hbase.client.TestFromClientSide3
Tests run: 9, Failures: 0, Errors: 0, Skipped: 0, Time elapsed: 52.66 sec - in org.apache.hadoop.hbase.client.TestFromClientSide3
Running org.apache.hadoop.hbase.client.TestSnapshotMetadata
Tests run: 4, Failures: 0, Errors: 0, Skipped: 0, Time elapsed: 23.622 sec - in org.apache.hadoop.hbase.client.TestSnapshotMetadata
Running org.apache.hadoop.hbase.client.TestClientTimeouts
Tests run: 1, Failures: 0, Errors: 0, Skipped: 0, Time elapsed: 4.159 sec - in org.apache.hadoop.hbase.client.TestClientTimeouts
Running org.apache.hadoop.hbase.client.TestResultSizeEstimation
Tests run: 2, Failures: 0, Errors: 0, Skipped: 0, Time elapsed: 5.44 sec - in org.apache.hadoop.hbase.client.TestResultSizeEstimation
Running org.apache.hadoop.hbase.client.TestHTablePool$TestHTableReusablePool
Tests run: 9, Failures: 0, Errors: 0, Skipped: 0, Time elapsed: 12.155 sec - in org.apache.hadoop.hbase.client.TestHTablePool$TestHTableReusablePool
Running org.apache.hadoop.hbase.client.TestHTablePool$TestHTableThreadLocalPool
Tests run: 9, Failures: 0, Errors: 0, Skipped: 0, Time elapsed: 4.087 sec - in org.apache.hadoop.hbase.client.TestHTablePool$TestHTableThreadLocalPool
Running org.apache.hadoop.hbase.client.TestCheckAndMutate
Tests run: 1, Failures: 0, Errors: 0, Skipped: 0, Time elapsed: 4.397 sec - in org.apache.hadoop.hbase.client.TestCheckAndMutate
Running org.apache.hadoop.hbase.client.TestPutWithDelete
Tests run: 1, Failures: 0, Errors: 0, Skipped: 0, Time elapsed: 3.486 sec - in org.apache.hadoop.hbase.client.TestPutWithDelete
Running org.apache.hadoop.hbase.client.TestSizeFailures
Tests run: 2, Failures: 0, Errors: 0, Skipped: 0, Time elapsed: 30.844 sec - in org.apache.hadoop.hbase.client.TestSizeFailures
Running org.apache.hadoop.hbase.client.TestMultiParallel
Tests run: 12, Failures: 0, Errors: 0, Skipped: 0, Time elapsed: 19.705 sec - in org.apache.hadoop.hbase.client.TestMultiParallel
Running org.apache.hadoop.hbase.client.TestTableSnapshotScanner
Tests run: 3, Failures: 0, Errors: 0, Skipped: 0, Time elapsed: 70.614 sec - in org.apache.hadoop.hbase.client.TestTableSnapshotScanner
Running org.apache.hadoop.hbase.client.TestHTableMultiplexer
Tests run: 1, Failures: 0, Errors: 0, Skipped: 0, Time elapsed: 9.628 sec - in org.apache.hadoop.hbase.client.TestHTableMultiplexer
Running org.apache.hadoop.hbase.client.TestHTablePool$TestHTableReusablePool
Tests run: 9, Failures: 0, Errors: 0, Skipped: 0, Time elapsed: 5.192 sec - in org.apache.hadoop.hbase.client.TestHTablePool$TestHTableReusablePool
Running org.apache.hadoop.hbase.client.TestFromClientSideNoCodec
Tests run: 2, Failures: 0, Errors: 0, Skipped: 0, Time elapsed: 3.906 sec - in org.apache.hadoop.hbase.client.TestFromClientSideNoCodec
Running org.apache.hadoop.hbase.client.TestSnapshotFromClient
Tests run: 9, Failures: 0, Errors: 0, Skipped: 0, Time elapsed: 39.968 sec - in org.apache.hadoop.hbase.client.TestSnapshotFromClient
Running org.apache.hadoop.hbase.client.TestHTableUtil
Tests run: 2, Failures: 0, Errors: 0, Skipped: 0, Time elapsed: 5.527 sec - in org.apache.hadoop.hbase.client.TestHTableUtil
Running org.apache.hadoop.hbase.client.TestScannerTimeout
Tests run: 4, Failures: 0, Errors: 0, Skipped: 0, Time elapsed: 43.139 sec - in org.apache.hadoop.hbase.client.TestScannerTimeout
Running org.apache.hadoop.hbase.client.TestAdmin2
Tests run: 24, Failures: 0, Errors: 0, Skipped: 0, Time elapsed: 65.936 sec - in org.apache.hadoop.hbase.client.TestAdmin2
Running org.apache.hadoop.hbase.client.TestClientScannerRPCTimeout
Tests run: 1, Failures: 0, Errors: 0, Skipped: 0, Time elapsed: 21.952 sec - in org.apache.hadoop.hbase.client.TestClientScannerRPCTimeout
Running org.apache.hadoop.hbase.client.TestCloneSnapshotFromClient
Tests run: 5, Failures: 0, Errors: 0, Skipped: 0, Time elapsed: 62.676 sec - in org.apache.hadoop.hbase.client.TestCloneSnapshotFromClient
Running org.apache.hadoop.hbase.client.TestClientPushback
Tests run: 1, Failures: 0, Errors: 0, Skipped: 0, Time elapsed: 2.927 sec - in org.apache.hadoop.hbase.client.TestClientPushback
Running org.apache.hadoop.hbase.client.TestRpcControllerFactory
Tests run: 1, Failures: 0, Errors: 0, Skipped: 0, Time elapsed: 3.632 sec - in org.apache.hadoop.hbase.client.TestRpcControllerFactory
Running org.apache.hadoop.hbase.client.TestFromClientSide
Tests run: 81, Failures: 0, Errors: 0, Skipped: 4, Time elapsed: 136.909 sec - in org.apache.hadoop.hbase.client.TestFromClientSide
Running org.apache.hadoop.hbase.client.TestSnapshotCloneIndependence
Tests run: 8, Failures: 0, Errors: 0, Skipped: 0, Time elapsed: 72.484 sec - in org.apache.hadoop.hbase.client.TestSnapshotCloneIndependence
Running org.apache.hadoop.hbase.client.TestTimestampsFilter
Tests run: 3, Failures: 0, Errors: 0, Skipped: 0, Time elapsed: 11.464 sec - in org.apache.hadoop.hbase.client.TestTimestampsFilter
Running org.apache.hadoop.hbase.client.TestHTableMultiplexerFlushCache
Tests run: 1, Failures: 0, Errors: 0, Skipped: 0, Time elapsed: 6.774 sec - in org.apache.hadoop.hbase.client.TestHTableMultiplexerFlushCache
Running org.apache.hadoop.hbase.client.replication.TestReplicationAdminWithClusters
Tests run: 8, Failures: 0, Errors: 0, Skipped: 0, Time elapsed: 19.632 sec - in org.apache.hadoop.hbase.client.replication.TestReplicationAdminWithClusters
Running org.apache.hadoop.hbase.client.replication.TestReplicationAdmin
Tests run: 3, Failures: 0, Errors: 0, Skipped: 0, Time elapsed: 0.237 sec - in org.apache.hadoop.hbase.client.replication.TestReplicationAdmin
Running org.apache.hadoop.hbase.client.TestAdmin1
Killed
Running org.apache.hadoop.hbase.client.TestMetaScanner
Tests run: 2, Failures: 0, Errors: 0, Skipped: 0, Time elapsed: 51.758 sec - in org.apache.hadoop.hbase.client.TestMetaScanner
Running org.apache.hadoop.hbase.client.TestFromClientSideWithCoprocessor
Tests run: 81, Failures: 0, Errors: 0, Skipped: 4, Time elapsed: 138.272 sec - in org.apache.hadoop.hbase.client.TestFromClientSideWithCoprocessor
Running org.apache.hadoop.hbase.TestNamespace
Tests run: 9, Failures: 0, Errors: 0, Skipped: 1, Time elapsed: 10.141 sec - in org.apache.hadoop.hbase.TestNamespace
Running org.apache.hadoop.hbase.TestMultiVersions
Tests run: 3, Failures: 0, Errors: 0, Skipped: 0, Time elapsed: 10.407 sec - in org.apache.hadoop.hbase.TestMultiVersions
Running org.apache.hadoop.hbase.TestGlobalMemStoreSize
Tests run: 1, Failures: 0, Errors: 0, Skipped: 0, Time elapsed: 15.595 sec - in org.apache.hadoop.hbase.TestGlobalMemStoreSize
Running org.apache.hadoop.hbase.procedure.TestZKProcedure
Tests run: 4, Failures: 0, Errors: 0, Skipped: 0, Time elapsed: 1.908 sec - in org.apache.hadoop.hbase.procedure.TestZKProcedure
Running org.apache.hadoop.hbase.procedure.TestZKProcedureControllers
Tests run: 4, Failures: 0, Errors: 0, Skipped: 0, Time elapsed: 1.454 sec - in org.apache.hadoop.hbase.procedure.TestZKProcedureControllers
Running org.apache.hadoop.hbase.migration.TestUpgradeTo96
Tests run: 5, Failures: 0, Errors: 0, Skipped: 0, Time elapsed: 5.648 sec - in org.apache.hadoop.hbase.migration.TestUpgradeTo96
Running org.apache.hadoop.hbase.migration.TestNamespaceUpgrade
Tests run: 5, Failures: 0, Errors: 0, Skipped: 0, Time elapsed: 41.609 sec - in org.apache.hadoop.hbase.migration.TestNamespaceUpgrade
Running org.apache.hadoop.hbase.snapshot.TestFlushSnapshotFromClient
Tests run: 9, Failures: 0, Errors: 0, Skipped: 0, Time elapsed: 61.678 sec - in org.apache.hadoop.hbase.snapshot.TestFlushSnapshotFromClient
Running org.apache.hadoop.hbase.snapshot.TestSnapshotDescriptionUtils
Tests run: 2, Failures: 0, Errors: 0, Skipped: 0, Time elapsed: 0.136 sec - in org.apache.hadoop.hbase.snapshot.TestSnapshotDescriptionUtils
Running org.apache.hadoop.hbase.snapshot.TestRestoreFlushSnapshotFromClient
Tests run: 5, Failures: 0, Errors: 0, Skipped: 0, Time elapsed: 67.876 sec - in org.apache.hadoop.hbase.snapshot.TestRestoreFlushSnapshotFromClient
Running org.apache.hadoop.hbase.snapshot.TestSecureExportSnapshot
Killed
Running org.apache.hadoop.hbase.snapshot.TestExportSnapshot
Tests run: 9, Failures: 0, Errors: 0, Skipped: 0, Time elapsed: 284.431 sec - in org.apache.hadoop.hbase.snapshot.TestExportSnapshot
Running org.apache.hadoop.hbase.snapshot.TestSnapshotClientRetries
Tests run: 2, Failures: 0, Errors: 0, Skipped: 0, Time elapsed: 20.392 sec - in org.apache.hadoop.hbase.snapshot.TestSnapshotClientRetries
Running org.apache.hadoop.hbase.ipc.TestDelayedRpc
Tests run: 4, Failures: 0, Errors: 0, Skipped: 0, Time elapsed: 3.362 sec - in org.apache.hadoop.hbase.ipc.TestDelayedRpc
Running org.apache.hadoop.hbase.ipc.TestHBaseClient
Tests run: 1, Failures: 0, Errors: 0, Skipped: 0, Time elapsed: 0.278 sec - in org.apache.hadoop.hbase.ipc.TestHBaseClient
Running org.apache.hadoop.hbase.ipc.TestProtoBufRpc
Tests run: 1, Failures: 0, Errors: 0, Skipped: 0, Time elapsed: 1.439 sec - in org.apache.hadoop.hbase.ipc.TestProtoBufRpc
Running org.apache.hadoop.hbase.security.token.TestTokenAuthentication
Tests run: 3, Failures: 0, Errors: 0, Skipped: 0, Time elapsed: 0.481 sec - in org.apache.hadoop.hbase.security.token.TestTokenAuthentication
Running org.apache.hadoop.hbase.security.token.TestZKSecretWatcher
Tests run: 1, Failures: 0, Errors: 0, Skipped: 0, Time elapsed: 13.209 sec - in org.apache.hadoop.hbase.security.token.TestZKSecretWatcher
Running org.apache.hadoop.hbase.security.access.TestScanEarlyTermination
Tests run: 1, Failures: 0, Errors: 0, Skipped: 0, Time elapsed: 4.773 sec - in org.apache.hadoop.hbase.security.access.TestScanEarlyTermination
Running org.apache.hadoop.hbase.security.access.TestZKPermissionsWatcher
Tests run: 1, Failures: 0, Errors: 0, Skipped: 0, Time elapsed: 4.995 sec - in org.apache.hadoop.hbase.security.access.TestZKPermissionsWatcher
Running org.apache.hadoop.hbase.security.access.TestNamespaceCommands
Tests run: 5, Failures: 0, Errors: 0, Skipped: 0, Time elapsed: 6.538 sec - in org.apache.hadoop.hbase.security.access.TestNamespaceCommands
Running org.apache.hadoop.hbase.security.access.TestTablePermissions
Tests run: 7, Failures: 0, Errors: 0, Skipped: 0, Time elapsed: 14.511 sec - in org.apache.hadoop.hbase.security.access.TestTablePermissions
Running org.apache.hadoop.hbase.security.access.TestAccessController
Tests run: 51, Failures: 0, Errors: 0, Skipped: 0, Time elapsed: 57.297 sec - in org.apache.hadoop.hbase.security.access.TestAccessController
Running org.apache.hadoop.hbase.security.access.TestAccessControlFilter

Results :


Tests in error: 
  TestLogRolling.testLogRollOnPipelineRestart:548 ยป FileNotFound java.io.FileNot...


Tests run: 1822, Failures: 0, Errors: 1, Skipped: 24

[INFO] ------------------------------------------------------------------------
[INFO] Reactor Summary:
[INFO] 
[INFO] Apache HBase ...................................... SUCCESS [3.064s]
[INFO] Apache HBase - Checkstyle ......................... SUCCESS [0.518s]
[INFO] Apache HBase - Resource Bundle .................... SUCCESS [0.166s]
[INFO] Apache HBase - Annotations ........................ SUCCESS [0.870s]
[INFO] Apache HBase - Common ............................. SUCCESS [46.390s]
[INFO] Apache HBase - Protocol ........................... SUCCESS [9.748s]
[INFO] Apache HBase - Client ............................. SUCCESS [51.701s]
[INFO] Apache HBase - Hadoop Compatibility ............... SUCCESS [7.149s]
[INFO] HBase - Hadoop One Compatibility .................. SUCCESS [5.964s]
[INFO] Apache HBase - Prefix Tree ........................ SUCCESS [8.477s]
[INFO] Apache HBase - Server ............................. FAILURE [4:22:06.111s]
[INFO] Apache HBase - Testing Util ....................... SKIPPED
[INFO] Apache HBase - Thrift ............................. SKIPPED
[INFO] Apache HBase - Rest ............................... SKIPPED
[INFO] Apache HBase - Shell .............................. SKIPPED
[INFO] Apache HBase - Integration Tests .................. SKIPPED
[INFO] Apache HBase - Examples ........................... SKIPPED
[INFO] Apache HBase - Assembly ........................... SKIPPED
[INFO] ------------------------------------------------------------------------
[INFO] BUILD FAILURE
[INFO] ------------------------------------------------------------------------
[INFO] Total time: 4:24:21.625s
[INFO] Finished at: Thu Aug 06 23:09:04 UTC 2015
[INFO] Final Memory: 244M/758M
[INFO] ------------------------------------------------------------------------
[ERROR] Failed to execute goal org.apache.maven.plugins:maven-surefire-plugin:2.18:test (secondPartTestsExecution)
on project hbase-server: ExecutionException: java.lang.RuntimeException: The forked VM terminated
without properly saying goodbye. VM crash or System.exit called?
[ERROR] Command was /bin/sh -c cd <https://builds.apache.org/job/HBase-0.98-on-Hadoop-1.1/ws/hbase-server>
&& /home/jenkins/tools/java/jdk1.7.0_25-32/jre/bin/java -enableassertions -XX:MaxDirectMemorySize=1G
-Xmx2800m -XX:MaxPermSize=256m -Djava.security.egd=file:/dev/./urandom -Djava.net.preferIPv4Stack=true
-Djava.awt.headless=true -jar <https://builds.apache.org/job/HBase-0.98-on-Hadoop-1.1/ws/hbase-server/target/surefire/surefirebooter6519410891456982262.jar>
<https://builds.apache.org/job/HBase-0.98-on-Hadoop-1.1/ws/hbase-server/target/surefire/surefire8545330421973325039tmp>
<https://builds.apache.org/job/HBase-0.98-on-Hadoop-1.1/ws/hbase-server/target/surefire/surefire_8696985623620775087742tmp>
[ERROR] -> [Help 1]
[ERROR] 
[ERROR] To see the full stack trace of the errors, re-run Maven with the -e switch.
[ERROR] Re-run Maven using the -X switch to enable full debug logging.
[ERROR] 
[ERROR] For more information about the errors and possible solutions, please read the following
articles:
[ERROR] [Help 1] http://cwiki.apache.org/confluence/display/MAVEN/MojoFailureException
[ERROR] 
[ERROR] After correcting the problems, you can resume the build with the command
[ERROR]   mvn <goals> -rf :hbase-server
Build step 'Invoke top-level Maven targets' marked build as failure
Performing Post build task...
Match found for :.* : True
Logical operation result is TRUE
Running script  :   ZOMBIE_TESTS_COUNT=`jps | grep surefirebooter | wc -l`
  if [[ $ZOMBIE_TESTS_COUNT != 0 ]] ; then
    #It seems sometimes the tests are not dying immediately. Let's give them 10s
    echo "Suspicious java process found - waiting 10s to see if there are just slow to stop"
    sleep 10
    ZOMBIE_TESTS_COUNT=`jps | grep surefirebooter | wc -l`
    if [[ $ZOMBIE_TESTS_COUNT != 0 ]] ; then
      echo "There are $ZOMBIE_TESTS_COUNT zombie tests, they should have been killed by surefire
but survived"
      echo "************ BEGIN zombies jstack extract"
      ZB_STACK=`jps | grep surefirebooter | cut -d ' ' -f 1 | xargs -n 1 jstack | grep ".test"
| grep "\.java"`
      jps | grep surefirebooter | cut -d ' ' -f 1 | xargs -n 1 jstack
      echo "************ END  zombies jstack extract"
      JIRA_COMMENT="$JIRA_COMMENT

     {color:red}-1 core zombie tests{color}.  There are ${ZOMBIE_TESTS_COUNT} zombie test(s):
${ZB_STACK}"
      BAD=1
      jps | grep surefirebooter | cut -d ' ' -f 1 | xargs kill -9
    else
      echo "We're ok: there is no zombie test, but some tests took some time to stop"
    fi
  else
    echo "We're ok: there is no zombie test"
  fi
[HBase-0.98-on-Hadoop-1.1] $ /bin/bash -xe /tmp/hudson1558700291064699566.sh
++ jps
++ grep surefirebooter
++ wc -l
+ ZOMBIE_TESTS_COUNT=1
+ [[ 1 != 0 ]]
+ echo 'Suspicious java process found - waiting 10s to see if there are just slow to stop'
Suspicious java process found - waiting 10s to see if there are just slow to stop
+ sleep 10
++ jps
++ grep surefirebooter
++ wc -l
+ ZOMBIE_TESTS_COUNT=0
+ [[ 0 != 0 ]]
+ echo 'We'\''re ok: there is no zombie test, but some tests took some time to stop'
We're ok: there is no zombie test, but some tests took some time to stop
POST BUILD TASK : SUCCESS
END OF POST BUILD TASK : 0
Archiving artifacts
Sending artifact delta relative to HBase-0.98-on-Hadoop-1.1 #978
Archived 1587 artifacts
Archive block size is 32768
Received 4 blocks and 255251569 bytes
Compression is 0.1%
Took 1 min 8 sec
Recording test results
Updating HBASE-13865

Mime
View raw message