hbase-builds mailing list archives

Site index · List index
Message view « Date » · « Thread »
Top « Date » · « Thread »
From Apache Jenkins Server <jenk...@builds.apache.org>
Subject Build failed in Jenkins: HBase-1.0 #1003
Date Thu, 06 Aug 2015 15:04:39 GMT
See <https://builds.apache.org/job/HBase-1.0/1003/changes>

Changes:

[tedyu] HBASE-14021 Quota table has a wrong description on the UI (Ashish Singhi)

------------------------------------------
[...truncated 761 lines...]
[INFO] Installing <https://builds.apache.org/job/HBase-1.0/ws/hbase-hadoop2-compat/target/hbase-hadoop2-compat-1.0.2-sources.jar>
to /home/jenkins/.m2/repository/org/apache/hbase/hbase-hadoop2-compat/1.0.2/hbase-hadoop2-compat-1.0.2-sources.jar
[INFO] Installing <https://builds.apache.org/job/HBase-1.0/ws/hbase-hadoop2-compat/target/hbase-hadoop2-compat-1.0.2-tests.jar>
to /home/jenkins/.m2/repository/org/apache/hbase/hbase-hadoop2-compat/1.0.2/hbase-hadoop2-compat-1.0.2-tests.jar
[INFO]                                                                         
[INFO] ------------------------------------------------------------------------
[INFO] Building Apache HBase - Prefix Tree 1.0.2
[INFO] ------------------------------------------------------------------------
[INFO] 
[INFO] --- maven-enforcer-plugin:1.0.1:enforce (enforce) @ hbase-prefix-tree ---
[INFO] 
[INFO] --- buildnumber-maven-plugin:1.3:create-timestamp (default) @ hbase-prefix-tree ---
[INFO] 
[INFO] --- jacoco-maven-plugin:0.6.2.201302030002:prepare-agent (prepare-agent) @ hbase-prefix-tree
---
[INFO] Skipping JaCoCo execution
[INFO] argLine set to 
[INFO] 
[INFO] --- maven-remote-resources-plugin:1.5:process (default) @ hbase-prefix-tree ---
[INFO] 
[INFO] --- maven-resources-plugin:2.6:resources (default-resources) @ hbase-prefix-tree ---
[INFO] Using 'UTF-8' encoding to copy filtered resources.
[INFO] skip non existing resourceDirectory <https://builds.apache.org/job/HBase-1.0/ws/hbase-prefix-tree/src/main/resources>
[INFO] Copying 3 resources
[INFO] 
[INFO] --- maven-compiler-plugin:2.5.1:compile (default-compile) @ hbase-prefix-tree ---
[INFO] Compiling 39 source files to <https://builds.apache.org/job/HBase-1.0/ws/hbase-prefix-tree/target/classes>
[INFO] 
[INFO] --- maven-resources-plugin:2.6:testResources (default-testResources) @ hbase-prefix-tree
---
[INFO] Using 'UTF-8' encoding to copy filtered resources.
[INFO] skip non existing resourceDirectory <https://builds.apache.org/job/HBase-1.0/ws/hbase-prefix-tree/src/test/resources>
[INFO] Copying 3 resources
[INFO] 
[INFO] --- maven-compiler-plugin:2.5.1:testCompile (default-testCompile) @ hbase-prefix-tree
---
[INFO] Compiling 47 source files to <https://builds.apache.org/job/HBase-1.0/ws/hbase-prefix-tree/target/test-classes>
[INFO] 
[INFO] --- maven-surefire-plugin:2.18:test (default-test) @ hbase-prefix-tree ---
[INFO] Surefire report directory: <https://builds.apache.org/job/HBase-1.0/ws/hbase-prefix-tree/target/surefire-reports>
[INFO] Using configured provider org.apache.maven.surefire.junitcore.JUnitCoreProvider
[INFO] parallel='none', perCoreThreadCount=true, threadCount=0, useUnlimitedThreads=false,
threadCountSuites=0, threadCountClasses=0, threadCountMethods=0, parallelOptimized=true

-------------------------------------------------------
 T E S T S
-------------------------------------------------------
Running org.apache.hadoop.hbase.util.bytes.TestByteRange
Tests run: 1, Failures: 0, Errors: 0, Skipped: 0, Time elapsed: 0.006 sec - in org.apache.hadoop.hbase.util.bytes.TestByteRange
Running org.apache.hadoop.hbase.util.vint.TestVLongTool
Tests run: 6, Failures: 0, Errors: 0, Skipped: 0, Time elapsed: 0.065 sec - in org.apache.hadoop.hbase.util.vint.TestVLongTool
Running org.apache.hadoop.hbase.util.vint.TestFIntTool
Tests run: 7, Failures: 0, Errors: 0, Skipped: 0, Time elapsed: 0.006 sec - in org.apache.hadoop.hbase.util.vint.TestFIntTool
Running org.apache.hadoop.hbase.util.vint.TestVIntTool
Tests run: 6, Failures: 0, Errors: 0, Skipped: 0, Time elapsed: 0.046 sec - in org.apache.hadoop.hbase.util.vint.TestVIntTool
Running org.apache.hadoop.hbase.codec.prefixtree.column.TestColumnBuilder
Tests run: 17, Failures: 0, Errors: 0, Skipped: 0, Time elapsed: 0.38 sec - in org.apache.hadoop.hbase.codec.prefixtree.column.TestColumnBuilder
Running org.apache.hadoop.hbase.codec.prefixtree.timestamp.TestTimestampEncoder
Tests run: 12, Failures: 0, Errors: 0, Skipped: 0, Time elapsed: 0.006 sec - in org.apache.hadoop.hbase.codec.prefixtree.timestamp.TestTimestampEncoder
Running org.apache.hadoop.hbase.codec.prefixtree.builder.TestTreeDepth
Tests run: 7, Failures: 0, Errors: 0, Skipped: 0, Time elapsed: 0.07 sec - in org.apache.hadoop.hbase.codec.prefixtree.builder.TestTreeDepth
Running org.apache.hadoop.hbase.codec.prefixtree.builder.TestTokenizer
Tests run: 4, Failures: 0, Errors: 0, Skipped: 0, Time elapsed: 0.005 sec - in org.apache.hadoop.hbase.codec.prefixtree.builder.TestTokenizer
Running org.apache.hadoop.hbase.codec.prefixtree.row.TestRowEncoder
Tests run: 90, Failures: 0, Errors: 0, Skipped: 0, Time elapsed: 0.55 sec - in org.apache.hadoop.hbase.codec.prefixtree.row.TestRowEncoder
Running org.apache.hadoop.hbase.codec.prefixtree.row.TestPrefixTreeSearcher
Tests run: 108, Failures: 0, Errors: 0, Skipped: 0, Time elapsed: 0.767 sec - in org.apache.hadoop.hbase.codec.prefixtree.row.TestPrefixTreeSearcher
Running org.apache.hadoop.hbase.codec.prefixtree.blockmeta.TestBlockMeta
Tests run: 1, Failures: 0, Errors: 0, Skipped: 0, Time elapsed: 0.005 sec - in org.apache.hadoop.hbase.codec.prefixtree.blockmeta.TestBlockMeta
Running org.apache.hadoop.hbase.codec.keyvalue.TestKeyValueTool
Tests run: 18, Failures: 0, Errors: 0, Skipped: 0, Time elapsed: 0.026 sec - in org.apache.hadoop.hbase.codec.keyvalue.TestKeyValueTool

Results :




Tests run: 277, Failures: 0, Errors: 0, Skipped: 0

[INFO] 
[INFO] --- maven-surefire-plugin:2.18:test (secondPartTestsExecution) @ hbase-prefix-tree
---
[INFO] Tests are skipped.
[INFO] 
[INFO] --- jacoco-maven-plugin:0.6.2.201302030002:report (report) @ hbase-prefix-tree ---
[INFO] Skipping JaCoCo execution
[INFO] 
[INFO] --- maven-source-plugin:2.2.1:jar-no-fork (attach-sources) @ hbase-prefix-tree ---
[INFO] Building jar: <https://builds.apache.org/job/HBase-1.0/ws/hbase-prefix-tree/target/hbase-prefix-tree-1.0.2-sources.jar>
[INFO] 
[INFO] --- maven-jar-plugin:2.4:test-jar (default) @ hbase-prefix-tree ---
[INFO] Building jar: <https://builds.apache.org/job/HBase-1.0/ws/hbase-prefix-tree/target/hbase-prefix-tree-1.0.2-tests.jar>
[INFO] 
[INFO] --- maven-jar-plugin:2.4:jar (default-jar) @ hbase-prefix-tree ---
[INFO] Building jar: <https://builds.apache.org/job/HBase-1.0/ws/hbase-prefix-tree/target/hbase-prefix-tree-1.0.2.jar>
[INFO] 
[INFO] --- maven-install-plugin:2.3.1:install (default-install) @ hbase-prefix-tree ---
[INFO] Installing <https://builds.apache.org/job/HBase-1.0/ws/hbase-prefix-tree/target/hbase-prefix-tree-1.0.2.jar>
to /home/jenkins/.m2/repository/org/apache/hbase/hbase-prefix-tree/1.0.2/hbase-prefix-tree-1.0.2.jar
[INFO] Installing <https://builds.apache.org/job/HBase-1.0/ws/hbase-prefix-tree/pom.xml>
to /home/jenkins/.m2/repository/org/apache/hbase/hbase-prefix-tree/1.0.2/hbase-prefix-tree-1.0.2.pom
[INFO] Installing <https://builds.apache.org/job/HBase-1.0/ws/hbase-prefix-tree/target/hbase-prefix-tree-1.0.2-sources.jar>
to /home/jenkins/.m2/repository/org/apache/hbase/hbase-prefix-tree/1.0.2/hbase-prefix-tree-1.0.2-sources.jar
[INFO] Installing <https://builds.apache.org/job/HBase-1.0/ws/hbase-prefix-tree/target/hbase-prefix-tree-1.0.2-tests.jar>
to /home/jenkins/.m2/repository/org/apache/hbase/hbase-prefix-tree/1.0.2/hbase-prefix-tree-1.0.2-tests.jar
[INFO]                                                                         
[INFO] ------------------------------------------------------------------------
[INFO] Building Apache HBase - Server 1.0.2
[INFO] ------------------------------------------------------------------------
[INFO] 
[INFO] --- maven-enforcer-plugin:1.0.1:enforce (enforce) @ hbase-server ---
[INFO] 
[INFO] --- buildnumber-maven-plugin:1.3:create-timestamp (default) @ hbase-server ---
[INFO] 
[INFO] --- jacoco-maven-plugin:0.6.2.201302030002:prepare-agent (prepare-agent) @ hbase-server
---
[INFO] Skipping JaCoCo execution
[INFO] argLine set to 
[INFO] 
[INFO] --- build-helper-maven-plugin:1.9.1:add-source (jspcSource-packageInfo-source) @ hbase-server
---
[INFO] Source directory: <https://builds.apache.org/job/HBase-1.0/ws/hbase-server/target/generated-jamon>
added.
[INFO] Source directory: <https://builds.apache.org/job/HBase-1.0/ws/hbase-server/target/generated-sources/java>
added.
[INFO] 
[INFO] --- jamon-maven-plugin:2.3.4:translate (default) @ hbase-server ---
[INFO] Translating 10 templates from <https://builds.apache.org/job/HBase-1.0/ws/hbase-server/src/main/jamon>
to <https://builds.apache.org/job/HBase-1.0/ws/hbase-server/target/generated-jamon>
[INFO] 
[INFO] --- maven-antrun-plugin:1.6:run (generate) @ hbase-server ---
[INFO] Executing tasks

main:
    [mkdir] Created dir: <https://builds.apache.org/job/HBase-1.0/ws/hbase-server/target/hbase-webapps>
     [copy] Copying 20 files to <https://builds.apache.org/job/HBase-1.0/ws/hbase-server/target/hbase-webapps>
log4j:WARN No appenders could be found for logger (org.mortbay.log).
log4j:WARN Please initialize the log4j system properly.
log4j:WARN See http://logging.apache.org/log4j/1.2/faq.html#noconfig for more info.
    [mkdir] Created dir: <https://builds.apache.org/job/HBase-1.0/ws/hbase-server/target/hbase-webapps/master/WEB-INF>
    [mkdir] Created dir: <https://builds.apache.org/job/HBase-1.0/ws/hbase-server/target/hbase-webapps/regionserver/WEB-INF>
[INFO] Executed tasks
[INFO] 
[INFO] --- maven-remote-resources-plugin:1.5:process (default) @ hbase-server ---
[INFO] 
[INFO] --- maven-resources-plugin:2.6:resources (default-resources) @ hbase-server ---
[INFO] Using 'UTF-8' encoding to copy filtered resources.
[INFO] Copying 22 resources
[INFO] Copying 2 resources
[INFO] 
[INFO] --- maven-compiler-plugin:2.5.1:compile (default-compile) @ hbase-server ---
[INFO] Compiling 714 source files to <https://builds.apache.org/job/HBase-1.0/ws/hbase-server/target/classes>
[INFO] -------------------------------------------------------------
[ERROR] COMPILATION ERROR : 
[INFO] -------------------------------------------------------------
[ERROR] <https://builds.apache.org/job/HBase-1.0/ws/hbase-server/target/generated-jamon/org/apache/hadoop/hbase/tmpl/master/MasterStatusTmplImpl.java>:[51,37]
error: package org.apache.hadoop.hbase.quotas does not exist
[ERROR] <https://builds.apache.org/job/HBase-1.0/ws/hbase-server/target/generated-jamon/org/apache/hadoop/hbase/tmpl/master/MasterStatusTmpl.java>:[51,37]
error: package org.apache.hadoop.hbase.quotas does not exist
[ERROR] <https://builds.apache.org/job/HBase-1.0/ws/hbase-server/target/generated-jamon/org/apache/hadoop/hbase/tmpl/master/MasterStatusTmplImpl.java>:[560,36]
error: cannot find symbol
[INFO] 3 errors 
[INFO] -------------------------------------------------------------
[INFO] ------------------------------------------------------------------------
[INFO] Reactor Summary:
[INFO] 
[INFO] Apache HBase ...................................... SUCCESS [3.231s]
[INFO] Apache HBase - Checkstyle ......................... SUCCESS [0.564s]
[INFO] Apache HBase - Resource Bundle .................... SUCCESS [0.184s]
[INFO] Apache HBase - Annotations ........................ SUCCESS [0.915s]
[INFO] Apache HBase - Common ............................. SUCCESS [58.513s]
[INFO] Apache HBase - Protocol ........................... SUCCESS [9.190s]
[INFO] Apache HBase - Client ............................. SUCCESS [1:19.509s]
[INFO] Apache HBase - Hadoop Compatibility ............... SUCCESS [7.032s]
[INFO] Apache HBase - Hadoop Two Compatibility ........... SUCCESS [6.217s]
[INFO] Apache HBase - Prefix Tree ........................ SUCCESS [8.530s]
[INFO] Apache HBase - Server ............................. FAILURE [5.436s]
[INFO] Apache HBase - Testing Util ....................... SKIPPED
[INFO] Apache HBase - Thrift ............................. SKIPPED
[INFO] Apache HBase - Rest ............................... SKIPPED
[INFO] Apache HBase - Shell .............................. SKIPPED
[INFO] Apache HBase - Integration Tests .................. SKIPPED
[INFO] Apache HBase - Examples ........................... SKIPPED
[INFO] Apache HBase - Assembly ........................... SKIPPED
[INFO] ------------------------------------------------------------------------
[INFO] BUILD FAILURE
[INFO] ------------------------------------------------------------------------
[INFO] Total time: 3:00.836s
[INFO] Finished at: Thu Aug 06 15:03:19 UTC 2015
[INFO] Final Memory: 75M/834M
[INFO] ------------------------------------------------------------------------
[ERROR] Failed to execute goal org.apache.maven.plugins:maven-compiler-plugin:2.5.1:compile
(default-compile) on project hbase-server: Compilation failure: Compilation failure:
[ERROR] <https://builds.apache.org/job/HBase-1.0/ws/hbase-server/target/generated-jamon/org/apache/hadoop/hbase/tmpl/master/MasterStatusTmplImpl.java>:[51,37]
error: package org.apache.hadoop.hbase.quotas does not exist
[ERROR] <https://builds.apache.org/job/HBase-1.0/ws/hbase-server/target/generated-jamon/org/apache/hadoop/hbase/tmpl/master/MasterStatusTmpl.java>:[51,37]
error: package org.apache.hadoop.hbase.quotas does not exist
[ERROR] <https://builds.apache.org/job/HBase-1.0/ws/hbase-server/target/generated-jamon/org/apache/hadoop/hbase/tmpl/master/MasterStatusTmplImpl.java>:[560,36]
error: cannot find symbol
[ERROR] -> [Help 1]
[ERROR] 
[ERROR] To see the full stack trace of the errors, re-run Maven with the -e switch.
[ERROR] Re-run Maven using the -X switch to enable full debug logging.
[ERROR] 
[ERROR] For more information about the errors and possible solutions, please read the following
articles:
[ERROR] [Help 1] http://cwiki.apache.org/confluence/display/MAVEN/MojoFailureException
[ERROR] 
[ERROR] After correcting the problems, you can resume the build with the command
[ERROR]   mvn <goals> -rf :hbase-server
Build step 'Invoke top-level Maven targets' marked build as failure
Performing Post build task...
Match found for :.* : True
Logical operation result is TRUE
Running script  :   ZOMBIE_TESTS_COUNT=`jps | grep surefirebooter | wc -l`
  if [[ $ZOMBIE_TESTS_COUNT != 0 ]] ; then
    #It seems sometimes the tests are not dying immediately. Let's give them 10s
    echo "Suspicious java process found - waiting 10s to see if there are just slow to stop"
    sleep 10   
    ZOMBIE_TESTS_COUNT=`jps | grep surefirebooter | wc -l`
    if [[ $ZOMBIE_TESTS_COUNT != 0 ]] ; then
      echo "There are $ZOMBIE_TESTS_COUNT zombie tests, they should have been killed by surefire
but survived"
      echo "************ BEGIN zombies jstack extract"
      ZB_STACK=`jps | grep surefirebooter | cut -d ' ' -f 1 | xargs -n 1 jstack | grep ".test"
| grep "\.java"`
      jps | grep surefirebooter | cut -d ' ' -f 1 | xargs -n 1 jstack
      echo "************ END  zombies jstack extract"
      JIRA_COMMENT="$JIRA_COMMENT

     {color:red}-1 core zombie tests{color}.  There are ${ZOMBIE_TESTS_COUNT} zombie test(s):
${ZB_STACK}"
      BAD=1
      jps | grep surefirebooter | cut -d ' ' -f 1 | xargs kill -9
    else
      echo "We're ok: there is no zombie test, but some tests took some time to stop"
    fi
  else
    echo "We're ok: there is no zombie test"
  fi
[HBase-1.0] $ /bin/bash -xe /tmp/hudson6245368094003525559.sh
++ jps
++ grep surefirebooter
++ wc -l
+ ZOMBIE_TESTS_COUNT=1
+ [[ 1 != 0 ]]
+ echo 'Suspicious java process found - waiting 10s to see if there are just slow to stop'
Suspicious java process found - waiting 10s to see if there are just slow to stop
+ sleep 10
++ jps
++ grep surefirebooter
++ wc -l
+ ZOMBIE_TESTS_COUNT=1
+ [[ 1 != 0 ]]
+ echo 'There are 1 zombie tests, they should have been killed by surefire but survived'
There are 1 zombie tests, they should have been killed by surefire but survived
+ echo '************ BEGIN zombies jstack extract'
************ BEGIN zombies jstack extract
++ jps
++ grep surefirebooter
++ cut -d ' ' -f 1
++ xargs -n 1 jstack
++ grep .test
++ grep '\.java'
+ ZB_STACK=
POST BUILD TASK : FAILURE
END OF POST BUILD TASK : 0
Archiving artifacts
Sending artifact delta relative to HBase-1.0 #997
Archived 276 artifacts
Archive block size is 32768
Received 4 blocks and 821545 bytes
Compression is 13.8%
Took 1 min 43 sec
Recording test results
Updating HBASE-14021

Mime
View raw message