hbase-builds mailing list archives

Site index · List index
Message view « Date » · « Thread »
Top « Date » · « Thread »
From Apache Jenkins Server <jenk...@builds.apache.org>
Subject Build failed in Jenkins: HBase-1.3 » latest1.8,Hadoop #260
Date Wed, 14 Oct 2015 01:15:48 GMT
See <https://builds.apache.org/job/HBase-1.3/jdk=latest1.8,label=Hadoop/260/changes>

Changes:

[stack] HBASE-14600 Make #testWalRollOnLowReplication looser still

[stack]     HBASE-14596 TestCellACLs failing... on1.2 builds; FIX

------------------------------------------
[...truncated 44722 lines...]
Running org.apache.hadoop.hbase.io.hfile.TestHFileBlockPositionalRead
Tests run: 6, Failures: 0, Errors: 0, Skipped: 0, Time elapsed: 0.692 sec - in org.apache.hadoop.hbase.io.hfile.TestHFileBlockPositionalRead
Java HotSpot(TM) 64-Bit Server VM warning: ignoring option MaxPermSize=256m; support was removed
in 8.0
Running org.apache.hadoop.hbase.io.hfile.TestPrefetch
Tests run: 1, Failures: 0, Errors: 0, Skipped: 0, Time elapsed: 1.852 sec - in org.apache.hadoop.hbase.io.hfile.TestPrefetch
Java HotSpot(TM) 64-Bit Server VM warning: ignoring option MaxPermSize=256m; support was removed
in 8.0
Running org.apache.hadoop.hbase.io.hfile.TestHFileEncryption
Tests run: 3, Failures: 0, Errors: 0, Skipped: 0, Time elapsed: 3.199 sec - in org.apache.hadoop.hbase.io.hfile.TestHFileEncryption
Java HotSpot(TM) 64-Bit Server VM warning: ignoring option MaxPermSize=256m; support was removed
in 8.0
Java HotSpot(TM) 64-Bit Server VM warning: ignoring option MaxPermSize=256m; support was removed
in 8.0
Running org.apache.hadoop.hbase.io.hfile.TestHFile
Tests run: 7, Failures: 0, Errors: 0, Skipped: 0, Time elapsed: 0.759 sec - in org.apache.hadoop.hbase.io.hfile.TestHFile
Java HotSpot(TM) 64-Bit Server VM warning: ignoring option MaxPermSize=256m; support was removed
in 8.0
Java HotSpot(TM) 64-Bit Server VM warning: ignoring option MaxPermSize=256m; support was removed
in 8.0
Running org.apache.hadoop.hbase.io.hfile.TestReseekTo
Tests run: 1, Failures: 0, Errors: 0, Skipped: 0, Time elapsed: 1.015 sec - in org.apache.hadoop.hbase.io.hfile.TestReseekTo
Java HotSpot(TM) 64-Bit Server VM warning: ignoring option MaxPermSize=256m; support was removed
in 8.0
Running org.apache.hadoop.hbase.io.hfile.TestHFileInlineToRootChunkConversion
Tests run: 1, Failures: 0, Errors: 0, Skipped: 0, Time elapsed: 0.798 sec - in org.apache.hadoop.hbase.io.hfile.TestHFileInlineToRootChunkConversion
Java HotSpot(TM) 64-Bit Server VM warning: ignoring option MaxPermSize=256m; support was removed
in 8.0
Java HotSpot(TM) 64-Bit Server VM warning: ignoring option MaxPermSize=256m; support was removed
in 8.0
Running org.apache.hadoop.hbase.io.hfile.bucket.TestByteBufferIOEngine
Tests run: 1, Failures: 0, Errors: 0, Skipped: 0, Time elapsed: 0.402 sec - in org.apache.hadoop.hbase.io.hfile.bucket.TestByteBufferIOEngine
Java HotSpot(TM) 64-Bit Server VM warning: ignoring option MaxPermSize=256m; support was removed
in 8.0
Running org.apache.hadoop.hbase.io.hfile.bucket.TestFileIOEngine
Tests run: 1, Failures: 0, Errors: 0, Skipped: 0, Time elapsed: 0.36 sec - in org.apache.hadoop.hbase.io.hfile.bucket.TestFileIOEngine
Java HotSpot(TM) 64-Bit Server VM warning: ignoring option MaxPermSize=256m; support was removed
in 8.0
Running org.apache.hadoop.hbase.io.hfile.bucket.TestBucketWriterThread
Tests run: 4, Failures: 0, Errors: 0, Skipped: 0, Time elapsed: 0.807 sec - in org.apache.hadoop.hbase.io.hfile.bucket.TestBucketWriterThread
Java HotSpot(TM) 64-Bit Server VM warning: ignoring option MaxPermSize=256m; support was removed
in 8.0
Running org.apache.hadoop.hbase.io.hfile.bucket.TestBucketCache
Tests run: 10, Failures: 0, Errors: 0, Skipped: 0, Time elapsed: 7.676 sec - in org.apache.hadoop.hbase.io.hfile.bucket.TestBucketCache
Java HotSpot(TM) 64-Bit Server VM warning: ignoring option MaxPermSize=256m; support was removed
in 8.0
Running org.apache.hadoop.hbase.io.hfile.TestHFileWriterV3
Tests run: 4, Failures: 0, Errors: 0, Skipped: 0, Time elapsed: 2.332 sec - in org.apache.hadoop.hbase.io.hfile.TestHFileWriterV3
Java HotSpot(TM) 64-Bit Server VM warning: ignoring option MaxPermSize=256m; support was removed
in 8.0
Running org.apache.hadoop.hbase.io.hfile.TestCachedBlockQueue
Tests run: 2, Failures: 0, Errors: 0, Skipped: 0, Time elapsed: 0.393 sec - in org.apache.hadoop.hbase.io.hfile.TestCachedBlockQueue
Java HotSpot(TM) 64-Bit Server VM warning: ignoring option MaxPermSize=256m; support was removed
in 8.0
Running org.apache.hadoop.hbase.io.hfile.TestHFileBlockCompatibility
Tests run: 16, Failures: 0, Errors: 0, Skipped: 0, Time elapsed: 2.062 sec - in org.apache.hadoop.hbase.io.hfile.TestHFileBlockCompatibility
Java HotSpot(TM) 64-Bit Server VM warning: ignoring option MaxPermSize=256m; support was removed
in 8.0
Java HotSpot(TM) 64-Bit Server VM warning: ignoring option MaxPermSize=256m; support was removed
in 8.0
Running org.apache.hadoop.hbase.io.hfile.TestLazyDataBlockDecompression
Tests run: 2, Failures: 0, Errors: 0, Skipped: 0, Time elapsed: 1.137 sec - in org.apache.hadoop.hbase.io.hfile.TestLazyDataBlockDecompression
Java HotSpot(TM) 64-Bit Server VM warning: ignoring option MaxPermSize=256m; support was removed
in 8.0
Running org.apache.hadoop.hbase.io.hfile.TestBlockCacheReporting
Tests run: 2, Failures: 0, Errors: 0, Skipped: 0, Time elapsed: 0.772 sec - in org.apache.hadoop.hbase.io.hfile.TestBlockCacheReporting
Java HotSpot(TM) 64-Bit Server VM warning: ignoring option MaxPermSize=256m; support was removed
in 8.0
Running org.apache.hadoop.hbase.io.hfile.TestLruBlockCache
Tests run: 9, Failures: 0, Errors: 0, Skipped: 0, Time elapsed: 1.124 sec - in org.apache.hadoop.hbase.io.hfile.TestLruBlockCache
Java HotSpot(TM) 64-Bit Server VM warning: ignoring option MaxPermSize=256m; support was removed
in 8.0
Running org.apache.hadoop.hbase.io.hfile.TestSeekTo
Tests run: 20, Failures: 0, Errors: 0, Skipped: 0, Time elapsed: 1.993 sec - in org.apache.hadoop.hbase.io.hfile.TestSeekTo
Java HotSpot(TM) 64-Bit Server VM warning: ignoring option MaxPermSize=256m; support was removed
in 8.0
Running org.apache.hadoop.hbase.io.hfile.TestHFileWriterV2
Tests run: 2, Failures: 0, Errors: 0, Skipped: 0, Time elapsed: 1.536 sec - in org.apache.hadoop.hbase.io.hfile.TestHFileWriterV2
Java HotSpot(TM) 64-Bit Server VM warning: ignoring option MaxPermSize=256m; support was removed
in 8.0
Java HotSpot(TM) 64-Bit Server VM warning: ignoring option MaxPermSize=256m; support was removed
in 8.0
Java HotSpot(TM) 64-Bit Server VM warning: ignoring option MaxPermSize=256m; support was removed
in 8.0
Running org.apache.hadoop.hbase.io.TestHalfStoreFileReader
Tests run: 2, Failures: 0, Errors: 0, Skipped: 0, Time elapsed: 1.033 sec - in org.apache.hadoop.hbase.io.TestHalfStoreFileReader
Java HotSpot(TM) 64-Bit Server VM warning: ignoring option MaxPermSize=256m; support was removed
in 8.0
Running org.apache.hadoop.hbase.io.encoding.TestPrefixTree
Tests run: 2, Failures: 0, Errors: 0, Skipped: 0, Time elapsed: 1.849 sec - in org.apache.hadoop.hbase.io.encoding.TestPrefixTree
Java HotSpot(TM) 64-Bit Server VM warning: ignoring option MaxPermSize=256m; support was removed
in 8.0
Running org.apache.hadoop.hbase.io.encoding.TestSeekBeforeWithReverseScan
Tests run: 2, Failures: 0, Errors: 0, Skipped: 0, Time elapsed: 1.675 sec - in org.apache.hadoop.hbase.io.encoding.TestSeekBeforeWithReverseScan
Java HotSpot(TM) 64-Bit Server VM warning: ignoring option MaxPermSize=256m; support was removed
in 8.0
Java HotSpot(TM) 64-Bit Server VM warning: ignoring option MaxPermSize=256m; support was removed
in 8.0
Java HotSpot(TM) 64-Bit Server VM warning: ignoring option MaxPermSize=256m; support was removed
in 8.0
Java HotSpot(TM) 64-Bit Server VM warning: ignoring option MaxPermSize=256m; support was removed
in 8.0
Java HotSpot(TM) 64-Bit Server VM warning: ignoring option MaxPermSize=256m; support was removed
in 8.0
Java HotSpot(TM) 64-Bit Server VM warning: ignoring option MaxPermSize=256m; support was removed
in 8.0
Running org.apache.hadoop.hbase.io.encoding.TestPrefixTreeEncoding
Tests run: 8, Failures: 0, Errors: 0, Skipped: 0, Time elapsed: 0.872 sec - in org.apache.hadoop.hbase.io.encoding.TestPrefixTreeEncoding
Java HotSpot(TM) 64-Bit Server VM warning: ignoring option MaxPermSize=256m; support was removed
in 8.0
Running org.apache.hadoop.hbase.io.encoding.TestSeekToBlockWithEncoders
Tests run: 9, Failures: 0, Errors: 0, Skipped: 0, Time elapsed: 0.736 sec - in org.apache.hadoop.hbase.io.encoding.TestSeekToBlockWithEncoders
Java HotSpot(TM) 64-Bit Server VM warning: ignoring option MaxPermSize=256m; support was removed
in 8.0
Running org.apache.hadoop.hbase.io.TestHeapSize
Tests run: 3, Failures: 0, Errors: 0, Skipped: 0, Time elapsed: 0.418 sec - in org.apache.hadoop.hbase.io.TestHeapSize
Java HotSpot(TM) 64-Bit Server VM warning: ignoring option MaxPermSize=256m; support was removed
in 8.0
Running org.apache.hadoop.hbase.TestIPv6NIOServerSocketChannel
Tests run: 2, Failures: 0, Errors: 0, Skipped: 0, Time elapsed: 0.539 sec - in org.apache.hadoop.hbase.TestIPv6NIOServerSocketChannel
Java HotSpot(TM) 64-Bit Server VM warning: ignoring option MaxPermSize=256m; support was removed
in 8.0
Running org.apache.hadoop.hbase.protobuf.TestProtobufUtil
Tests run: 7, Failures: 0, Errors: 0, Skipped: 0, Time elapsed: 1.115 sec - in org.apache.hadoop.hbase.protobuf.TestProtobufUtil
Java HotSpot(TM) 64-Bit Server VM warning: ignoring option MaxPermSize=256m; support was removed
in 8.0
Running org.apache.hadoop.hbase.protobuf.TestReplicationProtobuf
Tests run: 1, Failures: 0, Errors: 0, Skipped: 0, Time elapsed: 0.378 sec - in org.apache.hadoop.hbase.protobuf.TestReplicationProtobuf
Java HotSpot(TM) 64-Bit Server VM warning: ignoring option MaxPermSize=256m; support was removed
in 8.0
Java HotSpot(TM) 64-Bit Server VM warning: ignoring option MaxPermSize=256m; support was removed
in 8.0
Java HotSpot(TM) 64-Bit Server VM warning: ignoring option MaxPermSize=256m; support was removed
in 8.0
Running org.apache.hadoop.hbase.filter.TestRegexComparator
Tests run: 3, Failures: 0, Errors: 0, Skipped: 0, Time elapsed: 0.582 sec - in org.apache.hadoop.hbase.filter.TestRegexComparator
Java HotSpot(TM) 64-Bit Server VM warning: ignoring option MaxPermSize=256m; support was removed
in 8.0
Running org.apache.hadoop.hbase.filter.TestFilter
Tests run: 21, Failures: 0, Errors: 0, Skipped: 0, Time elapsed: 4.387 sec - in org.apache.hadoop.hbase.filter.TestFilter
Java HotSpot(TM) 64-Bit Server VM warning: ignoring option MaxPermSize=256m; support was removed
in 8.0
Running org.apache.hadoop.hbase.filter.TestBitComparator
Tests run: 6, Failures: 0, Errors: 0, Skipped: 0, Time elapsed: 0.513 sec - in org.apache.hadoop.hbase.filter.TestBitComparator
Java HotSpot(TM) 64-Bit Server VM warning: ignoring option MaxPermSize=256m; support was removed
in 8.0
Running org.apache.hadoop.hbase.filter.TestColumnPrefixFilter
Tests run: 2, Failures: 0, Errors: 0, Skipped: 0, Time elapsed: 3.467 sec - in org.apache.hadoop.hbase.filter.TestColumnPrefixFilter
Java HotSpot(TM) 64-Bit Server VM warning: ignoring option MaxPermSize=256m; support was removed
in 8.0
Running org.apache.hadoop.hbase.filter.TestSingleColumnValueExcludeFilter
Tests run: 1, Failures: 0, Errors: 0, Skipped: 0, Time elapsed: 0.296 sec - in org.apache.hadoop.hbase.filter.TestSingleColumnValueExcludeFilter
Java HotSpot(TM) 64-Bit Server VM warning: ignoring option MaxPermSize=256m; support was removed
in 8.0
Running org.apache.hadoop.hbase.filter.TestSingleColumnValueFilter
Tests run: 3, Failures: 0, Errors: 0, Skipped: 0, Time elapsed: 0.874 sec - in org.apache.hadoop.hbase.filter.TestSingleColumnValueFilter
Java HotSpot(TM) 64-Bit Server VM warning: ignoring option MaxPermSize=256m; support was removed
in 8.0
Java HotSpot(TM) 64-Bit Server VM warning: ignoring option MaxPermSize=256m; support was removed
in 8.0
Running org.apache.hadoop.hbase.filter.TestRandomRowFilter
Tests run: 2, Failures: 0, Errors: 0, Skipped: 0, Time elapsed: 0.74 sec - in org.apache.hadoop.hbase.filter.TestRandomRowFilter
Java HotSpot(TM) 64-Bit Server VM warning: ignoring option MaxPermSize=256m; support was removed
in 8.0
Running org.apache.hadoop.hbase.filter.TestFirstKeyValueMatchingQualifiersFilter
Tests run: 1, Failures: 0, Errors: 0, Skipped: 0, Time elapsed: 0.305 sec - in org.apache.hadoop.hbase.filter.TestFirstKeyValueMatchingQualifiersFilter
Java HotSpot(TM) 64-Bit Server VM warning: ignoring option MaxPermSize=256m; support was removed
in 8.0
Running org.apache.hadoop.hbase.filter.TestFilterList
Tests run: 7, Failures: 0, Errors: 0, Skipped: 0, Time elapsed: 0.942 sec - in org.apache.hadoop.hbase.filter.TestFilterList
Java HotSpot(TM) 64-Bit Server VM warning: ignoring option MaxPermSize=256m; support was removed
in 8.0
Java HotSpot(TM) 64-Bit Server VM warning: ignoring option MaxPermSize=256m; support was removed
in 8.0
Running org.apache.hadoop.hbase.filter.TestFuzzyRowFilter
Tests run: 6, Failures: 0, Errors: 0, Skipped: 0, Time elapsed: 0.545 sec - in org.apache.hadoop.hbase.filter.TestFuzzyRowFilter
Java HotSpot(TM) 64-Bit Server VM warning: ignoring option MaxPermSize=256m; support was removed
in 8.0
Running org.apache.hadoop.hbase.filter.TestParseFilter
Tests run: 34, Failures: 0, Errors: 0, Skipped: 0, Time elapsed: 1.4 sec - in org.apache.hadoop.hbase.filter.TestParseFilter
Java HotSpot(TM) 64-Bit Server VM warning: ignoring option MaxPermSize=256m; support was removed
in 8.0
Running org.apache.hadoop.hbase.filter.TestPageFilter
Tests run: 2, Failures: 0, Errors: 0, Skipped: 0, Time elapsed: 0.407 sec - in org.apache.hadoop.hbase.filter.TestPageFilter
Java HotSpot(TM) 64-Bit Server VM warning: ignoring option MaxPermSize=256m; support was removed
in 8.0
Running org.apache.hadoop.hbase.filter.TestDependentColumnFilter
Tests run: 4, Failures: 0, Errors: 0, Skipped: 0, Time elapsed: 1.809 sec - in org.apache.hadoop.hbase.filter.TestDependentColumnFilter
Java HotSpot(TM) 64-Bit Server VM warning: ignoring option MaxPermSize=256m; support was removed
in 8.0
Running org.apache.hadoop.hbase.filter.TestInclusiveStopFilter
Tests run: 2, Failures: 0, Errors: 0, Skipped: 0, Time elapsed: 0.326 sec - in org.apache.hadoop.hbase.filter.TestInclusiveStopFilter
Java HotSpot(TM) 64-Bit Server VM warning: ignoring option MaxPermSize=256m; support was removed
in 8.0
Running org.apache.hadoop.hbase.filter.TestMultipleColumnPrefixFilter
Tests run: 3, Failures: 0, Errors: 0, Skipped: 0, Time elapsed: 4.734 sec - in org.apache.hadoop.hbase.filter.TestMultipleColumnPrefixFilter
Java HotSpot(TM) 64-Bit Server VM warning: ignoring option MaxPermSize=256m; support was removed
in 8.0
Running org.apache.hadoop.hbase.filter.TestFilterSerialization
Tests run: 26, Failures: 0, Errors: 0, Skipped: 0, Time elapsed: 1.814 sec - in org.apache.hadoop.hbase.filter.TestFilterSerialization
Java HotSpot(TM) 64-Bit Server VM warning: ignoring option MaxPermSize=256m; support was removed
in 8.0
Running org.apache.hadoop.hbase.filter.TestPrefixFilter
Tests run: 3, Failures: 0, Errors: 0, Skipped: 0, Time elapsed: 0.349 sec - in org.apache.hadoop.hbase.filter.TestPrefixFilter
Java HotSpot(TM) 64-Bit Server VM warning: ignoring option MaxPermSize=256m; support was removed
in 8.0
Java HotSpot(TM) 64-Bit Server VM warning: ignoring option MaxPermSize=256m; support was removed
in 8.0
Running org.apache.hadoop.hbase.filter.TestNullComparator
Tests run: 3, Failures: 0, Errors: 0, Skipped: 0, Time elapsed: 0.422 sec - in org.apache.hadoop.hbase.filter.TestNullComparator
Java HotSpot(TM) 64-Bit Server VM warning: ignoring option MaxPermSize=256m; support was removed
in 8.0
Running org.apache.hadoop.hbase.filter.TestComparatorSerialization
Tests run: 6, Failures: 0, Errors: 0, Skipped: 0, Time elapsed: 1.035 sec - in org.apache.hadoop.hbase.filter.TestComparatorSerialization
Java HotSpot(TM) 64-Bit Server VM warning: ignoring option MaxPermSize=256m; support was removed
in 8.0
Running org.apache.hadoop.hbase.filter.TestColumnPaginationFilter
Tests run: 1, Failures: 0, Errors: 0, Skipped: 0, Time elapsed: 0.775 sec - in org.apache.hadoop.hbase.filter.TestColumnPaginationFilter
Java HotSpot(TM) 64-Bit Server VM warning: ignoring option MaxPermSize=256m; support was removed
in 8.0
Running org.apache.hadoop.hbase.filter.TestInvocationRecordFilter
Tests run: 1, Failures: 0, Errors: 0, Skipped: 0, Time elapsed: 1.437 sec - in org.apache.hadoop.hbase.filter.TestInvocationRecordFilter
Java HotSpot(TM) 64-Bit Server VM warning: ignoring option MaxPermSize=256m; support was removed
in 8.0
Java HotSpot(TM) 64-Bit Server VM warning: ignoring option MaxPermSize=256m; support was removed
in 8.0

Results :

Tests run: 973, Failures: 0, Errors: 0, Skipped: 20

[INFO] ------------------------------------------------------------------------
[INFO] Reactor Summary:
[INFO] 
[INFO] Apache HBase ...................................... SUCCESS [1:22.975s]
[INFO] Apache HBase - Checkstyle ......................... SUCCESS [6.845s]
[INFO] Apache HBase - Resource Bundle .................... SUCCESS [0.175s]
[INFO] Apache HBase - Annotations ........................ SUCCESS [0.946s]
[INFO] Apache HBase - Protocol ........................... SUCCESS [15.071s]
[INFO] Apache HBase - Common ............................. SUCCESS [1:51.767s]
[INFO] Apache HBase - Procedure .......................... SUCCESS [1:54.790s]
[INFO] Apache HBase - Client ............................. SUCCESS [1:29.864s]
[INFO] Apache HBase - Hadoop Compatibility ............... SUCCESS [8.080s]
[INFO] Apache HBase - Hadoop Two Compatibility ........... SUCCESS [8.030s]
[INFO] Apache HBase - Prefix Tree ........................ SUCCESS [7.842s]
[INFO] Apache HBase - Server ............................. FAILURE [13:41.494s]
[INFO] Apache HBase - Testing Util ....................... SKIPPED
[INFO] Apache HBase - Thrift ............................. SKIPPED
[INFO] Apache HBase - Rest ............................... SKIPPED
[INFO] Apache HBase - Shell .............................. SKIPPED
[INFO] Apache HBase - Integration Tests .................. SKIPPED
[INFO] Apache HBase - Examples ........................... SKIPPED
[INFO] Apache HBase - External Block Cache ............... SKIPPED
[INFO] Apache HBase - Assembly ........................... SKIPPED
[INFO] Apache HBase - Shaded ............................. SKIPPED
[INFO] Apache HBase - Shaded - Client .................... SKIPPED
[INFO] Apache HBase - Shaded - Server .................... SKIPPED
[INFO] ------------------------------------------------------------------------
[INFO] BUILD FAILURE
[INFO] ------------------------------------------------------------------------
[INFO] Total time: 21:32.170s
[INFO] Finished at: Wed Oct 14 01:16:13 UTC 2015
[INFO] Final Memory: 101M/1415M
[INFO] ------------------------------------------------------------------------
[ERROR] Failed to execute goal org.apache.maven.plugins:maven-surefire-plugin:2.18.1:test
(default-test) on project hbase-server: ExecutionException: java.lang.RuntimeException: The
forked VM terminated without properly saying goodbye. VM crash or System.exit called?
[ERROR] Command was /bin/sh -c cd <https://builds.apache.org/job/HBase-1.3/jdk=latest1.8,label=Hadoop/ws/hbase-server>
&& /home/jenkins/jenkins-slave/tools/hudson.model.JDK/latest1.8/jre/bin/java -enableassertions
-Dhbase.test -Xmx2800m -XX:MaxPermSize=256m -Djava.security.egd=file:/dev/./urandom -Djava.net.preferIPv4Stack=true
-Djava.awt.headless=true -jar <https://builds.apache.org/job/HBase-1.3/jdk=latest1.8,label=Hadoop/ws/hbase-server/target/surefire/surefirebooter6384723999751495733.jar>
<https://builds.apache.org/job/HBase-1.3/jdk=latest1.8,label=Hadoop/ws/hbase-server/target/surefire/surefire7344962922255854860tmp>
<https://builds.apache.org/job/HBase-1.3/jdk=latest1.8,label=Hadoop/ws/hbase-server/target/surefire/surefire_2617322987582024551963tmp>
[ERROR] -> [Help 1]
[ERROR] 
[ERROR] To see the full stack trace of the errors, re-run Maven with the -e switch.
[ERROR] Re-run Maven using the -X switch to enable full debug logging.
[ERROR] 
[ERROR] For more information about the errors and possible solutions, please read the following
articles:
[ERROR] [Help 1] http://cwiki.apache.org/confluence/display/MAVEN/MojoFailureException
[ERROR] 
[ERROR] After correcting the problems, you can resume the build with the command
[ERROR]   mvn <goals> -rf :hbase-server
Build step 'Invoke top-level Maven targets' marked build as failure
Performing Post build task...
Match found for :.* : True
Logical operation result is TRUE
Running script  :   ZOMBIE_TESTS_COUNT=`jps | grep surefirebooter | wc -l`
  if [[ $ZOMBIE_TESTS_COUNT != 0 ]] ; then
    #It seems sometimes the tests are not dying immediately. Let's give them 10s
    echo "Suspicious java process found - waiting 10s to see if there are just slow to stop"
    sleep 10   
    ZOMBIE_TESTS_COUNT=`jps | grep surefirebooter | wc -l`
    if [[ $ZOMBIE_TESTS_COUNT != 0 ]] ; then
      echo "There are $ZOMBIE_TESTS_COUNT zombie tests, they should have been killed by surefire
but survived"
      echo "************ BEGIN zombies jstack extract"
      ZB_STACK=`jps | grep surefirebooter | cut -d ' ' -f 1 | xargs -n 1 jstack | grep ".test"
| grep "\.java"`
      jps | grep surefirebooter | cut -d ' ' -f 1 | xargs -n 1 jstack
      echo "************ END  zombies jstack extract"
      JIRA_COMMENT="$JIRA_COMMENT

     {color:red}-1 core zombie tests{color}.  There are ${ZOMBIE_TESTS_COUNT} zombie test(s):
${ZB_STACK}"
      BAD=1
      jps | grep surefirebooter | cut -d ' ' -f 1 | xargs kill -9
    else
      echo "We're ok: there is no zombie test, but some tests took some time to stop"
    fi
  else
    echo "We're ok: there is no zombie test"
  fi
[Hadoop] $ /bin/bash -xe /tmp/hudson1924998702526352552.sh
++ jps
++ grep surefirebooter
++ wc -l
+ ZOMBIE_TESTS_COUNT=0
+ [[ 0 != 0 ]]
+ echo 'We'\''re ok: there is no zombie test'
We're ok: there is no zombie test
POST BUILD TASK : SUCCESS
END OF POST BUILD TASK : 0
Archiving artifacts

Mime
View raw message