hbase-builds mailing list archives

Site index · List index
Message view « Date » · « Thread »
Top « Date » · « Thread »
From Apache Jenkins Server <jenk...@builds.apache.org>
Subject Build failed in Jenkins: HBase-1.2 » latest1.7,Hadoop #254
Date Wed, 14 Oct 2015 21:27:45 GMT
See <https://builds.apache.org/job/HBase-1.2/jdk=latest1.7,label=Hadoop/254/changes>

Changes:

[stack] HBASE-14268 Improve KeyLocker; ADDENDUM: FIX JAVADOC WARNING

[stack] HBASE-14606 TestSecureLoadIncrementalHFiles tests timed out in trunk

------------------------------------------
[...truncated 49578 lines...]
13137/13509 KB   
13141/13509 KB   
13145/13509 KB   
13149/13509 KB   
13153/13509 KB   
13157/13509 KB   
13161/13509 KB   
13165/13509 KB   
13169/13509 KB   
13173/13509 KB   
13177/13509 KB   
13181/13509 KB   
13185/13509 KB   
13189/13509 KB   
13193/13509 KB   
13197/13509 KB   
13201/13509 KB   
13205/13509 KB   
13209/13509 KB   
13213/13509 KB   
13217/13509 KB   
13221/13509 KB   
13225/13509 KB   
13229/13509 KB   
13233/13509 KB   
13237/13509 KB   
13241/13509 KB   
13245/13509 KB   
13249/13509 KB   
13253/13509 KB   
13257/13509 KB   
13261/13509 KB   
13265/13509 KB   
13269/13509 KB   
13273/13509 KB   
13277/13509 KB   
13281/13509 KB   
13285/13509 KB   
13289/13509 KB   
13293/13509 KB   
13297/13509 KB   
13301/13509 KB   
13305/13509 KB   
13309/13509 KB   
13313/13509 KB   
13317/13509 KB   
13321/13509 KB   
13325/13509 KB   
13329/13509 KB   
13333/13509 KB   
13337/13509 KB   
13341/13509 KB   
13345/13509 KB   
13349/13509 KB   
13353/13509 KB   
13357/13509 KB   
13361/13509 KB   
13365/13509 KB   
13369/13509 KB   
13373/13509 KB   
13377/13509 KB   
13381/13509 KB   
13385/13509 KB   
13389/13509 KB   
13393/13509 KB   
13397/13509 KB   
13401/13509 KB   
13405/13509 KB   
13409/13509 KB   
13413/13509 KB   
13417/13509 KB   
13421/13509 KB   
13425/13509 KB   
13429/13509 KB   
13433/13509 KB   
13437/13509 KB   
13441/13509 KB   
13445/13509 KB   
13449/13509 KB   
13453/13509 KB   
13457/13509 KB   
13461/13509 KB   
13465/13509 KB   
13469/13509 KB   
13473/13509 KB   
13477/13509 KB   
13481/13509 KB   
13485/13509 KB   
13489/13509 KB   
13493/13509 KB   
13497/13509 KB   
13501/13509 KB   
13505/13509 KB   
13509/13509 KB   
                 
Downloaded: http://repository.jboss.org/nexus/content/groups/public-jboss/org/jruby/jruby-complete/1.6.8/jruby-complete-1.6.8.jar
(13509 KB at 8374.5 KB/sec)
[INFO] 
[INFO] --- maven-enforcer-plugin:1.0.1:enforce (enforce) @ hbase-shell ---
[INFO] 
[INFO] --- buildnumber-maven-plugin:1.3:create-timestamp (default) @ hbase-shell ---
[INFO] 
[INFO] --- jacoco-maven-plugin:0.7.5.201505241946:prepare-agent (prepare-agent) @ hbase-shell
---
[INFO] Skipping JaCoCo execution because property jacoco.skip is set.
[INFO] argLine set to empty
[INFO] 
[INFO] --- build-helper-maven-plugin:1.9.1:add-source (jspcSource-packageInfo-source) @ hbase-shell
---
[INFO] Source directory: <https://builds.apache.org/job/HBase-1.2/jdk=latest1.7,label=Hadoop/ws/hbase-shell/target/generated-jamon>
added.
[INFO] Source directory: <https://builds.apache.org/job/HBase-1.2/jdk=latest1.7,label=Hadoop/ws/hbase-shell/target/generated-sources/java>
added.
[INFO] 
[INFO] --- maven-remote-resources-plugin:1.5:process (default) @ hbase-shell ---
[INFO] 
[INFO] --- maven-resources-plugin:2.6:resources (default-resources) @ hbase-shell ---
[INFO] Using 'UTF-8' encoding to copy filtered resources.
[INFO] Copying 0 resource
[INFO] Copying 3 resources
[INFO] 
[INFO] --- maven-compiler-plugin:2.5.1:compile (default-compile) @ hbase-shell ---
[INFO] No sources to compile
[INFO] 
[INFO] --- maven-dependency-plugin:2.1:build-classpath (create-mrapp-generated-classpath)
@ hbase-shell ---
[INFO] Wrote classpath file '<https://builds.apache.org/job/HBase-1.2/jdk=latest1.7,label=Hadoop/ws/hbase-shell/target/test-classes/mrapp-generated-classpath'.>
[INFO] 
[INFO] --- maven-resources-plugin:2.6:testResources (default-testResources) @ hbase-shell
---
[INFO] Using 'UTF-8' encoding to copy filtered resources.
[INFO] skip non existing resourceDirectory <https://builds.apache.org/job/HBase-1.2/jdk=latest1.7,label=Hadoop/ws/hbase-shell/src/test/resources>
[INFO] Copying 3 resources
[INFO] 
[INFO] --- maven-compiler-plugin:2.5.1:testCompile (default-testCompile) @ hbase-shell ---
[INFO] Compiling 3 source files to <https://builds.apache.org/job/HBase-1.2/jdk=latest1.7,label=Hadoop/ws/hbase-shell/target/test-classes>
[INFO] 
[INFO] --- maven-surefire-plugin:2.18.1:test (default-test) @ hbase-shell ---
[INFO] Surefire report directory: <https://builds.apache.org/job/HBase-1.2/jdk=latest1.7,label=Hadoop/ws/hbase-shell/target/surefire-reports>
[INFO] Using configured provider org.apache.maven.surefire.junitcore.JUnitCoreProvider
[INFO] parallel='none', perCoreThreadCount=true, threadCount=0, useUnlimitedThreads=false,
threadCountSuites=0, threadCountClasses=0, threadCountMethods=0, parallelOptimized=true

-------------------------------------------------------
 T E S T S
-------------------------------------------------------

Results :

Tests run: 0, Failures: 0, Errors: 0, Skipped: 0

[INFO] 
[INFO] --- maven-surefire-plugin:2.18.1:test (secondPartTestsExecution) @ hbase-shell ---
[INFO] Surefire report directory: <https://builds.apache.org/job/HBase-1.2/jdk=latest1.7,label=Hadoop/ws/hbase-shell/target/surefire-reports>
[INFO] Using configured provider org.apache.maven.surefire.junitcore.JUnitCoreProvider
[INFO] parallel='none', perCoreThreadCount=true, threadCount=0, useUnlimitedThreads=false,
threadCountSuites=0, threadCountClasses=0, threadCountMethods=0, parallelOptimized=true

-------------------------------------------------------
 T E S T S
-------------------------------------------------------
Running org.apache.hadoop.hbase.client.TestReplicationShell
Running org.apache.hadoop.hbase.client.TestShell
Killed
Killed

Results :

Tests run: 0, Failures: 0, Errors: 0, Skipped: 0

[INFO] ------------------------------------------------------------------------
[INFO] Reactor Summary:
[INFO] 
[INFO] Apache HBase ...................................... SUCCESS [1:28.427s]
[INFO] Apache HBase - Checkstyle ......................... SUCCESS [7.349s]
[INFO] Apache HBase - Resource Bundle .................... SUCCESS [0.195s]
[INFO] Apache HBase - Annotations ........................ SUCCESS [1.081s]
[INFO] Apache HBase - Protocol ........................... SUCCESS [16.047s]
[INFO] Apache HBase - Common ............................. SUCCESS [3:28.955s]
[INFO] Apache HBase - Procedure .......................... SUCCESS [1:52.786s]
[INFO] Apache HBase - Client ............................. SUCCESS [1:29.456s]
[INFO] Apache HBase - Hadoop Compatibility ............... SUCCESS [8.942s]
[INFO] Apache HBase - Hadoop Two Compatibility ........... SUCCESS [10.114s]
[INFO] Apache HBase - Prefix Tree ........................ SUCCESS [9.761s]
[INFO] Apache HBase - Server ............................. SUCCESS [1:30:33.581s]
[INFO] Apache HBase - Testing Util ....................... SUCCESS [3.830s]
[INFO] Apache HBase - Thrift ............................. SUCCESS [3:10.108s]
[INFO] Apache HBase - Rest ............................... SUCCESS [8:19.176s]
[INFO] Apache HBase - Shell .............................. FAILURE [57.755s]
[INFO] Apache HBase - Integration Tests .................. SKIPPED
[INFO] Apache HBase - Examples ........................... SKIPPED
[INFO] Apache HBase - External Block Cache ............... SKIPPED
[INFO] Apache HBase - Assembly ........................... SKIPPED
[INFO] Apache HBase - Shaded ............................. SKIPPED
[INFO] Apache HBase - Shaded - Client .................... SKIPPED
[INFO] Apache HBase - Shaded - Server .................... SKIPPED
[INFO] ------------------------------------------------------------------------
[INFO] BUILD FAILURE
[INFO] ------------------------------------------------------------------------
[INFO] Total time: 1:52:42.989s
[INFO] Finished at: Wed Oct 14 21:26:22 UTC 2015
[INFO] Final Memory: 121M/634M
[INFO] ------------------------------------------------------------------------
[ERROR] Failed to execute goal org.apache.maven.plugins:maven-surefire-plugin:2.18.1:test
(secondPartTestsExecution) on project hbase-shell: ExecutionException: java.lang.RuntimeException:
The forked VM terminated without properly saying goodbye. VM crash or System.exit called?
[ERROR] Command was /bin/sh -c cd <https://builds.apache.org/job/HBase-1.2/jdk=latest1.7,label=Hadoop/ws/hbase-shell>
&& /home/jenkins/jenkins-slave/tools/hudson.model.JDK/latest1.7/jre/bin/java -enableassertions
-XX:MaxDirectMemorySize=1G -Xmx2800m -XX:MaxPermSize=256m -Djava.security.egd=file:/dev/./urandom
-Djava.net.preferIPv4Stack=true -Djava.awt.headless=true -jar <https://builds.apache.org/job/HBase-1.2/jdk=latest1.7,label=Hadoop/ws/hbase-shell/target/surefire/surefirebooter1389288201513092210.jar>
<https://builds.apache.org/job/HBase-1.2/jdk=latest1.7,label=Hadoop/ws/hbase-shell/target/surefire/surefire2834321130985225797tmp>
<https://builds.apache.org/job/HBase-1.2/jdk=latest1.7,label=Hadoop/ws/hbase-shell/target/surefire/surefire_14167803288688853905935tmp>
[ERROR] -> [Help 1]
[ERROR] 
[ERROR] To see the full stack trace of the errors, re-run Maven with the -e switch.
[ERROR] Re-run Maven using the -X switch to enable full debug logging.
[ERROR] 
[ERROR] For more information about the errors and possible solutions, please read the following
articles:
[ERROR] [Help 1] http://cwiki.apache.org/confluence/display/MAVEN/MojoFailureException
[ERROR] 
[ERROR] After correcting the problems, you can resume the build with the command
[ERROR]   mvn <goals> -rf :hbase-shell
Build step 'Invoke top-level Maven targets' marked build as failure
Performing Post build task...
Match found for :.* : True
Logical operation result is TRUE
Running script  :     ZOMBIE_TESTS_COUNT=`jps -v | grep surefirebooter | grep '-Dhbase.test'
| wc -l`
  if [[ $ZOMBIE_TESTS_COUNT != 0 ]] ; then
    #It seems sometimes the tests are not dying immediately. Let's give them 30s
    echo "Suspicious java process found - waiting 30s to see if there are just slow to stop"
    sleep 30
    ZOMBIE_TESTS_COUNT=`jps -v | grep surefirebooter | grep '-Dhbase.test' | wc -l`
    if [[ $ZOMBIE_TESTS_COUNT != 0 ]] ; then
      echo "There are $ZOMBIE_TESTS_COUNT zombie tests, they should have been killed by surefire
but survived"
      echo "************ zombies jps listing"
      jps -v
      jps -v | grep surefirebooter | grep '-Dhbase.test'
      echo "************ BEGIN zombies jstack extract"
      # HBase tests have been flagged with an innocuous '-Dhbase.test' just so they can
      # be identified as hbase in a process listing.
      ZB_STACK=`jps -v | grep surefirebooter | grep '-Dhbase.test' | cut -d ' ' -f 1 | xargs
-n 1 jstack | grep ".test" | grep "\.java"`
      jps -v | grep surefirebooter | grep '-Dhbase.test' | cut -d ' ' -f 1 | xargs -n 1 jstack
      echo "************ END  zombies jstack extract"
      JIRA_COMMENT="$JIRA_COMMENT

     {color:red}-1 core zombie tests{color}.  There are ${ZOMBIE_TESTS_COUNT} zombie test(s):
${ZB_STACK}"
      BAD=1
      # Killing these zombies
      echo 'Killing ZOMBIES!!!'
      jps -v
      jps -v | grep surefirebooter | grep '-Dhbase.test' | cut -d ' ' -f 1 | xargs kill -9
    else
      echo "We're ok: there is no zombie test, but some tests took some time to stop"
    fi
[Hadoop] $ /bin/bash -xe /tmp/hudson70396935918211343.sh
++ jps -v
++ grep surefirebooter
++ grep -Dhbase.test
++ wc -l
grep: unknown devices method
+ ZOMBIE_TESTS_COUNT=0
/tmp/hudson70396935918211343.sh: line 30: syntax error: unexpected end of file
POST BUILD TASK : FAILURE
END OF POST BUILD TASK : 0
Archiving artifacts

Mime
View raw message