hbase-builds mailing list archives

Site index · List index
Message view « Date » · « Thread »
Top « Date » · « Thread »
From Apache Jenkins Server <jenk...@builds.apache.org>
Subject Build failed in Jenkins: HBase-1.3 » latest1.8,Hadoop #285
Date Wed, 21 Oct 2015 00:17:18 GMT
See <https://builds.apache.org/job/HBase-1.3/jdk=latest1.8,label=Hadoop/285/changes>

Changes:

[stack] HBASE-14656 Move TestAssignmentManager from medium to large category

------------------------------------------
[...truncated 45683 lines...]
Running org.apache.hadoop.hbase.TestNamespace
Tests run: 3, Failures: 0, Errors: 0, Skipped: 0, Time elapsed: 28.935 sec - in org.apache.hadoop.hbase.TestHColumnDescriptorDefaultVersions
Java HotSpot(TM) 64-Bit Server VM warning: ignoring option MaxPermSize=256m; support was removed
in 8.0
Running org.apache.hadoop.hbase.constraint.TestConstraint
Tests run: 8, Failures: 0, Errors: 0, Skipped: 0, Time elapsed: 38.148 sec - in org.apache.hadoop.hbase.TestNamespace
Java HotSpot(TM) 64-Bit Server VM warning: ignoring option MaxPermSize=256m; support was removed
in 8.0
Java HotSpot(TM) 64-Bit Server VM warning: ignoring option MaxPermSize=256m; support was removed
in 8.0
Running org.apache.hadoop.hbase.TestZooKeeper
Tests run: 12, Failures: 0, Errors: 0, Skipped: 0, Time elapsed: 166.251 sec - in org.apache.hadoop.hbase.client.TestMetaWithReplicas
Java HotSpot(TM) 64-Bit Server VM warning: ignoring option MaxPermSize=256m; support was removed
in 8.0
Tests run: 5, Failures: 0, Errors: 0, Skipped: 0, Time elapsed: 23.754 sec - in org.apache.hadoop.hbase.constraint.TestConstraint
Java HotSpot(TM) 64-Bit Server VM warning: ignoring option MaxPermSize=256m; support was removed
in 8.0
Running org.apache.hadoop.hbase.snapshot.TestFlushSnapshotFromClient
Tests run: 14, Failures: 0, Errors: 0, Skipped: 0, Time elapsed: 258.611 sec - in org.apache.hadoop.hbase.client.TestReplicasClient
Java HotSpot(TM) 64-Bit Server VM warning: ignoring option MaxPermSize=256m; support was removed
in 8.0
Tests run: 5, Failures: 0, Errors: 0, Skipped: 0, Time elapsed: 144.075 sec - in org.apache.hadoop.hbase.client.TestRestoreSnapshotFromClient
Java HotSpot(TM) 64-Bit Server VM warning: ignoring option MaxPermSize=256m; support was removed
in 8.0
Running org.apache.hadoop.hbase.snapshot.TestExportSnapshot
Java HotSpot(TM) 64-Bit Server VM warning: ignoring option MaxPermSize=256m; support was removed
in 8.0
Running org.apache.hadoop.hbase.snapshot.TestRestoreFlushSnapshotFromClient
Running org.apache.hadoop.hbase.snapshot.TestSecureExportSnapshot
Tests run: 9, Failures: 0, Errors: 0, Skipped: 0, Time elapsed: 73.406 sec - in org.apache.hadoop.hbase.snapshot.TestFlushSnapshotFromClient
Java HotSpot(TM) 64-Bit Server VM warning: ignoring option MaxPermSize=256m; support was removed
in 8.0
Running org.apache.hadoop.hbase.snapshot.TestSnapshotClientRetries
Tests run: 5, Failures: 0, Errors: 0, Skipped: 0, Time elapsed: 64.734 sec - in org.apache.hadoop.hbase.snapshot.TestRestoreFlushSnapshotFromClient
Java HotSpot(TM) 64-Bit Server VM warning: ignoring option MaxPermSize=256m; support was removed
in 8.0
Running org.apache.hadoop.hbase.snapshot.TestSnapshotDescriptionUtils
Tests run: 2, Failures: 0, Errors: 0, Skipped: 0, Time elapsed: 0.205 sec - in org.apache.hadoop.hbase.snapshot.TestSnapshotDescriptionUtils
Java HotSpot(TM) 64-Bit Server VM warning: ignoring option MaxPermSize=256m; support was removed
in 8.0
Running org.apache.hadoop.hbase.TestIOFencing
Tests run: 2, Failures: 0, Errors: 0, Skipped: 0, Time elapsed: 21.127 sec - in org.apache.hadoop.hbase.snapshot.TestSnapshotClientRetries
Java HotSpot(TM) 64-Bit Server VM warning: ignoring option MaxPermSize=256m; support was removed
in 8.0
Running org.apache.hadoop.hbase.coprocessor.TestRegionObserverScannerOpenHook
Tests run: 3, Failures: 0, Errors: 0, Skipped: 0, Time elapsed: 15.046 sec - in org.apache.hadoop.hbase.coprocessor.TestRegionObserverScannerOpenHook
Java HotSpot(TM) 64-Bit Server VM warning: ignoring option MaxPermSize=256m; support was removed
in 8.0
Running org.apache.hadoop.hbase.coprocessor.TestOpenTableInCoprocessor
Tests run: 2, Failures: 0, Errors: 0, Skipped: 0, Time elapsed: 18.423 sec - in org.apache.hadoop.hbase.coprocessor.TestOpenTableInCoprocessor
Java HotSpot(TM) 64-Bit Server VM warning: ignoring option MaxPermSize=256m; support was removed
in 8.0
Running org.apache.hadoop.hbase.coprocessor.TestMasterCoprocessorExceptionWithAbort
Tests run: 1, Failures: 0, Errors: 0, Skipped: 0, Time elapsed: 17.49 sec - in org.apache.hadoop.hbase.coprocessor.TestMasterCoprocessorExceptionWithAbort
Java HotSpot(TM) 64-Bit Server VM warning: ignoring option MaxPermSize=256m; support was removed
in 8.0
Tests run: 12, Failures: 0, Errors: 0, Skipped: 0, Time elapsed: 197.265 sec - in org.apache.hadoop.hbase.TestZooKeeper
Java HotSpot(TM) 64-Bit Server VM warning: ignoring option MaxPermSize=256m; support was removed
in 8.0
Java HotSpot(TM) 64-Bit Server VM warning: ignoring option MaxPermSize=256m; support was removed
in 8.0
Java HotSpot(TM) 64-Bit Server VM warning: ignoring option MaxPermSize=256m; support was removed
in 8.0
Running org.apache.hadoop.hbase.coprocessor.TestCoprocessorTableEndpoint
Tests run: 2, Failures: 0, Errors: 0, Skipped: 0, Time elapsed: 11.528 sec - in org.apache.hadoop.hbase.coprocessor.TestCoprocessorTableEndpoint
Java HotSpot(TM) 64-Bit Server VM warning: ignoring option MaxPermSize=256m; support was removed
in 8.0
Running org.apache.hadoop.hbase.coprocessor.TestRegionServerCoprocessorEndpoint
Tests run: 2, Failures: 0, Errors: 0, Skipped: 0, Time elapsed: 1.579 sec - in org.apache.hadoop.hbase.coprocessor.TestRegionServerCoprocessorEndpoint
Java HotSpot(TM) 64-Bit Server VM warning: ignoring option MaxPermSize=256m; support was removed
in 8.0
Running org.apache.hadoop.hbase.coprocessor.TestRegionObserverInterface
Running org.apache.hadoop.hbase.coprocessor.TestMasterCoprocessorExceptionWithRemove
Tests run: 2, Failures: 0, Errors: 0, Skipped: 0, Time elapsed: 114.667 sec - in org.apache.hadoop.hbase.TestIOFencing
Java HotSpot(TM) 64-Bit Server VM warning: ignoring option MaxPermSize=256m; support was removed
in 8.0
Tests run: 1, Failures: 0, Errors: 0, Skipped: 0, Time elapsed: 7.461 sec - in org.apache.hadoop.hbase.coprocessor.TestMasterCoprocessorExceptionWithRemove
Java HotSpot(TM) 64-Bit Server VM warning: ignoring option MaxPermSize=256m; support was removed
in 8.0
Running org.apache.hadoop.hbase.coprocessor.TestAggregateProtocol
Running org.apache.hadoop.hbase.coprocessor.TestBatchCoprocessorEndpoint
Tests run: 4, Failures: 0, Errors: 0, Skipped: 0, Time elapsed: 1.842 sec - in org.apache.hadoop.hbase.coprocessor.TestBatchCoprocessorEndpoint
Java HotSpot(TM) 64-Bit Server VM warning: ignoring option MaxPermSize=256m; support was removed
in 8.0
Tests run: 44, Failures: 0, Errors: 0, Skipped: 0, Time elapsed: 5.244 sec - in org.apache.hadoop.hbase.coprocessor.TestAggregateProtocol
Java HotSpot(TM) 64-Bit Server VM warning: ignoring option MaxPermSize=256m; support was removed
in 8.0
Running org.apache.hadoop.hbase.coprocessor.TestRegionServerObserver
Running org.apache.hadoop.hbase.coprocessor.TestHTableWrapper
Tests run: 1, Failures: 0, Errors: 0, Skipped: 0, Time elapsed: 5.495 sec - in org.apache.hadoop.hbase.coprocessor.TestHTableWrapper
Java HotSpot(TM) 64-Bit Server VM warning: ignoring option MaxPermSize=256m; support was removed
in 8.0
Java HotSpot(TM) 64-Bit Server VM warning: ignoring option MaxPermSize=256m; support was removed
in 8.0
Java HotSpot(TM) 64-Bit Server VM warning: ignoring option MaxPermSize=256m; support was removed
in 8.0
Tests run: 1, Failures: 0, Errors: 0, Skipped: 0, Time elapsed: 18.925 sec - in org.apache.hadoop.hbase.coprocessor.TestRegionServerObserver
Java HotSpot(TM) 64-Bit Server VM warning: ignoring option MaxPermSize=256m; support was removed
in 8.0
Running org.apache.hadoop.hbase.coprocessor.TestRegionServerCoprocessorExceptionWithAbort
Running org.apache.hadoop.hbase.coprocessor.TestClassLoading
Tests run: 2, Failures: 0, Errors: 0, Skipped: 0, Time elapsed: 22.496 sec - in org.apache.hadoop.hbase.coprocessor.TestRegionServerCoprocessorExceptionWithAbort
Java HotSpot(TM) 64-Bit Server VM warning: ignoring option MaxPermSize=256m; support was removed
in 8.0
Tests run: 14, Failures: 0, Errors: 0, Skipped: 2, Time elapsed: 78.396 sec - in org.apache.hadoop.hbase.coprocessor.TestRegionObserverInterface
Java HotSpot(TM) 64-Bit Server VM warning: ignoring option MaxPermSize=256m; support was removed
in 8.0
Tests run: 9, Failures: 0, Errors: 0, Skipped: 0, Time elapsed: 29.084 sec - in org.apache.hadoop.hbase.coprocessor.TestClassLoading
Java HotSpot(TM) 64-Bit Server VM warning: ignoring option MaxPermSize=256m; support was removed
in 8.0
Running org.apache.hadoop.hbase.coprocessor.TestDoubleColumnInterpreter
Tests run: 38, Failures: 0, Errors: 0, Skipped: 0, Time elapsed: 5.498 sec - in org.apache.hadoop.hbase.coprocessor.TestDoubleColumnInterpreter
Java HotSpot(TM) 64-Bit Server VM warning: ignoring option MaxPermSize=256m; support was removed
in 8.0
Running org.apache.hadoop.hbase.coprocessor.TestRegionObserverBypass
Running org.apache.hadoop.hbase.coprocessor.TestRowProcessorEndpoint
Tests run: 2, Failures: 0, Errors: 0, Skipped: 0, Time elapsed: 9.241 sec - in org.apache.hadoop.hbase.coprocessor.TestRegionObserverBypass
Java HotSpot(TM) 64-Bit Server VM warning: ignoring option MaxPermSize=256m; support was removed
in 8.0
Running org.apache.hadoop.hbase.coprocessor.TestCoprocessorStop
Running org.apache.hadoop.hbase.coprocessor.TestRegionServerCoprocessorExceptionWithRemove
Tests run: 4, Failures: 0, Errors: 0, Skipped: 0, Time elapsed: 18.283 sec - in org.apache.hadoop.hbase.coprocessor.TestRowProcessorEndpoint
Java HotSpot(TM) 64-Bit Server VM warning: ignoring option MaxPermSize=256m; support was removed
in 8.0
Tests run: 1, Failures: 0, Errors: 0, Skipped: 0, Time elapsed: 16.685 sec - in org.apache.hadoop.hbase.coprocessor.TestCoprocessorStop
Java HotSpot(TM) 64-Bit Server VM warning: ignoring option MaxPermSize=256m; support was removed
in 8.0
Tests run: 9, Failures: 0, Errors: 0, Skipped: 0, Time elapsed: 309.35 sec - in org.apache.hadoop.hbase.snapshot.TestExportSnapshot
Java HotSpot(TM) 64-Bit Server VM warning: ignoring option MaxPermSize=256m; support was removed
in 8.0
Running org.apache.hadoop.hbase.coprocessor.TestBigDecimalColumnInterpreter
Tests run: 1, Failures: 0, Errors: 0, Skipped: 0, Time elapsed: 15.697 sec - in org.apache.hadoop.hbase.coprocessor.TestRegionServerCoprocessorExceptionWithRemove
Java HotSpot(TM) 64-Bit Server VM warning: ignoring option MaxPermSize=256m; support was removed
in 8.0
Running org.apache.hadoop.hbase.coprocessor.TestMasterObserver
Tests run: 38, Failures: 0, Errors: 0, Skipped: 0, Time elapsed: 5.211 sec - in org.apache.hadoop.hbase.coprocessor.TestBigDecimalColumnInterpreter
Java HotSpot(TM) 64-Bit Server VM warning: ignoring option MaxPermSize=256m; support was removed
in 8.0
Running org.apache.hadoop.hbase.TestGlobalMemStoreSize
Running org.apache.hadoop.hbase.coprocessor.TestCoprocessorEndpoint
Tests run: 6, Failures: 0, Errors: 0, Skipped: 0, Time elapsed: 2.772 sec - in org.apache.hadoop.hbase.coprocessor.TestCoprocessorEndpoint
Java HotSpot(TM) 64-Bit Server VM warning: ignoring option MaxPermSize=256m; support was removed
in 8.0
Running org.apache.hadoop.hbase.coprocessor.TestWALObserver
Tests run: 9, Failures: 0, Errors: 0, Skipped: 0, Time elapsed: 305.32 sec - in org.apache.hadoop.hbase.snapshot.TestSecureExportSnapshot
Java HotSpot(TM) 64-Bit Server VM warning: ignoring option MaxPermSize=256m; support was removed
in 8.0
Tests run: 6, Failures: 0, Errors: 0, Skipped: 0, Time elapsed: 9.943 sec - in org.apache.hadoop.hbase.coprocessor.TestWALObserver
Java HotSpot(TM) 64-Bit Server VM warning: ignoring option MaxPermSize=256m; support was removed
in 8.0
Java HotSpot(TM) 64-Bit Server VM warning: ignoring option MaxPermSize=256m; support was removed
in 8.0
Java HotSpot(TM) 64-Bit Server VM warning: ignoring option MaxPermSize=256m; support was removed
in 8.0
Running org.apache.hadoop.hbase.TestJMXListener
Java HotSpot(TM) 64-Bit Server VM warning: ignoring option MaxPermSize=256m; support was removed
in 8.0
Running org.apache.hadoop.hbase.TestStochasticBalancerJmxMetrics
Tests run: 1, Failures: 0, Errors: 0, Skipped: 0, Time elapsed: 19.972 sec - in org.apache.hadoop.hbase.TestGlobalMemStoreSize
Java HotSpot(TM) 64-Bit Server VM warning: ignoring option MaxPermSize=256m; support was removed
in 8.0
Running org.apache.hadoop.hbase.TestMetaTableLocator
Tests run: 2, Failures: 0, Errors: 0, Skipped: 0, Time elapsed: 1.541 sec - in org.apache.hadoop.hbase.TestStochasticBalancerJmxMetrics
Java HotSpot(TM) 64-Bit Server VM warning: ignoring option MaxPermSize=256m; support was removed
in 8.0
Running org.apache.hadoop.hbase.zookeeper.TestZKTableStateManager
Tests run: 1, Failures: 0, Errors: 0, Skipped: 0, Time elapsed: 0.672 sec - in org.apache.hadoop.hbase.zookeeper.TestZKTableStateManager
Java HotSpot(TM) 64-Bit Server VM warning: ignoring option MaxPermSize=256m; support was removed
in 8.0
Tests run: 7, Failures: 0, Errors: 0, Skipped: 0, Time elapsed: 3.373 sec - in org.apache.hadoop.hbase.TestMetaTableLocator
Java HotSpot(TM) 64-Bit Server VM warning: ignoring option MaxPermSize=256m; support was removed
in 8.0
Running org.apache.hadoop.hbase.zookeeper.TestZKMulti
Running org.apache.hadoop.hbase.zookeeper.lock.TestZKInterProcessReadWriteLock
Tests run: 12, Failures: 0, Errors: 0, Skipped: 0, Time elapsed: 1.208 sec - in org.apache.hadoop.hbase.zookeeper.TestZKMulti
Java HotSpot(TM) 64-Bit Server VM warning: ignoring option MaxPermSize=256m; support was removed
in 8.0
Running org.apache.hadoop.hbase.zookeeper.TestZKLeaderManager
Tests run: 1, Failures: 0, Errors: 0, Skipped: 0, Time elapsed: 0.108 sec - in org.apache.hadoop.hbase.zookeeper.TestZKLeaderManager
Java HotSpot(TM) 64-Bit Server VM warning: ignoring option MaxPermSize=256m; support was removed
in 8.0
Java HotSpot(TM) 64-Bit Server VM warning: ignoring option MaxPermSize=256m; support was removed
in 8.0
Running org.apache.hadoop.hbase.zookeeper.TestRecoverableZooKeeper
Tests run: 1, Failures: 0, Errors: 0, Skipped: 0, Time elapsed: 1.214 sec - in org.apache.hadoop.hbase.zookeeper.TestRecoverableZooKeeper
Java HotSpot(TM) 64-Bit Server VM warning: ignoring option MaxPermSize=256m; support was removed
in 8.0
Java HotSpot(TM) 64-Bit Server VM warning: ignoring option MaxPermSize=256m; support was removed
in 8.0
Running org.apache.hadoop.hbase.zookeeper.TestZooKeeperACL
Tests run: 7, Failures: 0, Errors: 0, Skipped: 0, Time elapsed: 0.439 sec - in org.apache.hadoop.hbase.zookeeper.TestZooKeeperACL
Running org.apache.hadoop.hbase.zookeeper.TestZooKeeperNodeTracker
Java HotSpot(TM) 64-Bit Server VM warning: ignoring option MaxPermSize=256m; support was removed
in 8.0
Tests run: 3, Failures: 0, Errors: 0, Skipped: 0, Time elapsed: 0.732 sec - in org.apache.hadoop.hbase.zookeeper.TestZooKeeperNodeTracker
Java HotSpot(TM) 64-Bit Server VM warning: ignoring option MaxPermSize=256m; support was removed
in 8.0
Running org.apache.hadoop.hbase.zookeeper.TestHQuorumPeer
Tests run: 2, Failures: 0, Errors: 0, Skipped: 0, Time elapsed: 16.3 sec - in org.apache.hadoop.hbase.TestJMXListener
Tests run: 4, Failures: 0, Errors: 0, Skipped: 0, Time elapsed: 1.112 sec - in org.apache.hadoop.hbase.zookeeper.TestHQuorumPeer
Java HotSpot(TM) 64-Bit Server VM warning: ignoring option MaxPermSize=256m; support was removed
in 8.0
Java HotSpot(TM) 64-Bit Server VM warning: ignoring option MaxPermSize=256m; support was removed
in 8.0
Running org.apache.hadoop.hbase.TestClusterBootOrder
Tests run: 9, Failures: 0, Errors: 0, Skipped: 0, Time elapsed: 42.159 sec - in org.apache.hadoop.hbase.coprocessor.TestMasterObserver
Java HotSpot(TM) 64-Bit Server VM warning: ignoring option MaxPermSize=256m; support was removed
in 8.0
Java HotSpot(TM) 64-Bit Server VM warning: ignoring option MaxPermSize=256m; support was removed
in 8.0
Running org.apache.hadoop.hbase.TestPartialResultsFromClientSide
Running org.apache.hadoop.hbase.TestServerSideScanMetricsFromClientSide
Tests run: 6, Failures: 0, Errors: 0, Skipped: 0, Time elapsed: 24.645 sec - in org.apache.hadoop.hbase.zookeeper.lock.TestZKInterProcessReadWriteLock
Tests run: 2, Failures: 0, Errors: 0, Skipped: 0, Time elapsed: 2.802 sec - in org.apache.hadoop.hbase.TestServerSideScanMetricsFromClientSide
Tests run: 2, Failures: 0, Errors: 0, Skipped: 0, Time elapsed: 32.432 sec - in org.apache.hadoop.hbase.TestClusterBootOrder
Tests run: 13, Failures: 0, Errors: 0, Skipped: 0, Time elapsed: 43.141 sec - in org.apache.hadoop.hbase.TestPartialResultsFromClientSide

Results :

Tests run: 2437, Failures: 0, Errors: 0, Skipped: 61

[INFO] ------------------------------------------------------------------------
[INFO] Reactor Summary:
[INFO] 
[INFO] Apache HBase ...................................... SUCCESS [1:24.540s]
[INFO] Apache HBase - Checkstyle ......................... SUCCESS [5.236s]
[INFO] Apache HBase - Resource Bundle .................... SUCCESS [0.151s]
[INFO] Apache HBase - Annotations ........................ SUCCESS [1.054s]
[INFO] Apache HBase - Protocol ........................... SUCCESS [16.479s]
[INFO] Apache HBase - Common ............................. SUCCESS [1:50.561s]
[INFO] Apache HBase - Procedure .......................... SUCCESS [1:52.892s]
[INFO] Apache HBase - Client ............................. SUCCESS [1:22.026s]
[INFO] Apache HBase - Hadoop Compatibility ............... SUCCESS [8.147s]
[INFO] Apache HBase - Hadoop Two Compatibility ........... SUCCESS [7.822s]
[INFO] Apache HBase - Prefix Tree ........................ SUCCESS [7.711s]
[INFO] Apache HBase - Server ............................. FAILURE [1:43:15.671s]
[INFO] Apache HBase - Testing Util ....................... SKIPPED
[INFO] Apache HBase - Thrift ............................. SKIPPED
[INFO] Apache HBase - Rest ............................... SKIPPED
[INFO] Apache HBase - Shell .............................. SKIPPED
[INFO] Apache HBase - Integration Tests .................. SKIPPED
[INFO] Apache HBase - Examples ........................... SKIPPED
[INFO] Apache HBase - External Block Cache ............... SKIPPED
[INFO] Apache HBase - Assembly ........................... SKIPPED
[INFO] Apache HBase - Shaded ............................. SKIPPED
[INFO] Apache HBase - Shaded - Client .................... SKIPPED
[INFO] Apache HBase - Shaded - Server .................... SKIPPED
[INFO] ------------------------------------------------------------------------
[INFO] BUILD FAILURE
[INFO] ------------------------------------------------------------------------
[INFO] Total time: 1:50:58.633s
[INFO] Finished at: Wed Oct 21 00:15:59 UTC 2015
[INFO] Final Memory: 450M/729M
[INFO] ------------------------------------------------------------------------
[ERROR] Failed to execute goal org.apache.maven.plugins:maven-surefire-plugin:2.18.1:test
(secondPartTestsExecution) on project hbase-server: There was a timeout or other error in
the fork -> [Help 1]
[ERROR] 
[ERROR] To see the full stack trace of the errors, re-run Maven with the -e switch.
[ERROR] Re-run Maven using the -X switch to enable full debug logging.
[ERROR] 
[ERROR] For more information about the errors and possible solutions, please read the following
articles:
[ERROR] [Help 1] http://cwiki.apache.org/confluence/display/MAVEN/MojoFailureException
[ERROR] 
[ERROR] After correcting the problems, you can resume the build with the command
[ERROR]   mvn <goals> -rf :hbase-server
Build step 'Invoke top-level Maven targets' marked build as failure
Performing Post build task...
Match found for :.* : True
Logical operation result is TRUE
Running script  :     ZOMBIE_TESTS_COUNT=`jps -v | grep surefirebooter | grep '-Dhbase.test'
| wc -l`
  if [[ $ZOMBIE_TESTS_COUNT != 0 ]] ; then
    #It seems sometimes the tests are not dying immediately. Let's give them 30s
    echo "Suspicious java process found - waiting 30s to see if there are just slow to stop"
    sleep 30
    ZOMBIE_TESTS_COUNT=`jps -v | grep surefirebooter | grep '-Dhbase.test' | wc -l`
    if [[ $ZOMBIE_TESTS_COUNT != 0 ]] ; then
      echo "There are $ZOMBIE_TESTS_COUNT zombie tests, they should have been killed by surefire
but survived"
      echo "************ zombies jps listing"
      jps -v
      jps -v | grep surefirebooter | grep '-Dhbase.test'
      echo "************ BEGIN zombies jstack extract"
      # HBase tests have been flagged with an innocuous '-Dhbase.test' just so they can
      # be identified as hbase in a process listing.
      ZB_STACK=`jps -v | grep surefirebooter | grep '-Dhbase.test' | cut -d ' ' -f 1 | xargs
-n 1 jstack | grep ".test" | grep "\.java"`
      jps -v | grep surefirebooter | grep '-Dhbase.test' | cut -d ' ' -f 1 | xargs -n 1 jstack
      echo "************ END  zombies jstack extract"
      JIRA_COMMENT="$JIRA_COMMENT

     {color:red}-1 core zombie tests{color}.  There are ${ZOMBIE_TESTS_COUNT} zombie test(s):
${ZB_STACK}"
      BAD=1
      # Killing these zombies
      echo 'Killing ZOMBIES!!!'
      jps -v
      jps -v | grep surefirebooter | grep '-Dhbase.test' | cut -d ' ' -f 1 | xargs kill -9
    else
      echo "We're ok: there is no zombie test, but some tests took some time to stop"
    fi
[Hadoop] $ /bin/bash -xe /tmp/hudson2046378997266679009.sh
++ jps -v
++ grep surefirebooter
++ wc -l
++ grep -Dhbase.test
grep: unknown devices method
grep: write error: Broken pipe
+ ZOMBIE_TESTS_COUNT=0
/tmp/hudson2046378997266679009.sh: line 30: syntax error: unexpected end of file
POST BUILD TASK : FAILURE
END OF POST BUILD TASK : 0
Archiving artifacts

Mime
View raw message