hbase-builds mailing list archives

Site index · List index
Message view « Date » · « Thread »
Top « Date » · « Thread »
From Apache Jenkins Server <jenk...@builds.apache.org>
Subject Build failed in Jenkins: HBase-1.2 » latest1.7,Hadoop #274
Date Mon, 19 Oct 2015 18:44:14 GMT
See <https://builds.apache.org/job/HBase-1.2/jdk=latest1.7,label=Hadoop/274/changes>

Changes:

[stack] HBASE-14646 Move TestCellACLs from medium to large category

[stack] HBASE-14647 Disable

------------------------------------------
[...truncated 43125 lines...]
36/246 KB   281/281 KB   20/20 KB   25/25 KB   
40/246 KB   281/281 KB   20/20 KB   25/25 KB   
44/246 KB   281/281 KB   20/20 KB   25/25 KB   
48/246 KB   281/281 KB   20/20 KB   25/25 KB   
52/246 KB   281/281 KB   20/20 KB   25/25 KB   
56/246 KB   281/281 KB   20/20 KB   25/25 KB   
60/246 KB   281/281 KB   20/20 KB   25/25 KB   
64/246 KB   281/281 KB   20/20 KB   25/25 KB   
68/246 KB   281/281 KB   20/20 KB   25/25 KB   
72/246 KB   281/281 KB   20/20 KB   25/25 KB   
76/246 KB   281/281 KB   20/20 KB   25/25 KB   
80/246 KB   281/281 KB   20/20 KB   25/25 KB   
84/246 KB   281/281 KB   20/20 KB   25/25 KB   
88/246 KB   281/281 KB   20/20 KB   25/25 KB   
92/246 KB   281/281 KB   20/20 KB   25/25 KB   
92/246 KB   4/5 KB   281/281 KB   20/20 KB   25/25 KB   
96/246 KB   4/5 KB   281/281 KB   20/20 KB   25/25 KB   
96/246 KB   5/5 KB   281/281 KB   20/20 KB   25/25 KB   
100/246 KB   5/5 KB   281/281 KB   20/20 KB   25/25 KB   
104/246 KB   5/5 KB   281/281 KB   20/20 KB   25/25 KB   
108/246 KB   5/5 KB   281/281 KB   20/20 KB   25/25 KB   
112/246 KB   5/5 KB   281/281 KB   20/20 KB   25/25 KB   
116/246 KB   5/5 KB   281/281 KB   20/20 KB   25/25 KB   
120/246 KB   5/5 KB   281/281 KB   20/20 KB   25/25 KB   
124/246 KB   5/5 KB   281/281 KB   20/20 KB   25/25 KB   
128/246 KB   5/5 KB   281/281 KB   20/20 KB   25/25 KB   
132/246 KB   5/5 KB   281/281 KB   20/20 KB   25/25 KB   
136/246 KB   5/5 KB   281/281 KB   20/20 KB   25/25 KB   
140/246 KB   5/5 KB   281/281 KB   20/20 KB   25/25 KB   
144/246 KB   5/5 KB   281/281 KB   20/20 KB   25/25 KB   
148/246 KB   5/5 KB   281/281 KB   20/20 KB   25/25 KB   
152/246 KB   5/5 KB   281/281 KB   20/20 KB   25/25 KB   
156/246 KB   5/5 KB   281/281 KB   20/20 KB   25/25 KB   
160/246 KB   5/5 KB   281/281 KB   20/20 KB   25/25 KB   
164/246 KB   5/5 KB   281/281 KB   20/20 KB   25/25 KB   
168/246 KB   5/5 KB   281/281 KB   20/20 KB   25/25 KB   
172/246 KB   5/5 KB   281/281 KB   20/20 KB   25/25 KB   
176/246 KB   5/5 KB   281/281 KB   20/20 KB   25/25 KB   
180/246 KB   5/5 KB   281/281 KB   20/20 KB   25/25 KB   
184/246 KB   5/5 KB   281/281 KB   20/20 KB   25/25 KB   
188/246 KB   5/5 KB   281/281 KB   20/20 KB   25/25 KB   
192/246 KB   5/5 KB   281/281 KB   20/20 KB   25/25 KB   
196/246 KB   5/5 KB   281/281 KB   20/20 KB   25/25 KB   
200/246 KB   5/5 KB   281/281 KB   20/20 KB   25/25 KB   
204/246 KB   5/5 KB   281/281 KB   20/20 KB   25/25 KB   
208/246 KB   5/5 KB   281/281 KB   20/20 KB   25/25 KB   
212/246 KB   5/5 KB   281/281 KB   20/20 KB   25/25 KB   
216/246 KB   5/5 KB   281/281 KB   20/20 KB   25/25 KB   
220/246 KB   5/5 KB   281/281 KB   20/20 KB   25/25 KB   
224/246 KB   5/5 KB   281/281 KB   20/20 KB   25/25 KB   
228/246 KB   5/5 KB   281/281 KB   20/20 KB   25/25 KB   
232/246 KB   5/5 KB   281/281 KB   20/20 KB   25/25 KB   
236/246 KB   5/5 KB   281/281 KB   20/20 KB   25/25 KB   
240/246 KB   5/5 KB   281/281 KB   20/20 KB   25/25 KB   
244/246 KB   5/5 KB   281/281 KB   20/20 KB   25/25 KB   
246/246 KB   5/5 KB   281/281 KB   20/20 KB   25/25 KB   
                                                         
Downloaded: http://repo.maven.apache.org/maven2/org/jamon/jamon-processor/2.4.1/jamon-processor-2.4.1.jar
(281 KB at 3188.3 KB/sec)
                                                         
                                                         
Downloaded: http://repo.maven.apache.org/maven2/org/codehaus/plexus/plexus-compiler-api/1.8.1/plexus-compiler-api-1.8.1.jar
(20 KB at 198.9 KB/sec)
Downloaded: http://repo.maven.apache.org/maven2/org/jamon/jamon-runtime/2.4.0/jamon-runtime-2.4.0.jar
(25 KB at 245.6 KB/sec)
                                                         
Downloaded: http://repo.maven.apache.org/maven2/org/jamon/jamon-api/2.3.0/jamon-api-2.3.0.jar
(5 KB at 42.8 KB/sec)
                                                         
Downloaded: http://repo.maven.apache.org/maven2/org/codehaus/plexus/plexus-utils/1.5.5/plexus-utils-1.5.5.jar
(246 KB at 2337.0 KB/sec)
[INFO] Translating 10 templates from <https://builds.apache.org/job/HBase-1.2/jdk=latest1.7,label=Hadoop/ws/hbase-server/src/main/jamon>
to <https://builds.apache.org/job/HBase-1.2/jdk=latest1.7,label=Hadoop/ws/hbase-server/target/generated-jamon>
[INFO] 
[INFO] --- maven-antrun-plugin:1.6:run (generate) @ hbase-server ---
[INFO] Executing tasks

main:
    [mkdir] Created dir: <https://builds.apache.org/job/HBase-1.2/jdk=latest1.7,label=Hadoop/ws/hbase-server/target/hbase-webapps>
     [copy] Copying 20 files to <https://builds.apache.org/job/HBase-1.2/jdk=latest1.7,label=Hadoop/ws/hbase-server/target/hbase-webapps>
log4j:WARN No appenders could be found for logger (org.mortbay.log).
log4j:WARN Please initialize the log4j system properly.
log4j:WARN See http://logging.apache.org/log4j/1.2/faq.html#noconfig for more info.
    [mkdir] Created dir: <https://builds.apache.org/job/HBase-1.2/jdk=latest1.7,label=Hadoop/ws/hbase-server/target/hbase-webapps/master/WEB-INF>
    [mkdir] Created dir: <https://builds.apache.org/job/HBase-1.2/jdk=latest1.7,label=Hadoop/ws/hbase-server/target/hbase-webapps/regionserver/WEB-INF>
[INFO] Executed tasks
[INFO] 
[INFO] --- maven-remote-resources-plugin:1.5:process (default) @ hbase-server ---
[INFO] 
[INFO] --- maven-resources-plugin:2.6:resources (default-resources) @ hbase-server ---
[INFO] Using 'UTF-8' encoding to copy filtered resources.
[INFO] Copying 22 resources
[INFO] Copying 2 resources
[INFO] 
[INFO] --- maven-compiler-plugin:2.5.1:compile (default-compile) @ hbase-server ---
[INFO] Compiling 786 source files to <https://builds.apache.org/job/HBase-1.2/jdk=latest1.7,label=Hadoop/ws/hbase-server/target/classes>
[WARNING] <https://builds.apache.org/job/HBase-1.2/jdk=latest1.7,label=Hadoop/ws/hbase-server/src/main/java/org/apache/hadoop/hbase/zookeeper/RecoveringRegionWatcher.java>:[93,22]
Signal is internal proprietary API and may be removed in a future release
<https://builds.apache.org/job/HBase-1.2/jdk=latest1.7,label=Hadoop/ws/hbase-server/src/main/java/org/apache/hadoop/hbase/zookeeper/RecoveringRegionWatcher.java>:93:
warning: SignalHandler is internal proprietary API and may be removed in a future release
<https://builds.apache.org/job/HBase-1.2/jdk=latest1.7,label=Hadoop/ws/hbase-server/src/main/java/org/apache/hadoop/hbase/regionserver/HRegionServer.java>:605:
warning: Signal is internal proprietary API and may be removed in a future release
[WARNING] <https://builds.apache.org/job/HBase-1.2/jdk=latest1.7,label=Hadoop/ws/hbase-server/src/main/java/org/apache/hadoop/hbase/regionserver/HRegionServer.java>:[605,41]
SignalHandler is internal proprietary API and may be removed in a future release
[WARNING] <https://builds.apache.org/job/HBase-1.2/jdk=latest1.7,label=Hadoop/ws/hbase-server/src/main/java/org/apache/hadoop/hbase/regionserver/HRegionServer.java>:[606,25]
Signal is internal proprietary API and may be removed in a future release
[WARNING] <https://builds.apache.org/job/HBase-1.2/jdk=latest1.7,label=Hadoop/ws/hbase-server/src/main/java/org/apache/hadoop/hbase/regionserver/HRegionServer.java>:[605,4]
Signal is internal proprietary API and may be removed in a future release
[INFO] 
[INFO] --- maven-dependency-plugin:2.1:build-classpath (create-mrapp-generated-classpath)
@ hbase-server ---
[INFO] Wrote classpath file '<https://builds.apache.org/job/HBase-1.2/jdk=latest1.7,label=Hadoop/ws/hbase-server/target/test-classes/mrapp-generated-classpath'.>
[INFO] 
[INFO] --- maven-resources-plugin:2.6:testResources (default-testResources) @ hbase-server
---
[INFO] Using 'UTF-8' encoding to copy filtered resources.
[INFO] Copying 1 resource to META-INF/
[INFO] Copying 16 resources
[INFO] 
[INFO] --- maven-compiler-plugin:2.5.1:testCompile (default-testCompile) @ hbase-server ---
[INFO] Compiling 733 source files to <https://builds.apache.org/job/HBase-1.2/jdk=latest1.7,label=Hadoop/ws/hbase-server/target/test-classes>
[INFO] -------------------------------------------------------------
[ERROR] COMPILATION ERROR : 
[INFO] -------------------------------------------------------------
[ERROR] <https://builds.apache.org/job/HBase-1.2/jdk=latest1.7,label=Hadoop/ws/hbase-server/src/test/java/org/apache/hadoop/hbase/security/access/TestCellACLs.java>:[159,27]
error: cannot find symbol
[ERROR]   symbol: class HTable
<https://builds.apache.org/job/HBase-1.2/jdk=latest1.7,label=Hadoop/ws/hbase-server/src/test/java/org/apache/hadoop/hbase/security/access/TestCellACLs.java>:[186,27]
error: cannot find symbol
[ERROR]   symbol: class HTable
<https://builds.apache.org/job/HBase-1.2/jdk=latest1.7,label=Hadoop/ws/hbase-server/src/test/java/org/apache/hadoop/hbase/security/access/TestCellACLs.java>:[197,27]
error: cannot find symbol
[ERROR]   symbol: class HTable
<https://builds.apache.org/job/HBase-1.2/jdk=latest1.7,label=Hadoop/ws/hbase-server/src/test/java/org/apache/hadoop/hbase/security/access/TestCellACLs.java>:[208,27]
error: cannot find symbol
[ERROR]   symbol: class HTable
<https://builds.apache.org/job/HBase-1.2/jdk=latest1.7,label=Hadoop/ws/hbase-server/src/test/java/org/apache/hadoop/hbase/security/access/TestCellACLs.java>:[219,27]
error: cannot find symbol
[ERROR]   symbol: class HTable
<https://builds.apache.org/job/HBase-1.2/jdk=latest1.7,label=Hadoop/ws/hbase-server/src/test/java/org/apache/hadoop/hbase/security/access/TestCellACLs.java>:[249,27]
error: cannot find symbol
[ERROR]   symbol: class HTable
<https://builds.apache.org/job/HBase-1.2/jdk=latest1.7,label=Hadoop/ws/hbase-server/src/test/java/org/apache/hadoop/hbase/security/access/TestCellACLs.java>:[284,27]
error: cannot find symbol
[ERROR]   symbol: class HTable
<https://builds.apache.org/job/HBase-1.2/jdk=latest1.7,label=Hadoop/ws/hbase-server/src/test/java/org/apache/hadoop/hbase/security/access/TestCellACLs.java>:[296,27]
error: cannot find symbol
[ERROR]   symbol: class HTable
<https://builds.apache.org/job/HBase-1.2/jdk=latest1.7,label=Hadoop/ws/hbase-server/src/test/java/org/apache/hadoop/hbase/security/access/TestCellACLs.java>:[310,27]
error: cannot find symbol
[ERROR]   symbol: class HTable
<https://builds.apache.org/job/HBase-1.2/jdk=latest1.7,label=Hadoop/ws/hbase-server/src/test/java/org/apache/hadoop/hbase/security/access/TestCellACLs.java>:[322,27]
error: cannot find symbol
[ERROR]   symbol: class HTable
<https://builds.apache.org/job/HBase-1.2/jdk=latest1.7,label=Hadoop/ws/hbase-server/src/test/java/org/apache/hadoop/hbase/security/access/TestCellACLs.java>:[347,27]
error: cannot find symbol
[ERROR]   symbol: class HTable
<https://builds.apache.org/job/HBase-1.2/jdk=latest1.7,label=Hadoop/ws/hbase-server/src/test/java/org/apache/hadoop/hbase/security/access/TestCellACLs.java>:[359,27]
error: cannot find symbol
[ERROR]   symbol: class HTable
<https://builds.apache.org/job/HBase-1.2/jdk=latest1.7,label=Hadoop/ws/hbase-server/src/test/java/org/apache/hadoop/hbase/security/access/TestCellACLs.java>:[396,27]
error: cannot find symbol
[INFO] 13 errors 
[INFO] -------------------------------------------------------------
[INFO] ------------------------------------------------------------------------
[INFO] Reactor Summary:
[INFO] 
[INFO] Apache HBase ...................................... SUCCESS [1:40.239s]
[INFO] Apache HBase - Checkstyle ......................... SUCCESS [8.172s]
[INFO] Apache HBase - Resource Bundle .................... SUCCESS [0.176s]
[INFO] Apache HBase - Annotations ........................ SUCCESS [1.005s]
[INFO] Apache HBase - Protocol ........................... SUCCESS [17.151s]
[INFO] Apache HBase - Common ............................. SUCCESS [4:11.686s]
[INFO] Apache HBase - Procedure .......................... SUCCESS [1:53.132s]
[INFO] Apache HBase - Client ............................. SUCCESS [2:00.603s]
[INFO] Apache HBase - Hadoop Compatibility ............... SUCCESS [7.922s]
[INFO] Apache HBase - Hadoop Two Compatibility ........... SUCCESS [8.403s]
[INFO] Apache HBase - Prefix Tree ........................ SUCCESS [9.301s]
[INFO] Apache HBase - Server ............................. FAILURE [56.004s]
[INFO] Apache HBase - Testing Util ....................... SKIPPED
[INFO] Apache HBase - Thrift ............................. SKIPPED
[INFO] Apache HBase - Rest ............................... SKIPPED
[INFO] Apache HBase - Shell .............................. SKIPPED
[INFO] Apache HBase - Integration Tests .................. SKIPPED
[INFO] Apache HBase - Examples ........................... SKIPPED
[INFO] Apache HBase - External Block Cache ............... SKIPPED
[INFO] Apache HBase - Assembly ........................... SKIPPED
[INFO] Apache HBase - Shaded ............................. SKIPPED
[INFO] Apache HBase - Shaded - Client .................... SKIPPED
[INFO] Apache HBase - Shaded - Server .................... SKIPPED
[INFO] ------------------------------------------------------------------------
[INFO] BUILD FAILURE
[INFO] ------------------------------------------------------------------------
[INFO] Total time: 12:19.235s
[INFO] Finished at: Mon Oct 19 18:44:47 UTC 2015
[INFO] Final Memory: 97M/863M
[INFO] ------------------------------------------------------------------------
[ERROR] Failed to execute goal org.apache.maven.plugins:maven-compiler-plugin:2.5.1:testCompile
(default-testCompile) on project hbase-server: Compilation failure: Compilation failure:
[ERROR] <https://builds.apache.org/job/HBase-1.2/jdk=latest1.7,label=Hadoop/ws/hbase-server/src/test/java/org/apache/hadoop/hbase/security/access/TestCellACLs.java>:[159,27]
error: cannot find symbol
[ERROR] symbol: class HTable
[ERROR] <https://builds.apache.org/job/HBase-1.2/jdk=latest1.7,label=Hadoop/ws/hbase-server/src/test/java/org/apache/hadoop/hbase/security/access/TestCellACLs.java>:[186,27]
error: cannot find symbol
[ERROR] symbol: class HTable
[ERROR] <https://builds.apache.org/job/HBase-1.2/jdk=latest1.7,label=Hadoop/ws/hbase-server/src/test/java/org/apache/hadoop/hbase/security/access/TestCellACLs.java>:[197,27]
error: cannot find symbol
[ERROR] symbol: class HTable
[ERROR] <https://builds.apache.org/job/HBase-1.2/jdk=latest1.7,label=Hadoop/ws/hbase-server/src/test/java/org/apache/hadoop/hbase/security/access/TestCellACLs.java>:[208,27]
error: cannot find symbol
[ERROR] symbol: class HTable
[ERROR] <https://builds.apache.org/job/HBase-1.2/jdk=latest1.7,label=Hadoop/ws/hbase-server/src/test/java/org/apache/hadoop/hbase/security/access/TestCellACLs.java>:[219,27]
error: cannot find symbol
[ERROR] symbol: class HTable
[ERROR] <https://builds.apache.org/job/HBase-1.2/jdk=latest1.7,label=Hadoop/ws/hbase-server/src/test/java/org/apache/hadoop/hbase/security/access/TestCellACLs.java>:[249,27]
error: cannot find symbol
[ERROR] symbol: class HTable
[ERROR] <https://builds.apache.org/job/HBase-1.2/jdk=latest1.7,label=Hadoop/ws/hbase-server/src/test/java/org/apache/hadoop/hbase/security/access/TestCellACLs.java>:[284,27]
error: cannot find symbol
[ERROR] symbol: class HTable
[ERROR] <https://builds.apache.org/job/HBase-1.2/jdk=latest1.7,label=Hadoop/ws/hbase-server/src/test/java/org/apache/hadoop/hbase/security/access/TestCellACLs.java>:[296,27]
error: cannot find symbol
[ERROR] symbol: class HTable
[ERROR] <https://builds.apache.org/job/HBase-1.2/jdk=latest1.7,label=Hadoop/ws/hbase-server/src/test/java/org/apache/hadoop/hbase/security/access/TestCellACLs.java>:[310,27]
error: cannot find symbol
[ERROR] symbol: class HTable
[ERROR] <https://builds.apache.org/job/HBase-1.2/jdk=latest1.7,label=Hadoop/ws/hbase-server/src/test/java/org/apache/hadoop/hbase/security/access/TestCellACLs.java>:[322,27]
error: cannot find symbol
[ERROR] symbol: class HTable
[ERROR] <https://builds.apache.org/job/HBase-1.2/jdk=latest1.7,label=Hadoop/ws/hbase-server/src/test/java/org/apache/hadoop/hbase/security/access/TestCellACLs.java>:[347,27]
error: cannot find symbol
[ERROR] symbol: class HTable
[ERROR] <https://builds.apache.org/job/HBase-1.2/jdk=latest1.7,label=Hadoop/ws/hbase-server/src/test/java/org/apache/hadoop/hbase/security/access/TestCellACLs.java>:[359,27]
error: cannot find symbol
[ERROR] symbol: class HTable
[ERROR] <https://builds.apache.org/job/HBase-1.2/jdk=latest1.7,label=Hadoop/ws/hbase-server/src/test/java/org/apache/hadoop/hbase/security/access/TestCellACLs.java>:[396,27]
error: cannot find symbol
[ERROR] -> [Help 1]
[ERROR] 
[ERROR] To see the full stack trace of the errors, re-run Maven with the -e switch.
[ERROR] Re-run Maven using the -X switch to enable full debug logging.
[ERROR] 
[ERROR] For more information about the errors and possible solutions, please read the following
articles:
[ERROR] [Help 1] http://cwiki.apache.org/confluence/display/MAVEN/MojoFailureException
[ERROR] 
[ERROR] After correcting the problems, you can resume the build with the command
[ERROR]   mvn <goals> -rf :hbase-server
Build step 'Invoke top-level Maven targets' marked build as failure
Performing Post build task...
Match found for :.* : True
Logical operation result is TRUE
Running script  :     ZOMBIE_TESTS_COUNT=`jps -v | grep surefirebooter | grep '-Dhbase.test'
| wc -l`
  if [[ $ZOMBIE_TESTS_COUNT != 0 ]] ; then
    #It seems sometimes the tests are not dying immediately. Let's give them 30s
    echo "Suspicious java process found - waiting 30s to see if there are just slow to stop"
    sleep 30
    ZOMBIE_TESTS_COUNT=`jps -v | grep surefirebooter | grep '-Dhbase.test' | wc -l`
    if [[ $ZOMBIE_TESTS_COUNT != 0 ]] ; then
      echo "There are $ZOMBIE_TESTS_COUNT zombie tests, they should have been killed by surefire
but survived"
      echo "************ zombies jps listing"
      jps -v
      jps -v | grep surefirebooter | grep '-Dhbase.test'
      echo "************ BEGIN zombies jstack extract"
      # HBase tests have been flagged with an innocuous '-Dhbase.test' just so they can
      # be identified as hbase in a process listing.
      ZB_STACK=`jps -v | grep surefirebooter | grep '-Dhbase.test' | cut -d ' ' -f 1 | xargs
-n 1 jstack | grep ".test" | grep "\.java"`
      jps -v | grep surefirebooter | grep '-Dhbase.test' | cut -d ' ' -f 1 | xargs -n 1 jstack
      echo "************ END  zombies jstack extract"
      JIRA_COMMENT="$JIRA_COMMENT

     {color:red}-1 core zombie tests{color}.  There are ${ZOMBIE_TESTS_COUNT} zombie test(s):
${ZB_STACK}"
      BAD=1
      # Killing these zombies
      echo 'Killing ZOMBIES!!!'
      jps -v
      jps -v | grep surefirebooter | grep '-Dhbase.test' | cut -d ' ' -f 1 | xargs kill -9
    else
      echo "We're ok: there is no zombie test, but some tests took some time to stop"
    fi
[Hadoop] $ /bin/bash -xe /tmp/hudson4919235534784267809.sh
++ jps -v
++ grep surefirebooter
++ wc -l
++ grep -Dhbase.test
grep: unknown devices method
+ ZOMBIE_TESTS_COUNT=0
/tmp/hudson4919235534784267809.sh: line 30: syntax error: unexpected end of file
POST BUILD TASK : FAILURE
END OF POST BUILD TASK : 0
Archiving artifacts

Mime
View raw message