hbase-builds mailing list archives

Site index · List index
Message view « Date » · « Thread »
Top « Date » · « Thread »
From Apache Jenkins Server <jenk...@builds.apache.org>
Subject Build failed in Jenkins: HBase-1.1 #713
Date Sat, 17 Oct 2015 01:42:27 GMT
See <https://builds.apache.org/job/HBase-1.1/713/changes>

Changes:

[eclark] HBASE-14621 ReplicationLogCleaner stuck on RS crash.

------------------------------------------
[...truncated 1969 lines...]
Tests run: 2, Failures: 0, Errors: 0, Skipped: 0, Time elapsed: 90.186 sec - in org.apache.hadoop.hbase.regionserver.TestParallelPut
Running org.apache.hadoop.hbase.regionserver.TestWALLockup
Tests run: 1, Failures: 0, Errors: 0, Skipped: 0, Time elapsed: 2.387 sec - in org.apache.hadoop.hbase.regionserver.TestWALLockup
Tests run: 26, Failures: 0, Errors: 0, Skipped: 0, Time elapsed: 14.688 sec - in org.apache.hadoop.hbase.regionserver.TestHRegionReplayEvents
Running org.apache.hadoop.hbase.regionserver.TestCompactionState
Running org.apache.hadoop.hbase.regionserver.TestFSErrorsExposed
Tests run: 3, Failures: 0, Errors: 0, Skipped: 0, Time elapsed: 31.851 sec - in org.apache.hadoop.hbase.regionserver.TestFSErrorsExposed
Running org.apache.hadoop.hbase.regionserver.TestDefaultMemStore
Tests run: 12, Failures: 0, Errors: 0, Skipped: 0, Time elapsed: 227.447 sec - in org.apache.hadoop.hbase.regionserver.TestRegionReplicaFailover
Running org.apache.hadoop.hbase.regionserver.TestRegionServerMetrics
Tests run: 5, Failures: 0, Errors: 0, Skipped: 0, Time elapsed: 46.03 sec - in org.apache.hadoop.hbase.regionserver.TestCompactionState
Running org.apache.hadoop.hbase.regionserver.TestGetClosestAtOrBefore
Tests run: 3, Failures: 0, Errors: 0, Skipped: 0, Time elapsed: 1.877 sec - in org.apache.hadoop.hbase.regionserver.TestGetClosestAtOrBefore
Running org.apache.hadoop.hbase.regionserver.TestRSKilledWhenInitializing
Tests run: 24, Failures: 0, Errors: 0, Skipped: 0, Time elapsed: 25.571 sec - in org.apache.hadoop.hbase.regionserver.TestDefaultMemStore
Running org.apache.hadoop.hbase.regionserver.TestReversibleScanners
Tests run: 10, Failures: 0, Errors: 0, Skipped: 0, Time elapsed: 21.824 sec - in org.apache.hadoop.hbase.regionserver.TestRegionServerMetrics
Tests run: 5, Failures: 0, Errors: 0, Skipped: 0, Time elapsed: 4.317 sec - in org.apache.hadoop.hbase.regionserver.TestReversibleScanners
Running org.apache.hadoop.hbase.regionserver.TestRecoveredEdits
Tests run: 1, Failures: 0, Errors: 0, Skipped: 0, Time elapsed: 16.926 sec - in org.apache.hadoop.hbase.regionserver.TestRSKilledWhenInitializing
Running org.apache.hadoop.hbase.regionserver.TestRegionServerNoMaster
Tests run: 1, Failures: 0, Errors: 0, Skipped: 0, Time elapsed: 11.013 sec - in org.apache.hadoop.hbase.regionserver.TestRecoveredEdits
Running org.apache.hadoop.hbase.regionserver.TestScannerRetriableFailure
Tests run: 5, Failures: 0, Errors: 0, Skipped: 0, Time elapsed: 259.927 sec - in org.apache.hadoop.hbase.regionserver.wal.TestLogRolling
Running org.apache.hadoop.hbase.regionserver.TestScannerWithBulkload
Running org.apache.hadoop.hbase.regionserver.TestClusterId
Tests run: 9, Failures: 0, Errors: 0, Skipped: 0, Time elapsed: 17.511 sec - in org.apache.hadoop.hbase.regionserver.TestRegionServerNoMaster
Running org.apache.hadoop.hbase.regionserver.TestRegionServerHostname
Tests run: 3, Failures: 0, Errors: 0, Skipped: 0, Time elapsed: 10.569 sec - in org.apache.hadoop.hbase.regionserver.TestScannerWithBulkload
Running org.apache.hadoop.hbase.regionserver.TestCompaction
Tests run: 7, Failures: 0, Errors: 0, Skipped: 0, Time elapsed: 172.99 sec - in org.apache.hadoop.hbase.regionserver.TestRegionReplicas
Running org.apache.hadoop.hbase.regionserver.TestSplitWalDataLoss
Tests run: 2, Failures: 0, Errors: 0, Skipped: 0, Time elapsed: 14.937 sec - in org.apache.hadoop.hbase.regionserver.TestRegionServerHostname
Tests run: 2, Failures: 0, Errors: 0, Skipped: 0, Time elapsed: 24.589 sec - in org.apache.hadoop.hbase.regionserver.TestClusterId
Running org.apache.hadoop.hbase.regionserver.TestPerColumnFamilyFlush
Tests run: 1, Failures: 0, Errors: 0, Skipped: 0, Time elapsed: 34.495 sec - in org.apache.hadoop.hbase.regionserver.TestScannerRetriableFailure
Tests run: 1, Failures: 0, Errors: 0, Skipped: 0, Time elapsed: 13.235 sec - in org.apache.hadoop.hbase.regionserver.TestSplitWalDataLoss
Running org.apache.hadoop.hbase.regionserver.compactions.TestCompactionWithThroughputController
Tests run: 5, Failures: 0, Errors: 0, Skipped: 0, Time elapsed: 23.392 sec - in org.apache.hadoop.hbase.regionserver.TestCompaction
Running org.apache.hadoop.hbase.regionserver.TestServerCustomProtocol
Running org.apache.hadoop.hbase.regionserver.TestRegionFavoredNodes
Running org.apache.hadoop.hbase.regionserver.TestSeekOptimizations
Tests run: 6, Failures: 0, Errors: 0, Skipped: 0, Time elapsed: 5.918 sec - in org.apache.hadoop.hbase.regionserver.TestSeekOptimizations
Running org.apache.hadoop.hbase.regionserver.TestHRegion
Tests run: 1, Failures: 0, Errors: 0, Skipped: 0, Time elapsed: 9.126 sec - in org.apache.hadoop.hbase.regionserver.TestRegionFavoredNodes
Running org.apache.hadoop.hbase.regionserver.TestAtomicOperation
Tests run: 7, Failures: 0, Errors: 0, Skipped: 0, Time elapsed: 39.826 sec - in org.apache.hadoop.hbase.regionserver.TestServerCustomProtocol
Running org.apache.hadoop.hbase.regionserver.TestSplitTransactionOnCluster
Tests run: 6, Failures: 0, Errors: 0, Skipped: 0, Time elapsed: 40.488 sec - in org.apache.hadoop.hbase.regionserver.TestAtomicOperation
Running org.apache.hadoop.hbase.regionserver.TestCompactionWithCoprocessor
Tests run: 3, Failures: 0, Errors: 0, Skipped: 0, Time elapsed: 59.658 sec - in org.apache.hadoop.hbase.regionserver.compactions.TestCompactionWithThroughputController
Running org.apache.hadoop.hbase.regionserver.TestHRegionServerBulkLoad
Tests run: 5, Failures: 0, Errors: 0, Skipped: 0, Time elapsed: 24.867 sec - in org.apache.hadoop.hbase.regionserver.TestCompactionWithCoprocessor
Tests run: 6, Failures: 0, Errors: 0, Skipped: 0, Time elapsed: 89.377 sec - in org.apache.hadoop.hbase.regionserver.TestPerColumnFamilyFlush
Running org.apache.hadoop.hbase.regionserver.TestScannerHeartbeatMessages
Tests run: 1, Failures: 0, Errors: 0, Skipped: 0, Time elapsed: 43.379 sec - in org.apache.hadoop.hbase.regionserver.TestHRegionServerBulkLoad
Running org.apache.hadoop.hbase.regionserver.TestRegionServerOnlineConfigChange
Tests run: 2, Failures: 0, Errors: 0, Skipped: 0, Time elapsed: 0.899 sec - in org.apache.hadoop.hbase.regionserver.TestRegionServerOnlineConfigChange
Running org.apache.hadoop.hbase.regionserver.TestEncryptionRandomKeying
Running org.apache.hadoop.hbase.regionserver.TestEndToEndSplitTransaction
Tests run: 1, Failures: 0, Errors: 0, Skipped: 0, Time elapsed: 1.213 sec - in org.apache.hadoop.hbase.regionserver.TestEncryptionRandomKeying
Tests run: 98, Failures: 0, Errors: 0, Skipped: 0, Time elapsed: 103.972 sec - in org.apache.hadoop.hbase.regionserver.TestHRegion
Running org.apache.hadoop.hbase.TestRegionRebalancing
Tests run: 1, Failures: 0, Errors: 0, Skipped: 0, Time elapsed: 25.945 sec - in org.apache.hadoop.hbase.regionserver.TestScannerHeartbeatMessages
Running org.apache.hadoop.hbase.TestPartialResultsFromClientSide
Tests run: 2, Failures: 0, Errors: 0, Skipped: 0, Time elapsed: 18.28 sec - in org.apache.hadoop.hbase.regionserver.TestEndToEndSplitTransaction
Running org.apache.hadoop.hbase.quotas.TestQuotaThrottle
Running org.apache.hadoop.hbase.quotas.TestQuotaAdmin
Tests run: 17, Failures: 0, Errors: 0, Skipped: 0, Time elapsed: 91.795 sec - in org.apache.hadoop.hbase.regionserver.TestSplitTransactionOnCluster
Tests run: 2, Failures: 0, Errors: 0, Skipped: 0, Time elapsed: 3.455 sec - in org.apache.hadoop.hbase.quotas.TestQuotaAdmin
Running org.apache.hadoop.hbase.io.encoding.TestEncodedSeekers
Tests run: 7, Failures: 0, Errors: 0, Skipped: 0, Time elapsed: 17.592 sec - in org.apache.hadoop.hbase.quotas.TestQuotaThrottle
Running org.apache.hadoop.hbase.io.encoding.TestDataBlockEncoders
Running org.apache.hadoop.hbase.quotas.TestQuotaTableUtil
Tests run: 2, Failures: 0, Errors: 0, Skipped: 0, Time elapsed: 37.465 sec - in org.apache.hadoop.hbase.TestRegionRebalancing
Tests run: 3, Failures: 0, Errors: 0, Skipped: 0, Time elapsed: 1.829 sec - in org.apache.hadoop.hbase.quotas.TestQuotaTableUtil
Running org.apache.hadoop.hbase.io.encoding.TestLoadAndSwitchEncodeOnDisk
Running org.apache.hadoop.hbase.io.encoding.TestChangingEncoding
Tests run: 13, Failures: 0, Errors: 0, Skipped: 0, Time elapsed: 47.282 sec - in org.apache.hadoop.hbase.TestPartialResultsFromClientSide
Running org.apache.hadoop.hbase.io.encoding.TestBufferedDataBlockEncoder
Tests run: 1, Failures: 0, Errors: 0, Skipped: 0, Time elapsed: 13.381 sec - in org.apache.hadoop.hbase.io.encoding.TestBufferedDataBlockEncoder
Tests run: 1, Failures: 0, Errors: 0, Skipped: 0, Time elapsed: 28.214 sec - in org.apache.hadoop.hbase.io.encoding.TestLoadAndSwitchEncodeOnDisk
Running org.apache.hadoop.hbase.io.hfile.TestCacheOnWrite
Running org.apache.hadoop.hbase.io.hfile.TestCacheConfig
Tests run: 6, Failures: 0, Errors: 0, Skipped: 0, Time elapsed: 1.681 sec - in org.apache.hadoop.hbase.io.hfile.TestCacheConfig
Running org.apache.hadoop.hbase.io.hfile.TestHFileSeek
Tests run: 1, Failures: 0, Errors: 0, Skipped: 0, Time elapsed: 2.017 sec - in org.apache.hadoop.hbase.io.hfile.TestHFileSeek
Running org.apache.hadoop.hbase.io.hfile.TestHFileBlock
Tests run: 20, Failures: 0, Errors: 0, Skipped: 0, Time elapsed: 132.121 sec - in org.apache.hadoop.hbase.io.encoding.TestEncodedSeekers
Running org.apache.hadoop.hbase.io.hfile.TestForceCacheImportantBlocks
Tests run: 28, Failures: 0, Errors: 0, Skipped: 0, Time elapsed: 90.474 sec - in org.apache.hadoop.hbase.io.hfile.TestHFileBlock
Running org.apache.hadoop.hbase.io.hfile.TestScannerSelectionUsingTTL
Tests run: 3, Failures: 0, Errors: 0, Skipped: 0, Time elapsed: 144.115 sec - in org.apache.hadoop.hbase.io.encoding.TestChangingEncoding
Running org.apache.hadoop.hbase.io.hfile.TestHFileBlockIndex
Tests run: 10, Failures: 0, Errors: 0, Skipped: 0, Time elapsed: 9.152 sec - in org.apache.hadoop.hbase.io.hfile.TestHFileBlockIndex
Running org.apache.hadoop.hbase.io.TestFileLink
Tests run: 4, Failures: 0, Errors: 0, Skipped: 0, Time elapsed: 36.467 sec - in org.apache.hadoop.hbase.io.hfile.TestForceCacheImportantBlocks
Tests run: 72, Failures: 0, Errors: 0, Skipped: 0, Time elapsed: 131.953 sec - in org.apache.hadoop.hbase.io.hfile.TestCacheOnWrite
Tests run: 5, Failures: 0, Errors: 0, Skipped: 0, Time elapsed: 11.688 sec - in org.apache.hadoop.hbase.io.TestFileLink
Running org.apache.hadoop.hbase.security.access.TestAccessController
Running org.apache.hadoop.hbase.security.access.TestTablePermissions
Running org.apache.hadoop.hbase.security.access.TestCellACLs
Tests run: 7, Failures: 0, Errors: 0, Skipped: 0, Time elapsed: 17.182 sec - in org.apache.hadoop.hbase.security.access.TestTablePermissions
Tests run: 2, Failures: 0, Errors: 0, Skipped: 0, Time elapsed: 15.063 sec - in org.apache.hadoop.hbase.security.access.TestCellACLs
Running org.apache.hadoop.hbase.security.access.TestAccessControlFilter
Tests run: 6, Failures: 0, Errors: 0, Skipped: 0, Time elapsed: 62.968 sec - in org.apache.hadoop.hbase.io.hfile.TestScannerSelectionUsingTTL
Tests run: 1, Failures: 0, Errors: 0, Skipped: 0, Time elapsed: 3.427 sec - in org.apache.hadoop.hbase.security.access.TestAccessControlFilter
Running org.apache.hadoop.hbase.security.access.TestNamespaceCommands
Tests run: 7, Failures: 0, Errors: 0, Skipped: 0, Time elapsed: 4.734 sec - in org.apache.hadoop.hbase.security.access.TestNamespaceCommands
Running org.apache.hadoop.hbase.security.access.TestCellACLWithMultipleVersions
Running org.apache.hadoop.hbase.security.access.TestAccessController2
Running org.apache.hadoop.hbase.security.access.TestZKPermissionsWatcher
Tests run: 1, Failures: 0, Errors: 0, Skipped: 0, Time elapsed: 3.966 sec - in org.apache.hadoop.hbase.security.access.TestZKPermissionsWatcher
Running org.apache.hadoop.hbase.security.access.TestWithDisabledAuthorization
Tests run: 56, Failures: 0, Errors: 0, Skipped: 0, Time elapsed: 62.48 sec - in org.apache.hadoop.hbase.security.access.TestAccessController
Tests run: 28, Failures: 0, Errors: 0, Skipped: 0, Time elapsed: 244.783 sec - in org.apache.hadoop.hbase.io.encoding.TestDataBlockEncoders
Running org.apache.hadoop.hbase.security.access.TestScanEarlyTermination
Running org.apache.hadoop.hbase.security.visibility.TestVisibilityLablesWithGroups
Tests run: 1, Failures: 0, Errors: 0, Skipped: 0, Time elapsed: 5.374 sec - in org.apache.hadoop.hbase.security.access.TestScanEarlyTermination
Tests run: 1, Failures: 0, Errors: 0, Skipped: 0, Time elapsed: 3.079 sec - in org.apache.hadoop.hbase.security.visibility.TestVisibilityLablesWithGroups
Tests run: 6, Failures: 0, Errors: 0, Skipped: 0, Time elapsed: 37.555 sec - in org.apache.hadoop.hbase.security.access.TestAccessController2
Running org.apache.hadoop.hbase.security.visibility.TestVisibilityLabelsWithDeletes
Tests run: 8, Failures: 0, Errors: 0, Skipped: 0, Time elapsed: 47.274 sec - in org.apache.hadoop.hbase.security.access.TestCellACLWithMultipleVersions
Running org.apache.hadoop.hbase.security.visibility.TestVisibilityLabelsWithDefaultVisLabelService
Running org.apache.hadoop.hbase.security.visibility.TestVisibilityLabelsWithCustomVisLabService
Tests run: 6, Failures: 0, Errors: 0, Skipped: 0, Time elapsed: 33.611 sec - in org.apache.hadoop.hbase.security.access.TestWithDisabledAuthorization
Running org.apache.hadoop.hbase.security.visibility.TestDefaultScanLabelGeneratorStack
Tests run: 1, Failures: 0, Errors: 0, Skipped: 0, Time elapsed: 2.524 sec - in org.apache.hadoop.hbase.security.visibility.TestDefaultScanLabelGeneratorStack
Running org.apache.hadoop.hbase.security.visibility.TestVisibilityWithCheckAuths
Tests run: 2, Failures: 0, Errors: 0, Skipped: 0, Time elapsed: 4.363 sec - in org.apache.hadoop.hbase.security.visibility.TestVisibilityWithCheckAuths
Running org.apache.hadoop.hbase.security.visibility.TestVisibilityLabelsOpWithDifferentUsersNoACL
Tests run: 1, Failures: 0, Errors: 0, Skipped: 0, Time elapsed: 1.653 sec - in org.apache.hadoop.hbase.security.visibility.TestVisibilityLabelsOpWithDifferentUsersNoACL
Running org.apache.hadoop.hbase.security.visibility.TestVisibilityLabelsWithSLGStack
Tests run: 19, Failures: 0, Errors: 0, Skipped: 0, Time elapsed: 29.971 sec - in org.apache.hadoop.hbase.security.visibility.TestVisibilityLabelsWithCustomVisLabService
Tests run: 23, Failures: 0, Errors: 0, Skipped: 0, Time elapsed: 30.637 sec - in org.apache.hadoop.hbase.security.visibility.TestVisibilityLabelsWithDefaultVisLabelService
Running org.apache.hadoop.hbase.security.visibility.TestVisibilityLabelsReplication
Running org.apache.hadoop.hbase.security.visibility.TestVisibilityLabelReplicationWithExpAsString
Tests run: 1, Failures: 0, Errors: 0, Skipped: 0, Time elapsed: 4.176 sec - in org.apache.hadoop.hbase.security.visibility.TestVisibilityLabelsWithSLGStack
Running org.apache.hadoop.hbase.security.visibility.TestEnforcingScanLabelGenerator
Tests run: 1, Failures: 0, Errors: 0, Skipped: 0, Time elapsed: 2.941 sec - in org.apache.hadoop.hbase.security.visibility.TestEnforcingScanLabelGenerator
Running org.apache.hadoop.hbase.security.visibility.TestVisibilityLabelsWithACL
Running org.apache.hadoop.hbase.security.visibility.TestWithDisabledAuthorization
Tests run: 2, Failures: 0, Errors: 0, Skipped: 0, Time elapsed: 3.344 sec - in org.apache.hadoop.hbase.security.visibility.TestWithDisabledAuthorization
Tests run: 5, Failures: 0, Errors: 0, Skipped: 0, Time elapsed: 7.743 sec - in org.apache.hadoop.hbase.security.visibility.TestVisibilityLabelsWithACL
Running org.apache.hadoop.hbase.security.token.TestZKSecretWatcher
Tests run: 1, Failures: 0, Errors: 0, Skipped: 0, Time elapsed: 21.104 sec - in org.apache.hadoop.hbase.security.visibility.TestVisibilityLabelsReplication
Tests run: 1, Failures: 0, Errors: 0, Skipped: 0, Time elapsed: 21.295 sec - in org.apache.hadoop.hbase.security.visibility.TestVisibilityLabelReplicationWithExpAsString
Running org.apache.hadoop.hbase.security.token.TestTokenAuthentication
Tests run: 3, Failures: 0, Errors: 0, Skipped: 0, Time elapsed: 0.433 sec - in org.apache.hadoop.hbase.security.token.TestTokenAuthentication
Running org.apache.hadoop.hbase.TestHBaseOnOtherDfsCluster
Tests run: 1, Failures: 0, Errors: 0, Skipped: 0, Time elapsed: 13.247 sec - in org.apache.hadoop.hbase.security.token.TestZKSecretWatcher
Tests run: 1, Failures: 0, Errors: 0, Skipped: 0, Time elapsed: 10.304 sec - in org.apache.hadoop.hbase.TestHBaseOnOtherDfsCluster
Running org.apache.hadoop.hbase.security.token.TestGenerateDelegationToken
Tests run: 1, Failures: 0, Errors: 0, Skipped: 0, Time elapsed: 2.474 sec - in org.apache.hadoop.hbase.security.token.TestGenerateDelegationToken
Tests run: 39, Failures: 0, Errors: 0, Skipped: 0, Time elapsed: 83.012 sec - in org.apache.hadoop.hbase.security.visibility.TestVisibilityLabelsWithDeletes

Results :

Tests run: 2393, Failures: 0, Errors: 0, Skipped: 21

[INFO] ------------------------------------------------------------------------
[INFO] Reactor Summary:
[INFO] 
[INFO] Apache HBase ...................................... SUCCESS [3.147s]
[INFO] Apache HBase - Checkstyle ......................... SUCCESS [0.847s]
[INFO] Apache HBase - Resource Bundle .................... SUCCESS [0.232s]
[INFO] Apache HBase - Annotations ........................ SUCCESS [1.130s]
[INFO] Apache HBase - Protocol ........................... SUCCESS [12.900s]
[INFO] Apache HBase - Common ............................. SUCCESS [1:24.399s]
[INFO] Apache HBase - Procedure .......................... SUCCESS [1:17.091s]
[INFO] Apache HBase - Client ............................. SUCCESS [1:27.538s]
[INFO] Apache HBase - Hadoop Compatibility ............... SUCCESS [7.679s]
[INFO] Apache HBase - Hadoop Two Compatibility ........... SUCCESS [7.076s]
[INFO] Apache HBase - Prefix Tree ........................ SUCCESS [11.327s]
[INFO] Apache HBase - Server ............................. FAILURE [1:29:31.043s]
[INFO] Apache HBase - Testing Util ....................... SKIPPED
[INFO] Apache HBase - Thrift ............................. SKIPPED
[INFO] Apache HBase - Rest ............................... SKIPPED
[INFO] Apache HBase - Shell .............................. SKIPPED
[INFO] Apache HBase - Integration Tests .................. SKIPPED
[INFO] Apache HBase - Examples ........................... SKIPPED
[INFO] Apache HBase - Assembly ........................... SKIPPED
[INFO] Apache HBase - Shaded ............................. SKIPPED
[INFO] Apache HBase - Shaded - Client .................... SKIPPED
[INFO] Apache HBase - Shaded - Server .................... SKIPPED
[INFO] ------------------------------------------------------------------------
[INFO] BUILD FAILURE
[INFO] ------------------------------------------------------------------------
[INFO] Total time: 1:34:26.265s
[INFO] Finished at: Sat Oct 17 01:36:56 UTC 2015
[INFO] Final Memory: 88M/886M
[INFO] ------------------------------------------------------------------------
[ERROR] Failed to execute goal org.apache.maven.plugins:maven-surefire-plugin:2.18.1:test
(secondPartTestsExecution) on project hbase-server: ExecutionException: java.lang.RuntimeException:
The forked VM terminated without properly saying goodbye. VM crash or System.exit called?
[ERROR] Command was /bin/sh -c cd <https://builds.apache.org/job/HBase-1.1/ws/hbase-server>
&& /home/jenkins/jenkins-slave/tools/hudson.model.JDK/jdk-1.7u51/jre/bin/java -enableassertions
-XX:MaxDirectMemorySize=1G -Xmx2800m -XX:MaxPermSize=256m -Djava.security.egd=file:/dev/./urandom
-Djava.net.preferIPv4Stack=true -Djava.awt.headless=true -jar <https://builds.apache.org/job/HBase-1.1/ws/hbase-server/target/surefire/surefirebooter8262233470228492533.jar>
<https://builds.apache.org/job/HBase-1.1/ws/hbase-server/target/surefire/surefire1333807714489430808tmp>
<https://builds.apache.org/job/HBase-1.1/ws/hbase-server/target/surefire/surefire_10532263173312295050527tmp>
[ERROR] -> [Help 1]
[ERROR] 
[ERROR] To see the full stack trace of the errors, re-run Maven with the -e switch.
[ERROR] Re-run Maven using the -X switch to enable full debug logging.
[ERROR] 
[ERROR] For more information about the errors and possible solutions, please read the following
articles:
[ERROR] [Help 1] http://cwiki.apache.org/confluence/display/MAVEN/MojoFailureException
[ERROR] 
[ERROR] After correcting the problems, you can resume the build with the command
[ERROR]   mvn <goals> -rf :hbase-server
Build step 'Invoke top-level Maven targets' marked build as failure
Performing Post build task...
Match found for :.* : True
Logical operation result is TRUE
Running script  :   ZOMBIE_TESTS_COUNT=`jps -v | grep surefirebooter | grep '-Dhbase.test'
| wc -l`
  if [[ $ZOMBIE_TESTS_COUNT != 0 ]] ; then
    #It seems sometimes the tests are not dying immediately. Let's give them 30s
    echo "Suspicious java process found - waiting 30s to see if there are just slow to stop"
    sleep 30
    ZOMBIE_TESTS_COUNT=`jps -v | grep surefirebooter | grep '-Dhbase.test' | wc -l`
    if [[ $ZOMBIE_TESTS_COUNT != 0 ]] ; then
      echo "There are $ZOMBIE_TESTS_COUNT zombie tests, they should have been killed by surefire
but survived"
      echo "************ zombies jps listing"
      jps -v
      jps -v | grep surefirebooter | grep '-Dhbase.test'
      echo "************ BEGIN zombies jstack extract"
      # HBase tests have been flagged with an innocuous '-Dhbase.test' just so they can
      # be identified as hbase in a process listing.
      ZB_STACK=`jps -v | grep surefirebooter | grep '-Dhbase.test' | cut -d ' ' -f 1 | xargs
-n 1 jstack | grep ".test" | grep "\.java"`
      jps -v | grep surefirebooter | grep '-Dhbase.test' | cut -d ' ' -f 1 | xargs -n 1 jstack
      echo "************ END  zombies jstack extract"
      JIRA_COMMENT="$JIRA_COMMENT

     {color:red}-1 core zombie tests{color}.  There are ${ZOMBIE_TESTS_COUNT} zombie test(s):
${ZB_STACK}"
      BAD=1
      # Killing these zombies
      echo 'Killing ZOMBIES!!!'
      jps -v
      jps -v | grep surefirebooter | grep '-Dhbase.test' | cut -d ' ' -f 1 | xargs kill -9
    else
      echo "We're ok: there is no zombie test, but some tests took some time to stop"
    fi
[HBase-1.1] $ /bin/bash -xe /tmp/hudson1063878109598056374.sh
++ jps -v
++ grep -Dhbase.test
++ wc -l
grep: unknown devices method
++ grep surefirebooter
+ ZOMBIE_TESTS_COUNT=0
/tmp/hudson1063878109598056374.sh: line 30: syntax error: unexpected end of file
POST BUILD TASK : FAILURE
END OF POST BUILD TASK : 0
Archiving artifacts
Recording test results
Updating HBASE-14621

Mime
View raw message