hbase-builds mailing list archives

Site index · List index
Message view « Date » · « Thread »
Top « Date » · « Thread »
From Apache Jenkins Server <jenk...@builds.apache.org>
Subject Build failed in Jenkins: HBase-TRUNK #6921
Date Fri, 16 Oct 2015 21:29:06 GMT
See <https://builds.apache.org/job/HBase-TRUNK/6921/changes>

Changes:

[tedyu] HBASE-14406 The dataframe datasource filter is wrong, and will result in

[enis] HBASE-14474 Addendum closes connection in writeRequest() outside

------------------------------------------
[...truncated 4909 lines...]
Tests run: 19, Failures: 0, Errors: 0, Skipped: 0, Time elapsed: 359.097 sec - in org.apache.hadoop.hbase.master.balancer.TestStochasticLoadBalancer
Running org.apache.hadoop.hbase.io.hfile.TestCacheOnWrite
Running org.apache.hadoop.hbase.io.hfile.TestHFileBlockIndex
Running org.apache.hadoop.hbase.io.hfile.TestScannerSelectionUsingTTL
Tests run: 10, Failures: 0, Errors: 0, Skipped: 0, Time elapsed: 13.081 sec - in org.apache.hadoop.hbase.io.hfile.TestHFileBlockIndex
Running org.apache.hadoop.hbase.io.hfile.TestCacheConfig
Tests run: 6, Failures: 0, Errors: 0, Skipped: 0, Time elapsed: 1.989 sec - in org.apache.hadoop.hbase.io.hfile.TestCacheConfig
Running org.apache.hadoop.hbase.io.hfile.TestHFileBlock
Tests run: 6, Failures: 0, Errors: 0, Skipped: 0, Time elapsed: 63.964 sec - in org.apache.hadoop.hbase.io.hfile.TestScannerSelectionUsingTTL
Running org.apache.hadoop.hbase.io.hfile.TestForceCacheImportantBlocks
Tests run: 2, Failures: 0, Errors: 0, Skipped: 0, Time elapsed: 27.173 sec - in org.apache.hadoop.hbase.io.hfile.TestForceCacheImportantBlocks
Running org.apache.hadoop.hbase.io.hfile.TestHFileSeek
Tests run: 1, Failures: 0, Errors: 0, Skipped: 0, Time elapsed: 3.04 sec - in org.apache.hadoop.hbase.io.hfile.TestHFileSeek
Tests run: 28, Failures: 0, Errors: 0, Skipped: 0, Time elapsed: 92.247 sec - in org.apache.hadoop.hbase.io.hfile.TestHFileBlock
Running org.apache.hadoop.hbase.io.TestFileLink
Running org.apache.hadoop.hbase.constraint.TestConstraint
Tests run: 5, Failures: 0, Errors: 0, Skipped: 0, Time elapsed: 15.393 sec - in org.apache.hadoop.hbase.io.TestFileLink
Running org.apache.hadoop.hbase.filter.TestColumnRangeFilter
Tests run: 4, Failures: 0, Errors: 0, Skipped: 0, Time elapsed: 511.551 sec - in org.apache.hadoop.hbase.master.balancer.TestStochasticLoadBalancer2
Tests run: 5, Failures: 0, Errors: 0, Skipped: 0, Time elapsed: 21.049 sec - in org.apache.hadoop.hbase.constraint.TestConstraint
Tests run: 1, Failures: 0, Errors: 0, Skipped: 0, Time elapsed: 8.576 sec - in org.apache.hadoop.hbase.filter.TestColumnRangeFilter
Running org.apache.hadoop.hbase.filter.TestFuzzyRowAndColumnRangeFilter
Running org.apache.hadoop.hbase.filter.TestFuzzyRowFilterEndToEnd
Tests run: 1, Failures: 0, Errors: 0, Skipped: 0, Time elapsed: 3.363 sec - in org.apache.hadoop.hbase.filter.TestFuzzyRowAndColumnRangeFilter
Running org.apache.hadoop.hbase.filter.TestFilterWithScanLimits
Running org.apache.hadoop.hbase.filter.TestMultiRowRangeFilter
Tests run: 72, Failures: 0, Errors: 0, Skipped: 0, Time elapsed: 183.741 sec - in org.apache.hadoop.hbase.io.hfile.TestCacheOnWrite
Running org.apache.hadoop.hbase.filter.TestScanRowPrefix
Tests run: 20, Failures: 0, Errors: 0, Skipped: 0, Time elapsed: 20.351 sec - in org.apache.hadoop.hbase.filter.TestMultiRowRangeFilter
Tests run: 1, Failures: 0, Errors: 0, Skipped: 0, Time elapsed: 5.656 sec - in org.apache.hadoop.hbase.filter.TestScanRowPrefix
Running org.apache.hadoop.hbase.TestGlobalMemStoreSize
Running org.apache.hadoop.hbase.filter.TestFilterWrapper
Tests run: 1, Failures: 0, Errors: 0, Skipped: 0, Time elapsed: 3.467 sec - in org.apache.hadoop.hbase.filter.TestFilterWrapper
Running org.apache.hadoop.hbase.TestHBaseOnOtherDfsCluster
Tests run: 1, Failures: 0, Errors: 0, Skipped: 0, Time elapsed: 17.4 sec - in org.apache.hadoop.hbase.TestGlobalMemStoreSize
Tests run: 1, Failures: 0, Errors: 0, Skipped: 0, Time elapsed: 53.7 sec - in org.apache.hadoop.hbase.filter.TestFilterWithScanLimits
Running org.apache.hadoop.hbase.replication.TestReplicationSource
Tests run: 1, Failures: 0, Errors: 0, Skipped: 0, Time elapsed: 0.219 sec - in org.apache.hadoop.hbase.replication.TestReplicationSource
Running org.apache.hadoop.hbase.TestNamespace
Tests run: 1, Failures: 0, Errors: 0, Skipped: 0, Time elapsed: 17.587 sec - in org.apache.hadoop.hbase.TestHBaseOnOtherDfsCluster
Running org.apache.hadoop.hbase.replication.TestReplicationWithTags
Running org.apache.hadoop.hbase.replication.TestPerTableCFReplication
Tests run: 1, Failures: 0, Errors: 0, Skipped: 0, Time elapsed: 2.477 sec - in org.apache.hadoop.hbase.replication.TestReplicationWithTags
Tests run: 8, Failures: 0, Errors: 0, Skipped: 0, Time elapsed: 37.041 sec - in org.apache.hadoop.hbase.TestNamespace
Running org.apache.hadoop.hbase.replication.TestReplicationChangingPeerRegionservers
Tests run: 1, Failures: 0, Errors: 0, Skipped: 0, Time elapsed: 6.356 sec - in org.apache.hadoop.hbase.replication.TestReplicationChangingPeerRegionservers
Running org.apache.hadoop.hbase.replication.TestMultiSlaveReplication
Tests run: 2, Failures: 0, Errors: 0, Skipped: 0, Time elapsed: 36.643 sec - in org.apache.hadoop.hbase.replication.TestPerTableCFReplication
Running org.apache.hadoop.hbase.replication.TestReplicationSmallTests
Running org.apache.hadoop.hbase.replication.TestReplicationKillSlaveRS
Tests run: 1, Failures: 0, Errors: 0, Skipped: 0, Time elapsed: 32.601 sec - in org.apache.hadoop.hbase.replication.TestMultiSlaveReplication
Running org.apache.hadoop.hbase.replication.TestMasterReplication
Tests run: 1, Failures: 0, Errors: 0, Skipped: 0, Time elapsed: 25.117 sec - in org.apache.hadoop.hbase.replication.TestReplicationKillSlaveRS
Running org.apache.hadoop.hbase.replication.regionserver.TestReplicationWALReaderManager
Tests run: 10, Failures: 0, Errors: 0, Skipped: 0, Time elapsed: 60.49 sec - in org.apache.hadoop.hbase.replication.TestReplicationSmallTests
Running org.apache.hadoop.hbase.replication.regionserver.TestRegionReplicaReplicationEndpointNoMaster
Tests run: 3, Failures: 0, Errors: 0, Skipped: 0, Time elapsed: 76.566 sec - in org.apache.hadoop.hbase.replication.TestMasterReplication
Running org.apache.hadoop.hbase.replication.regionserver.TestReplicationSourceManager
Tests run: 5, Failures: 0, Errors: 0, Skipped: 0, Time elapsed: 4.238 sec - in org.apache.hadoop.hbase.replication.regionserver.TestReplicationSourceManager
Tests run: 4, Failures: 0, Errors: 0, Skipped: 0, Time elapsed: 43.76 sec - in org.apache.hadoop.hbase.replication.regionserver.TestRegionReplicaReplicationEndpointNoMaster
Running org.apache.hadoop.hbase.replication.regionserver.TestReplicationSink
Tests run: 5, Failures: 0, Errors: 0, Skipped: 0, Time elapsed: 2.293 sec - in org.apache.hadoop.hbase.replication.regionserver.TestReplicationSink
Running org.apache.hadoop.hbase.replication.regionserver.TestRegionReplicaReplicationEndpoint
Tests run: 2, Failures: 0, Errors: 0, Skipped: 0, Time elapsed: 285.3 sec - in org.apache.hadoop.hbase.filter.TestFuzzyRowFilterEndToEnd
Tests run: 56, Failures: 0, Errors: 0, Skipped: 0, Time elapsed: 569.546 sec - in org.apache.hadoop.hbase.io.encoding.TestDataBlockEncoders
Running org.apache.hadoop.hbase.replication.multiwal.TestReplicationKillMasterRSCompressedWithMultipleWAL
Running org.apache.hadoop.hbase.replication.multiwal.TestReplicationEndpointWithMultipleWAL
Tests run: 3, Failures: 0, Errors: 0, Skipped: 0, Time elapsed: 4.792 sec - in org.apache.hadoop.hbase.replication.multiwal.TestReplicationEndpointWithMultipleWAL
Running org.apache.hadoop.hbase.replication.multiwal.TestReplicationSyncUpToolWithMultipleWAL
Running org.apache.hadoop.hbase.replication.TestReplicationStateZKImpl
Tests run: 6, Failures: 0, Errors: 0, Skipped: 0, Time elapsed: 1.268 sec - in org.apache.hadoop.hbase.replication.TestReplicationStateZKImpl
Tests run: 1, Failures: 0, Errors: 0, Skipped: 0, Time elapsed: 34.329 sec - in org.apache.hadoop.hbase.replication.multiwal.TestReplicationKillMasterRSCompressedWithMultipleWAL
Running org.apache.hadoop.hbase.replication.TestReplicationEndpoint
Running org.apache.hadoop.hbase.replication.TestReplicationSyncUpTool
Tests run: 3, Failures: 0, Errors: 0, Skipped: 0, Time elapsed: 3.08 sec - in org.apache.hadoop.hbase.replication.TestReplicationEndpoint
Running org.apache.hadoop.hbase.replication.TestReplicationTrackerZKImpl
Tests run: 5, Failures: 0, Errors: 0, Skipped: 0, Time elapsed: 1.626 sec - in org.apache.hadoop.hbase.replication.TestReplicationTrackerZKImpl
Tests run: 9, Failures: 0, Errors: 0, Skipped: 0, Time elapsed: 112.353 sec - in org.apache.hadoop.hbase.replication.regionserver.TestRegionReplicaReplicationEndpoint
Running org.apache.hadoop.hbase.replication.TestReplicationKillMasterRS
Tests run: 1, Failures: 0, Errors: 0, Skipped: 0, Time elapsed: 67.664 sec - in org.apache.hadoop.hbase.replication.multiwal.TestReplicationSyncUpToolWithMultipleWAL
Tests run: 1, Failures: 0, Errors: 0, Skipped: 0, Time elapsed: 56.211 sec - in org.apache.hadoop.hbase.replication.TestReplicationSyncUpTool
Running org.apache.hadoop.hbase.replication.TestReplicationKillMasterRSCompressed
Tests run: 1, Failures: 0, Errors: 0, Skipped: 0, Time elapsed: 30.766 sec - in org.apache.hadoop.hbase.replication.TestReplicationKillMasterRS
Running org.apache.hadoop.hbase.replication.TestReplicationDisableInactivePeer
Tests run: 8, Failures: 0, Errors: 0, Skipped: 0, Time elapsed: 246.268 sec - in org.apache.hadoop.hbase.replication.regionserver.TestReplicationWALReaderManager
Tests run: 1, Failures: 0, Errors: 0, Skipped: 0, Time elapsed: 23.894 sec - in org.apache.hadoop.hbase.replication.TestReplicationKillMasterRSCompressed
Tests run: 1, Failures: 0, Errors: 0, Skipped: 0, Time elapsed: 20.293 sec - in org.apache.hadoop.hbase.replication.TestReplicationDisableInactivePeer

Results :

Failed tests: 
  TestSnapshotCloneIndependence.testOnlineSnapshotDeleteIndependent:191->runTestSnapshotDeleteIndependent:459
expected:<17576> but was:<14046>

Tests run: 2580, Failures: 1, Errors: 0, Skipped: 63

[INFO] ------------------------------------------------------------------------
[INFO] Reactor Summary:
[INFO] 
[INFO] Apache HBase ...................................... SUCCESS [  2.997 s]
[INFO] Apache HBase - Checkstyle ......................... SUCCESS [  0.714 s]
[INFO] Apache HBase - Resource Bundle .................... SUCCESS [  0.258 s]
[INFO] Apache HBase - Annotations ........................ SUCCESS [  0.256 s]
[INFO] Apache HBase - Protocol ........................... SUCCESS [  3.014 s]
[INFO] Apache HBase - Common ............................. SUCCESS [01:33 min]
[INFO] Apache HBase - Procedure .......................... SUCCESS [01:55 min]
[INFO] Apache HBase - Client ............................. SUCCESS [01:39 min]
[INFO] Apache HBase - Hadoop Compatibility ............... SUCCESS [  7.659 s]
[INFO] Apache HBase - Hadoop Two Compatibility ........... SUCCESS [  7.714 s]
[INFO] Apache HBase - Prefix Tree ........................ SUCCESS [ 10.306 s]
[INFO] Apache HBase - Server ............................. FAILURE [  01:49 h]
[INFO] Apache HBase - Testing Util ....................... SKIPPED
[INFO] Apache HBase - Thrift ............................. SKIPPED
[INFO] Apache HBase - Shell .............................. SKIPPED
[INFO] Apache HBase - Integration Tests .................. SKIPPED
[INFO] Apache HBase - Examples ........................... SKIPPED
[INFO] Apache HBase - Rest ............................... SKIPPED
[INFO] Apache HBase - External Block Cache ............... SKIPPED
[INFO] Apache HBase - Assembly ........................... SKIPPED
[INFO] Apache HBase - Shaded ............................. SKIPPED
[INFO] Apache HBase - Shaded - Client .................... SKIPPED
[INFO] Apache HBase - Shaded - Server .................... SKIPPED
[INFO] Apache HBase - Spark .............................. SKIPPED
[INFO] ------------------------------------------------------------------------
[INFO] BUILD FAILURE
[INFO] ------------------------------------------------------------------------
[INFO] Total time: 01:55 h
[INFO] Finished at: 2015-10-16T21:25:09+00:00
[INFO] Final Memory: 60M/688M
[INFO] ------------------------------------------------------------------------
[ERROR] Failed to execute goal org.apache.maven.plugins:maven-surefire-plugin:2.18.1:test
(secondPartTestsExecution) on project hbase-server: There are test failures.
[ERROR] 
[ERROR] Please refer to <https://builds.apache.org/job/HBase-TRUNK/ws/hbase-server/target/surefire-reports>
for the individual test results.
[ERROR] -> [Help 1]
[ERROR] 
[ERROR] To see the full stack trace of the errors, re-run Maven with the -e switch.
[ERROR] Re-run Maven using the -X switch to enable full debug logging.
[ERROR] 
[ERROR] For more information about the errors and possible solutions, please read the following
articles:
[ERROR] [Help 1] http://cwiki.apache.org/confluence/display/MAVEN/MojoFailureException
[ERROR] 
[ERROR] After correcting the problems, you can resume the build with the command
[ERROR]   mvn <goals> -rf :hbase-server
Build step 'Invoke top-level Maven targets' marked build as failure
Performing Post build task...
Match found for :.* : True
Logical operation result is TRUE
Running script  :   ZOMBIE_TESTS_COUNT=`jps -v | grep surefirebooter | grep '-Dhbase.test'
| wc -l`
  if [[ $ZOMBIE_TESTS_COUNT != 0 ]] ; then
    #It seems sometimes the tests are not dying immediately. Let's give them 30s
    echo "Suspicious java process found - waiting 30s to see if there are just slow to stop"
    sleep 30
    ZOMBIE_TESTS_COUNT=`jps -v | grep surefirebooter | grep '-Dhbase.test' | wc -l`
    if [[ $ZOMBIE_TESTS_COUNT != 0 ]] ; then
      echo "There are $ZOMBIE_TESTS_COUNT zombie tests, they should have been killed by surefire
but survived"
      echo "************ zombies jps listing"
      jps -v
      jps -v | grep surefirebooter | grep '-Dhbase.test'
      echo "************ BEGIN zombies jstack extract"
      # HBase tests have been flagged with an innocuous '-Dhbase.test' just so they can
      # be identified as hbase in a process listing.
      ZB_STACK=`jps -v | grep surefirebooter | grep '-Dhbase.test' | cut -d ' ' -f 1 | xargs
-n 1 jstack | grep ".test" | grep "\.java"`
      jps -v | grep surefirebooter | grep '-Dhbase.test' | cut -d ' ' -f 1 | xargs -n 1 jstack
      echo "************ END  zombies jstack extract"
      JIRA_COMMENT="$JIRA_COMMENT

     {color:red}-1 core zombie tests{color}.  There are ${ZOMBIE_TESTS_COUNT} zombie test(s):
${ZB_STACK}"
      BAD=1
      # Killing these zombies
      echo 'Killing ZOMBIES!!!'
      jps -v
      jps -v | grep surefirebooter | grep '-Dhbase.test' | cut -d ' ' -f 1 | xargs kill -9
    else
      echo "We're ok: there is no zombie test, but some tests took some time to stop"
    fi
[HBase-TRUNK] $ /bin/bash -xe /tmp/hudson5446325130447378620.sh
++ jps -v
++ grep surefirebooter
++ grep -Dhbase.test
++ wc -l
grep: unknown devices method
grep: write error: Broken pipe
+ ZOMBIE_TESTS_COUNT=0
/tmp/hudson5446325130447378620.sh: line 30: syntax error: unexpected end of file
POST BUILD TASK : FAILURE
END OF POST BUILD TASK : 0
Archiving artifacts
Recording test results
[FINDBUGS] Collecting findbugs analysis files...
[FINDBUGS] Finding all files that match the pattern **/findbugs.xml,**/findbugsXml.xml
[FINDBUGS] Parsing 28 files in <https://builds.apache.org/job/HBase-TRUNK/ws/>
[FINDBUGS] Successfully parsed file <https://builds.apache.org/job/HBase-TRUNK/6921/artifact/hbase-annotations/target/findbugs.xml>
with 0 unique warnings and 0 duplicates.
[FINDBUGS] Successfully parsed file <https://builds.apache.org/job/HBase-TRUNK/6921/artifact/hbase-annotations/target/findbugsXml.xml>
with 0 unique warnings and 0 duplicates.
[FINDBUGS] Successfully parsed file <https://builds.apache.org/job/HBase-TRUNK/6921/artifact/hbase-client/target/findbugs.xml>
with 0 unique warnings and 0 duplicates.
[FINDBUGS] Successfully parsed file <https://builds.apache.org/job/HBase-TRUNK/6921/artifact/hbase-client/target/findbugsXml.xml>
with 13 unique warnings and 0 duplicates.
[FINDBUGS] Successfully parsed file <https://builds.apache.org/job/HBase-TRUNK/6921/artifact/hbase-common/target/findbugs.xml>
with 13 unique warnings and 0 duplicates.
[FINDBUGS] Successfully parsed file <https://builds.apache.org/job/HBase-TRUNK/6921/artifact/hbase-common/target/findbugsXml.xml>
with 22 unique warnings and 0 duplicates.
[FINDBUGS] Successfully parsed file <https://builds.apache.org/job/HBase-TRUNK/6921/artifact/hbase-examples/target/findbugs.xml>
with 22 unique warnings and 0 duplicates.
[FINDBUGS] Successfully parsed file <https://builds.apache.org/job/HBase-TRUNK/6921/artifact/hbase-examples/target/findbugsXml.xml>
with 22 unique warnings and 0 duplicates.
[FINDBUGS] Successfully parsed file <https://builds.apache.org/job/HBase-TRUNK/6921/artifact/hbase-external-blockcache/target/findbugs.xml>
with 22 unique warnings and 0 duplicates.
[FINDBUGS] Successfully parsed file <https://builds.apache.org/job/HBase-TRUNK/6921/artifact/hbase-external-blockcache/target/findbugsXml.xml>
with 22 unique warnings and 0 duplicates.
[FINDBUGS] Successfully parsed file <https://builds.apache.org/job/HBase-TRUNK/6921/artifact/hbase-hadoop-compat/target/findbugs.xml>
with 22 unique warnings and 0 duplicates.
[FINDBUGS] Successfully parsed file <https://builds.apache.org/job/HBase-TRUNK/6921/artifact/hbase-hadoop-compat/target/findbugsXml.xml>
with 22 unique warnings and 0 duplicates.
[FINDBUGS] Successfully parsed file <https://builds.apache.org/job/HBase-TRUNK/6921/artifact/hbase-hadoop2-compat/target/findbugs.xml>
with 22 unique warnings and 0 duplicates.
[FINDBUGS] Successfully parsed file <https://builds.apache.org/job/HBase-TRUNK/6921/artifact/hbase-hadoop2-compat/target/findbugsXml.xml>
with 22 unique warnings and 0 duplicates.
[FINDBUGS] Successfully parsed file <https://builds.apache.org/job/HBase-TRUNK/6921/artifact/hbase-prefix-tree/target/findbugs.xml>
with 22 unique warnings and 0 duplicates.
[FINDBUGS] Successfully parsed file <https://builds.apache.org/job/HBase-TRUNK/6921/artifact/hbase-prefix-tree/target/findbugsXml.xml>
with 23 unique warnings and 0 duplicates.
[FINDBUGS] Successfully parsed file <https://builds.apache.org/job/HBase-TRUNK/6921/artifact/hbase-procedure/target/findbugs.xml>
with 23 unique warnings and 0 duplicates.
[FINDBUGS] Successfully parsed file <https://builds.apache.org/job/HBase-TRUNK/6921/artifact/hbase-procedure/target/findbugsXml.xml>
with 24 unique warnings and 0 duplicates.
[FINDBUGS] Successfully parsed file <https://builds.apache.org/job/HBase-TRUNK/6921/artifact/hbase-protocol/target/findbugs.xml>
with 24 unique warnings and 0 duplicates.
[FINDBUGS] Successfully parsed file <https://builds.apache.org/job/HBase-TRUNK/6921/artifact/hbase-protocol/target/findbugsXml.xml>
with 24 unique warnings and 0 duplicates.
[FINDBUGS] Successfully parsed file <https://builds.apache.org/job/HBase-TRUNK/6921/artifact/hbase-rest/target/findbugs.xml>
with 24 unique warnings and 0 duplicates.
[FINDBUGS] Successfully parsed file <https://builds.apache.org/job/HBase-TRUNK/6921/artifact/hbase-rest/target/findbugsXml.xml>
with 26 unique warnings and 0 duplicates.
[FINDBUGS] Successfully parsed file <https://builds.apache.org/job/HBase-TRUNK/6921/artifact/hbase-server/target/findbugs.xml>
with 26 unique warnings and 0 duplicates.
[FINDBUGS] Successfully parsed file <https://builds.apache.org/job/HBase-TRUNK/6921/artifact/hbase-server/target/findbugsXml.xml>
with 102 unique warnings and 1 duplicate.
[FINDBUGS] Successfully parsed file <https://builds.apache.org/job/HBase-TRUNK/6921/artifact/hbase-spark/target/findbugs.xml>
with 102 unique warnings and 0 duplicates.
[FINDBUGS] Successfully parsed file <https://builds.apache.org/job/HBase-TRUNK/6921/artifact/hbase-spark/target/findbugsXml.xml>
with 139 unique warnings and 0 duplicates.
[FINDBUGS] Successfully parsed file <https://builds.apache.org/job/HBase-TRUNK/6921/artifact/hbase-thrift/target/findbugs.xml>
with 139 unique warnings and 0 duplicates.
[FINDBUGS] Successfully parsed file <https://builds.apache.org/job/HBase-TRUNK/6921/artifact/hbase-thrift/target/findbugsXml.xml>
with 139 unique warnings and 0 duplicates.
[FINDBUGS] Computing warning deltas based on reference build #6920
[CHECKSTYLE] Collecting checkstyle analysis files...
[CHECKSTYLE] Finding all files that match the pattern **/checkstyle-result.xml
[CHECKSTYLE] Parsing 24 files in <https://builds.apache.org/job/HBase-TRUNK/ws/>
[CHECKSTYLE] Successfully parsed file <https://builds.apache.org/job/HBase-TRUNK/6921/artifact/hbase-annotations/target/checkstyle-result.xml>
with 0 unique warnings and 0 duplicates.
[CHECKSTYLE] Successfully parsed file <https://builds.apache.org/job/HBase-TRUNK/6921/artifact/hbase-assembly/target/checkstyle-result.xml>
with 0 unique warnings and 0 duplicates.
[CHECKSTYLE] Successfully parsed file <https://builds.apache.org/job/HBase-TRUNK/6921/artifact/hbase-checkstyle/target/checkstyle-result.xml>
with 0 unique warnings and 0 duplicates.
[CHECKSTYLE] Successfully parsed file <https://builds.apache.org/job/HBase-TRUNK/6921/artifact/hbase-client/target/checkstyle-result.xml>
with 203 unique warnings and 0 duplicates.
[CHECKSTYLE] Successfully parsed file <https://builds.apache.org/job/HBase-TRUNK/6921/artifact/hbase-common/target/checkstyle-result.xml>
with 302 unique warnings and 0 duplicates.
[CHECKSTYLE] Successfully parsed file <https://builds.apache.org/job/HBase-TRUNK/6921/artifact/hbase-examples/target/checkstyle-result.xml>
with 330 unique warnings and 0 duplicates.
[CHECKSTYLE] Successfully parsed file <https://builds.apache.org/job/HBase-TRUNK/6921/artifact/hbase-external-blockcache/target/checkstyle-result.xml>
with 330 unique warnings and 0 duplicates.
[CHECKSTYLE] Successfully parsed file <https://builds.apache.org/job/HBase-TRUNK/6921/artifact/hbase-hadoop-compat/target/checkstyle-result.xml>
with 332 unique warnings and 0 duplicates.
[CHECKSTYLE] Successfully parsed file <https://builds.apache.org/job/HBase-TRUNK/6921/artifact/hbase-hadoop2-compat/target/checkstyle-result.xml>
with 363 unique warnings and 0 duplicates.
[CHECKSTYLE] Successfully parsed file <https://builds.apache.org/job/HBase-TRUNK/6921/artifact/hbase-it/target/checkstyle-result.xml>
with 363 unique warnings and 0 duplicates.
[CHECKSTYLE] Successfully parsed file <https://builds.apache.org/job/HBase-TRUNK/6921/artifact/hbase-prefix-tree/target/checkstyle-result.xml>
with 379 unique warnings and 0 duplicates.
[CHECKSTYLE] Successfully parsed file <https://builds.apache.org/job/HBase-TRUNK/6921/artifact/hbase-procedure/target/checkstyle-result.xml>
with 379 unique warnings and 0 duplicates.
[CHECKSTYLE] Successfully parsed file <https://builds.apache.org/job/HBase-TRUNK/6921/artifact/hbase-protocol/target/checkstyle-result.xml>
with 381 unique warnings and 0 duplicates.
[CHECKSTYLE] Successfully parsed file <https://builds.apache.org/job/HBase-TRUNK/6921/artifact/hbase-resource-bundle/target/checkstyle-result.xml>
with 381 unique warnings and 0 duplicates.
[CHECKSTYLE] Successfully parsed file <https://builds.apache.org/job/HBase-TRUNK/6921/artifact/hbase-rest/target/checkstyle-result.xml>
with 423 unique warnings and 0 duplicates.
[CHECKSTYLE] Successfully parsed file <https://builds.apache.org/job/HBase-TRUNK/6921/artifact/hbase-server/target/checkstyle-result.xml>
with 1724 unique warnings and 0 duplicates.
[CHECKSTYLE] Successfully parsed file <https://builds.apache.org/job/HBase-TRUNK/6921/artifact/hbase-shaded/hbase-shaded-client/target/checkstyle-result.xml>
with 1724 unique warnings and 0 duplicates.
[CHECKSTYLE] Successfully parsed file <https://builds.apache.org/job/HBase-TRUNK/6921/artifact/hbase-shaded/hbase-shaded-server/target/checkstyle-result.xml>
with 1724 unique warnings and 0 duplicates.
[CHECKSTYLE] Successfully parsed file <https://builds.apache.org/job/HBase-TRUNK/6921/artifact/hbase-shaded/target/checkstyle-result.xml>
with 1724 unique warnings and 0 duplicates.
[CHECKSTYLE] Successfully parsed file <https://builds.apache.org/job/HBase-TRUNK/6921/artifact/hbase-shell/target/checkstyle-result.xml>
with 1724 unique warnings and 0 duplicates.
[CHECKSTYLE] Successfully parsed file <https://builds.apache.org/job/HBase-TRUNK/6921/artifact/hbase-spark/target/checkstyle-result.xml>
with 1724 unique warnings and 0 duplicates.
[CHECKSTYLE] Successfully parsed file <https://builds.apache.org/job/HBase-TRUNK/6921/artifact/hbase-testing-util/target/checkstyle-result.xml>
with 1724 unique warnings and 0 duplicates.
[CHECKSTYLE] Successfully parsed file <https://builds.apache.org/job/HBase-TRUNK/6921/artifact/hbase-thrift/target/checkstyle-result.xml>
with 1746 unique warnings and 0 duplicates.
[CHECKSTYLE] Successfully parsed file <https://builds.apache.org/job/HBase-TRUNK/6921/artifact/target/checkstyle-result.xml>
with 1746 unique warnings and 0 duplicates.
[CHECKSTYLE] Computing warning deltas based on reference build #6920
Updating HBASE-14406
Updating HBASE-14474

Mime
View raw message