hbase-builds mailing list archives

Site index · List index
Message view « Date » · « Thread »
Top « Date » · « Thread »
From Apache Jenkins Server <jenk...@builds.apache.org>
Subject Build failed in Jenkins: HBase-1.2 » latest1.7,Hadoop #245
Date Tue, 13 Oct 2015 08:55:54 GMT
See <https://builds.apache.org/job/HBase-1.2/jdk=latest1.7,label=Hadoop/245/changes>

Changes:

[stack] HBASE-14596 TestCellACLs failing... on1.2 builds; TUNEUP

[stack] HBASE-14588 Stop accessing test resources from within src folder (Andrew

[stack] HBASE-14268 Improve KeyLocker (Hiroshi Ikeda)

------------------------------------------
[...truncated 28313 lines...]
1116/1479 KB   
1120/1479 KB   
1124/1479 KB   
1128/1479 KB   
1132/1479 KB   
1136/1479 KB   
1140/1479 KB   
1144/1479 KB   
1148/1479 KB   
1152/1479 KB   
1156/1479 KB   
1160/1479 KB   
1164/1479 KB   
1168/1479 KB   
1172/1479 KB   
1176/1479 KB   
1180/1479 KB   
1184/1479 KB   
1188/1479 KB   
1192/1479 KB   
1196/1479 KB   
1200/1479 KB   
1204/1479 KB   
1208/1479 KB   
1212/1479 KB   
1216/1479 KB   
1220/1479 KB   
1224/1479 KB   
1228/1479 KB   
1232/1479 KB   
1236/1479 KB   
1240/1479 KB   
1244/1479 KB   
1248/1479 KB   
1252/1479 KB   
1256/1479 KB   
1260/1479 KB   
1264/1479 KB   
1268/1479 KB   
1272/1479 KB   
1276/1479 KB   
1280/1479 KB   
1284/1479 KB   
1288/1479 KB   
1292/1479 KB   
1296/1479 KB   
1300/1479 KB   
1304/1479 KB   
1308/1479 KB   
1312/1479 KB   
1316/1479 KB   
1320/1479 KB   
1324/1479 KB   
1328/1479 KB   
1332/1479 KB   
1336/1479 KB   
1340/1479 KB   
1344/1479 KB   
1348/1479 KB   
1352/1479 KB   
1356/1479 KB   
1360/1479 KB   
1364/1479 KB   
1368/1479 KB   
1372/1479 KB   
1376/1479 KB   
1380/1479 KB   
1384/1479 KB   
1388/1479 KB   
1392/1479 KB   
1396/1479 KB   
1400/1479 KB   
1404/1479 KB   
1408/1479 KB   
1412/1479 KB   
1416/1479 KB   
1420/1479 KB   
1424/1479 KB   
1428/1479 KB   
1432/1479 KB   
1436/1479 KB   
1440/1479 KB   
1444/1479 KB   
1448/1479 KB   
1452/1479 KB   
1456/1479 KB   
1460/1479 KB   
1464/1479 KB   
1468/1479 KB   
1472/1479 KB   
1476/1479 KB   
1479/1479 KB   
               
Downloaded: http://repo.maven.apache.org/maven2/org/apache/ant/ant/1.8.1/ant-1.8.1.jar (1479
KB at 7702.0 KB/sec)
[INFO] Executing tasks

main:
     [exec] ~/jenkins-slave/workspace/HBase-1.2/jdk/latest1.7/label/Hadoop/hbase-common ~/jenkins-slave/workspace/HBase-1.2/jdk/latest1.7/label/Hadoop/hbase-common
     [exec] ~/jenkins-slave/workspace/HBase-1.2/jdk/latest1.7/label/Hadoop/hbase-common
[INFO] Executed tasks
[INFO] 
[INFO] --- build-helper-maven-plugin:1.9.1:add-source (versionInfo-source) @ hbase-common
---
[INFO] Source directory: <https://builds.apache.org/job/HBase-1.2/jdk=latest1.7,label=Hadoop/ws/hbase-common/target/generated-sources/java>
added.
[INFO] 
[INFO] --- maven-remote-resources-plugin:1.5:process (default) @ hbase-common ---
[INFO] 
[INFO] --- maven-resources-plugin:2.6:resources (default-resources) @ hbase-common ---
[INFO] Using 'UTF-8' encoding to copy filtered resources.
[INFO] Copying 1 resource
[INFO] Copying 3 resources
[INFO] 
[INFO] --- maven-antrun-plugin:1.6:run (default) @ hbase-common ---
[INFO] Executing tasks

main:
    [mkdir] Created dir: <https://builds.apache.org/job/HBase-1.2/jdk=latest1.7,label=Hadoop/ws/hbase-common/target/nativelib>
     [exec] tar: hadoop-snappy-nativelibs.tar: Cannot open: No such file or directory
     [exec] tar: Error is not recoverable: exiting now
     [exec] Result: 2
[INFO] Executed tasks
[INFO] 
[INFO] --- maven-compiler-plugin:2.5.1:compile (default-compile) @ hbase-common ---
[INFO] Compiling 186 source files to <https://builds.apache.org/job/HBase-1.2/jdk=latest1.7,label=Hadoop/ws/hbase-common/target/classes>
[INFO] -------------------------------------------------------------
[ERROR] COMPILATION ERROR : 
[INFO] -------------------------------------------------------------
[ERROR] <https://builds.apache.org/job/HBase-1.2/jdk=latest1.7,label=Hadoop/ws/hbase-common/src/main/java/org/apache/hadoop/hbase/util/Bytes.java>:[52,15]
Unsafe is internal proprietary API and may be removed in a future release
[ERROR] <https://builds.apache.org/job/HBase-1.2/jdk=latest1.7,label=Hadoop/ws/hbase-common/src/main/java/org/apache/hadoop/hbase/util/UnsafeAccess.java>:[30,15]
Unsafe is internal proprietary API and may be removed in a future release
[ERROR] <https://builds.apache.org/job/HBase-1.2/jdk=latest1.7,label=Hadoop/ws/hbase-common/src/main/java/org/apache/hadoop/hbase/util/KeyLocker.java>:[51,16]
error: cannot find symbol
[ERROR]   symbol:   class WeakObjectPool
  location: class KeyLocker<K>
  where K is a type-variable:
    K extends Object declared in class KeyLocker
<https://builds.apache.org/job/HBase-1.2/jdk=latest1.7,label=Hadoop/ws/hbase-common/src/main/java/org/apache/hadoop/hbase/util/Bytes.java>:[1317,19]
Unsafe is internal proprietary API and may be removed in a future release
[ERROR] <https://builds.apache.org/job/HBase-1.2/jdk=latest1.7,label=Hadoop/ws/hbase-common/src/main/java/org/apache/hadoop/hbase/util/Bytes.java>:[1323,21]
Unsafe is internal proprietary API and may be removed in a future release
[ERROR] <https://builds.apache.org/job/HBase-1.2/jdk=latest1.7,label=Hadoop/ws/hbase-common/src/main/java/org/apache/hadoop/hbase/util/Bytes.java>:[1328,28]
Unsafe is internal proprietary API and may be removed in a future release
[ERROR] <https://builds.apache.org/job/HBase-1.2/jdk=latest1.7,label=Hadoop/ws/hbase-common/src/main/java/org/apache/hadoop/hbase/util/UnsafeAccess.java>:[38,22]
Unsafe is internal proprietary API and may be removed in a future release
[ERROR] <https://builds.apache.org/job/HBase-1.2/jdk=latest1.7,label=Hadoop/ws/hbase-common/src/main/java/org/apache/hadoop/hbase/util/UnsafeAccess.java>:[44,17]
Unsafe is internal proprietary API and may be removed in a future release
[ERROR] <https://builds.apache.org/job/HBase-1.2/jdk=latest1.7,label=Hadoop/ws/hbase-common/src/main/java/org/apache/hadoop/hbase/util/UnsafeAccess.java>:[48,20]
Unsafe is internal proprietary API and may be removed in a future release
[ERROR] <https://builds.apache.org/job/HBase-1.2/jdk=latest1.7,label=Hadoop/ws/hbase-common/src/main/java/org/apache/hadoop/hbase/util/KeyLocker.java>:[52,10]
error: cannot find symbol
[ERROR]   symbol:   class WeakObjectPool
  location: class KeyLocker<K>
  where K is a type-variable:
    K extends Object declared in class KeyLocker
<https://builds.apache.org/job/HBase-1.2/jdk=latest1.7,label=Hadoop/ws/hbase-common/src/main/java/org/apache/hadoop/hbase/util/KeyLocker.java>:[53,28]
error: package WeakObjectPool does not exist
[INFO] 11 errors 
[INFO] -------------------------------------------------------------
[INFO] ------------------------------------------------------------------------
[INFO] Reactor Summary:
[INFO] 
[INFO] Apache HBase ...................................... SUCCESS [1:50.667s]
[INFO] Apache HBase - Checkstyle ......................... SUCCESS [8.017s]
[INFO] Apache HBase - Resource Bundle .................... SUCCESS [0.197s]
[INFO] Apache HBase - Annotations ........................ SUCCESS [0.942s]
[INFO] Apache HBase - Protocol ........................... SUCCESS [17.158s]
[INFO] Apache HBase - Common ............................. FAILURE [4:33.692s]
[INFO] Apache HBase - Procedure .......................... SKIPPED
[INFO] Apache HBase - Client ............................. SKIPPED
[INFO] Apache HBase - Hadoop Compatibility ............... SKIPPED
[INFO] Apache HBase - Hadoop Two Compatibility ........... SKIPPED
[INFO] Apache HBase - Prefix Tree ........................ SKIPPED
[INFO] Apache HBase - Server ............................. SKIPPED
[INFO] Apache HBase - Testing Util ....................... SKIPPED
[INFO] Apache HBase - Thrift ............................. SKIPPED
[INFO] Apache HBase - Rest ............................... SKIPPED
[INFO] Apache HBase - Shell .............................. SKIPPED
[INFO] Apache HBase - Integration Tests .................. SKIPPED
[INFO] Apache HBase - Examples ........................... SKIPPED
[INFO] Apache HBase - External Block Cache ............... SKIPPED
[INFO] Apache HBase - Assembly ........................... SKIPPED
[INFO] Apache HBase - Shaded ............................. SKIPPED
[INFO] Apache HBase - Shaded - Client .................... SKIPPED
[INFO] Apache HBase - Shaded - Server .................... SKIPPED
[INFO] ------------------------------------------------------------------------
[INFO] BUILD FAILURE
[INFO] ------------------------------------------------------------------------
[INFO] Total time: 7:16.082s
[INFO] Finished at: Tue Oct 13 08:56:20 UTC 2015
[INFO] Final Memory: 54M/803M
[INFO] ------------------------------------------------------------------------
[ERROR] Failed to execute goal org.apache.maven.plugins:maven-compiler-plugin:2.5.1:compile
(default-compile) on project hbase-common: Compilation failure: Compilation failure:
[ERROR] <https://builds.apache.org/job/HBase-1.2/jdk=latest1.7,label=Hadoop/ws/hbase-common/src/main/java/org/apache/hadoop/hbase/util/Bytes.java>:[52,15]
Unsafe is internal proprietary API and may be removed in a future release
[ERROR] <https://builds.apache.org/job/HBase-1.2/jdk=latest1.7,label=Hadoop/ws/hbase-common/src/main/java/org/apache/hadoop/hbase/util/UnsafeAccess.java>:[30,15]
Unsafe is internal proprietary API and may be removed in a future release
[ERROR] <https://builds.apache.org/job/HBase-1.2/jdk=latest1.7,label=Hadoop/ws/hbase-common/src/main/java/org/apache/hadoop/hbase/util/KeyLocker.java>:[51,16]
error: cannot find symbol
[ERROR] symbol:   class WeakObjectPool
[ERROR] location: class KeyLocker<K>
[ERROR] where K is a type-variable:
[ERROR] K extends Object declared in class KeyLocker
[ERROR] <https://builds.apache.org/job/HBase-1.2/jdk=latest1.7,label=Hadoop/ws/hbase-common/src/main/java/org/apache/hadoop/hbase/util/Bytes.java>:[1317,19]
Unsafe is internal proprietary API and may be removed in a future release
[ERROR] <https://builds.apache.org/job/HBase-1.2/jdk=latest1.7,label=Hadoop/ws/hbase-common/src/main/java/org/apache/hadoop/hbase/util/Bytes.java>:[1323,21]
Unsafe is internal proprietary API and may be removed in a future release
[ERROR] <https://builds.apache.org/job/HBase-1.2/jdk=latest1.7,label=Hadoop/ws/hbase-common/src/main/java/org/apache/hadoop/hbase/util/Bytes.java>:[1328,28]
Unsafe is internal proprietary API and may be removed in a future release
[ERROR] <https://builds.apache.org/job/HBase-1.2/jdk=latest1.7,label=Hadoop/ws/hbase-common/src/main/java/org/apache/hadoop/hbase/util/UnsafeAccess.java>:[38,22]
Unsafe is internal proprietary API and may be removed in a future release
[ERROR] <https://builds.apache.org/job/HBase-1.2/jdk=latest1.7,label=Hadoop/ws/hbase-common/src/main/java/org/apache/hadoop/hbase/util/UnsafeAccess.java>:[44,17]
Unsafe is internal proprietary API and may be removed in a future release
[ERROR] <https://builds.apache.org/job/HBase-1.2/jdk=latest1.7,label=Hadoop/ws/hbase-common/src/main/java/org/apache/hadoop/hbase/util/UnsafeAccess.java>:[48,20]
Unsafe is internal proprietary API and may be removed in a future release
[ERROR] <https://builds.apache.org/job/HBase-1.2/jdk=latest1.7,label=Hadoop/ws/hbase-common/src/main/java/org/apache/hadoop/hbase/util/KeyLocker.java>:[52,10]
error: cannot find symbol
[ERROR] symbol:   class WeakObjectPool
[ERROR] location: class KeyLocker<K>
[ERROR] where K is a type-variable:
[ERROR] K extends Object declared in class KeyLocker
[ERROR] <https://builds.apache.org/job/HBase-1.2/jdk=latest1.7,label=Hadoop/ws/hbase-common/src/main/java/org/apache/hadoop/hbase/util/KeyLocker.java>:[53,28]
error: package WeakObjectPool does not exist
[ERROR] -> [Help 1]
[ERROR] 
[ERROR] To see the full stack trace of the errors, re-run Maven with the -e switch.
[ERROR] Re-run Maven using the -X switch to enable full debug logging.
[ERROR] 
[ERROR] For more information about the errors and possible solutions, please read the following
articles:
[ERROR] [Help 1] http://cwiki.apache.org/confluence/display/MAVEN/MojoFailureException
[ERROR] 
[ERROR] After correcting the problems, you can resume the build with the command
[ERROR]   mvn <goals> -rf :hbase-common
Build step 'Invoke top-level Maven targets' marked build as failure
Performing Post build task...
Match found for :.* : True
Logical operation result is TRUE
Running script  :   ZOMBIE_TESTS_COUNT=`jps | grep surefirebooter | wc -l`
  if [[ $ZOMBIE_TESTS_COUNT != 0 ]] ; then
    #It seems sometimes the tests are not dying immediately. Let's give them 10s
    echo "Suspicious java process found - waiting 10s to see if there are just slow to stop"
    sleep 10   
    ZOMBIE_TESTS_COUNT=`jps | grep surefirebooter | wc -l`
    if [[ $ZOMBIE_TESTS_COUNT != 0 ]] ; then
      echo "There are $ZOMBIE_TESTS_COUNT zombie tests, they should have been killed by surefire
but survived"
      echo "************ BEGIN zombies jstack extract"
      ZB_STACK=`jps | grep surefirebooter | cut -d ' ' -f 1 | xargs -n 1 jstack | grep ".test"
| grep "\.java"`
      jps | grep surefirebooter | cut -d ' ' -f 1 | xargs -n 1 jstack
      echo "************ END  zombies jstack extract"
      JIRA_COMMENT="$JIRA_COMMENT

     {color:red}-1 core zombie tests{color}.  There are ${ZOMBIE_TESTS_COUNT} zombie test(s):
${ZB_STACK}"
      BAD=1
      jps | grep surefirebooter | cut -d ' ' -f 1 | xargs kill -9
    else
      echo "We're ok: there is no zombie test, but some tests took some time to stop"
    fi
  else
    echo "We're ok: there is no zombie test"
  fi
[Hadoop] $ /bin/bash -xe /tmp/hudson4107425728175339383.sh
++ jps
++ grep surefirebooter
++ wc -l
+ ZOMBIE_TESTS_COUNT=0
+ [[ 0 != 0 ]]
+ echo 'We'\''re ok: there is no zombie test'
We're ok: there is no zombie test
POST BUILD TASK : SUCCESS
END OF POST BUILD TASK : 0
Archiving artifacts
Compressed 169.06 KB of artifacts by 56.8% relative to #243

Mime
View raw message