hbase-builds mailing list archives

Site index · List index
Message view « Date » · « Thread »
Top « Date » · « Thread »
From Apache Jenkins Server <jenk...@builds.apache.org>
Subject Build failed in Jenkins: HBase-TRUNK #6880
Date Wed, 07 Oct 2015 05:22:42 GMT
See <https://builds.apache.org/job/HBase-TRUNK/6880/changes>

Changes:

[mstanleyjones] HBASE-12615 Document GC conserving guidelines for contributors

[mstanleyjones] HBASE-12983 HBase book mentions hadoop.ssl.enabled when it should be

[mstanleyjones] HBASE-14424 Document that DisabledRegionSplitPolicy blocks manual splits

[mstanleyjones] Typo in FamilyFilter

[mstanleyjones] HBASE-14271 Improve Nexus Staging Instructions <Andrew Purtell>

------------------------------------------
[...truncated 5678 lines...]
Running org.apache.hadoop.hbase.quotas.TestQuotaAdmin
Tests run: 9, Failures: 0, Errors: 0, Skipped: 0, Time elapsed: 416.841 sec - in org.apache.hadoop.hbase.snapshot.TestMobExportSnapshot
Tests run: 3, Failures: 0, Errors: 0, Skipped: 0, Time elapsed: 4.81 sec - in org.apache.hadoop.hbase.quotas.TestQuotaAdmin
Running org.apache.hadoop.hbase.procedure.TestZKProcedureControllers
Tests run: 4, Failures: 0, Errors: 0, Skipped: 0, Time elapsed: 3.672 sec - in org.apache.hadoop.hbase.procedure.TestZKProcedureControllers
Running org.apache.hadoop.hbase.procedure.TestZKProcedure
Running org.apache.hadoop.hbase.quotas.TestQuotaThrottle
Running org.apache.hadoop.hbase.quotas.TestQuotaTableUtil
Tests run: 4, Failures: 0, Errors: 0, Skipped: 0, Time elapsed: 3.8 sec - in org.apache.hadoop.hbase.procedure.TestZKProcedure
Tests run: 3, Failures: 0, Errors: 0, Skipped: 0, Time elapsed: 2.329 sec - in org.apache.hadoop.hbase.quotas.TestQuotaTableUtil
Running org.apache.hadoop.hbase.io.hfile.TestForceCacheImportantBlocks
Running org.apache.hadoop.hbase.io.hfile.TestCacheOnWrite
Tests run: 5, Failures: 0, Errors: 0, Skipped: 0, Time elapsed: 81.938 sec - in org.apache.hadoop.hbase.snapshot.TestRestoreFlushSnapshotFromClient
Running org.apache.hadoop.hbase.io.hfile.TestHFileBlock
Tests run: 12, Failures: 0, Errors: 0, Skipped: 0, Time elapsed: 32.976 sec - in org.apache.hadoop.hbase.quotas.TestQuotaThrottle
Running org.apache.hadoop.hbase.io.hfile.TestHFileBlockIndex
Tests run: 2, Failures: 0, Errors: 0, Skipped: 0, Time elapsed: 40.43 sec - in org.apache.hadoop.hbase.io.hfile.TestForceCacheImportantBlocks
Tests run: 10, Failures: 0, Errors: 0, Skipped: 0, Time elapsed: 13.997 sec - in org.apache.hadoop.hbase.io.hfile.TestHFileBlockIndex
Running org.apache.hadoop.hbase.io.hfile.TestHFileSeek
Tests run: 1, Failures: 0, Errors: 0, Skipped: 0, Time elapsed: 5.399 sec - in org.apache.hadoop.hbase.io.hfile.TestHFileSeek
Running org.apache.hadoop.hbase.io.hfile.TestCacheConfig
Running org.apache.hadoop.hbase.io.hfile.TestScannerSelectionUsingTTL
Tests run: 6, Failures: 0, Errors: 0, Skipped: 0, Time elapsed: 3.876 sec - in org.apache.hadoop.hbase.io.hfile.TestCacheConfig
Running org.apache.hadoop.hbase.io.encoding.TestDataBlockEncoders
Tests run: 28, Failures: 0, Errors: 0, Skipped: 0, Time elapsed: 93.244 sec - in org.apache.hadoop.hbase.io.hfile.TestHFileBlock
Running org.apache.hadoop.hbase.io.encoding.TestEncodedSeekers
Tests run: 6, Failures: 0, Errors: 0, Skipped: 0, Time elapsed: 65.543 sec - in org.apache.hadoop.hbase.io.hfile.TestScannerSelectionUsingTTL
Running org.apache.hadoop.hbase.io.encoding.TestBufferedDataBlockEncoder
Tests run: 2, Failures: 0, Errors: 0, Skipped: 0, Time elapsed: 24.208 sec - in org.apache.hadoop.hbase.io.encoding.TestBufferedDataBlockEncoder
Running org.apache.hadoop.hbase.io.encoding.TestChangingEncoding
Tests run: 72, Failures: 0, Errors: 0, Skipped: 0, Time elapsed: 204.809 sec - in org.apache.hadoop.hbase.io.hfile.TestCacheOnWrite
Running org.apache.hadoop.hbase.io.encoding.TestLoadAndSwitchEncodeOnDisk
Tests run: 1, Failures: 0, Errors: 0, Skipped: 0, Time elapsed: 41.473 sec - in org.apache.hadoop.hbase.io.encoding.TestLoadAndSwitchEncodeOnDisk
Running org.apache.hadoop.hbase.io.TestFileLink
Tests run: 9, Failures: 0, Errors: 0, Skipped: 0, Time elapsed: 377.001 sec - in org.apache.hadoop.hbase.snapshot.TestExportSnapshot
Running org.apache.hadoop.hbase.wal.TestWALFactory
Tests run: 5, Failures: 0, Errors: 0, Skipped: 0, Time elapsed: 22.02 sec - in org.apache.hadoop.hbase.io.TestFileLink
Tests run: 20, Failures: 0, Errors: 0, Skipped: 0, Time elapsed: 180.332 sec - in org.apache.hadoop.hbase.io.encoding.TestEncodedSeekers
Running org.apache.hadoop.hbase.wal.TestWALFiltering
Running org.apache.hadoop.hbase.wal.TestWALReaderOnSecureWAL
Tests run: 2, Failures: 0, Errors: 0, Skipped: 0, Time elapsed: 2.959 sec - in org.apache.hadoop.hbase.wal.TestWALReaderOnSecureWAL
Tests run: 9, Failures: 0, Errors: 0, Skipped: 0, Time elapsed: 13.261 sec - in org.apache.hadoop.hbase.wal.TestWALFactory
Running org.apache.hadoop.hbase.wal.TestDefaultWALProvider
Running org.apache.hadoop.hbase.wal.TestWALSplit
Tests run: 5, Failures: 0, Errors: 0, Skipped: 0, Time elapsed: 10.117 sec - in org.apache.hadoop.hbase.wal.TestDefaultWALProvider
Tests run: 1, Failures: 0, Errors: 0, Skipped: 0, Time elapsed: 38.622 sec - in org.apache.hadoop.hbase.wal.TestWALFiltering
Running org.apache.hadoop.hbase.wal.TestBoundedRegionGroupingStrategy
Running org.apache.hadoop.hbase.wal.TestSecureWAL
Tests run: 1, Failures: 0, Errors: 0, Skipped: 0, Time elapsed: 1.866 sec - in org.apache.hadoop.hbase.wal.TestSecureWAL
Running org.apache.hadoop.hbase.wal.TestDefaultWALProviderWithHLogKey
Tests run: 5, Failures: 0, Errors: 0, Skipped: 0, Time elapsed: 31.219 sec - in org.apache.hadoop.hbase.wal.TestBoundedRegionGroupingStrategy
Tests run: 5, Failures: 0, Errors: 0, Skipped: 0, Time elapsed: 13.862 sec - in org.apache.hadoop.hbase.wal.TestDefaultWALProviderWithHLogKey
Running org.apache.hadoop.hbase.wal.TestWALSplitCompressed
Tests run: 3, Failures: 0, Errors: 0, Skipped: 0, Time elapsed: 194.166 sec - in org.apache.hadoop.hbase.io.encoding.TestChangingEncoding
Running org.apache.hadoop.hbase.zookeeper.TestZKLeaderManager
Tests run: 1, Failures: 0, Errors: 0, Skipped: 0, Time elapsed: 0.189 sec - in org.apache.hadoop.hbase.zookeeper.TestZKLeaderManager
Running org.apache.hadoop.hbase.zookeeper.TestZooKeeperACL
Tests run: 7, Failures: 0, Errors: 0, Skipped: 0, Time elapsed: 0.388 sec - in org.apache.hadoop.hbase.zookeeper.TestZooKeeperACL
Running org.apache.hadoop.hbase.zookeeper.TestZooKeeperNodeTracker
Tests run: 3, Failures: 0, Errors: 0, Skipped: 0, Time elapsed: 1.875 sec - in org.apache.hadoop.hbase.zookeeper.TestZooKeeperNodeTracker
Running org.apache.hadoop.hbase.zookeeper.TestRecoverableZooKeeper
Tests run: 1, Failures: 0, Errors: 0, Skipped: 0, Time elapsed: 1.385 sec - in org.apache.hadoop.hbase.zookeeper.TestRecoverableZooKeeper
Running org.apache.hadoop.hbase.zookeeper.TestZKMulti
Running org.apache.hadoop.hbase.zookeeper.lock.TestZKInterProcessReadWriteLock
Tests run: 12, Failures: 0, Errors: 0, Skipped: 0, Time elapsed: 3.569 sec - in org.apache.hadoop.hbase.zookeeper.TestZKMulti
Running org.apache.hadoop.hbase.zookeeper.TestHQuorumPeer
Tests run: 3, Failures: 0, Errors: 0, Skipped: 0, Time elapsed: 1.118 sec - in org.apache.hadoop.hbase.zookeeper.TestHQuorumPeer
Tests run: 31, Failures: 0, Errors: 0, Skipped: 0, Time elapsed: 99.636 sec - in org.apache.hadoop.hbase.wal.TestWALSplit
Running org.apache.hadoop.hbase.TestIOFencing
Tests run: 6, Failures: 0, Errors: 0, Skipped: 0, Time elapsed: 25.238 sec - in org.apache.hadoop.hbase.zookeeper.lock.TestZKInterProcessReadWriteLock
Running org.apache.hadoop.hbase.TestMovedRegionsCleaner
Running org.apache.hadoop.hbase.constraint.TestConstraint
Tests run: 1, Failures: 0, Errors: 0, Skipped: 0, Time elapsed: 18.492 sec - in org.apache.hadoop.hbase.TestMovedRegionsCleaner
Tests run: 5, Failures: 0, Errors: 0, Skipped: 0, Time elapsed: 32.823 sec - in org.apache.hadoop.hbase.constraint.TestConstraint
Tests run: 31, Failures: 0, Errors: 0, Skipped: 0, Time elapsed: 93.524 sec - in org.apache.hadoop.hbase.wal.TestWALSplitCompressed
Running org.apache.hadoop.hbase.backup.TestHFileArchiving
Running org.apache.hadoop.hbase.backup.example.TestZooKeeperTableArchiveClient
Tests run: 3, Failures: 0, Errors: 0, Skipped: 0, Time elapsed: 6.518 sec - in org.apache.hadoop.hbase.backup.example.TestZooKeeperTableArchiveClient
Running org.apache.hadoop.hbase.ipc.TestProtoBufRpc
Tests run: 1, Failures: 0, Errors: 0, Skipped: 0, Time elapsed: 4.185 sec - in org.apache.hadoop.hbase.ipc.TestProtoBufRpc
Running org.apache.hadoop.hbase.ipc.TestDelayedRpc
Running org.apache.hadoop.hbase.TestHColumnDescriptorDefaultVersions
Tests run: 4, Failures: 0, Errors: 0, Skipped: 0, Time elapsed: 5.613 sec - in org.apache.hadoop.hbase.ipc.TestDelayedRpc
Running org.apache.hadoop.hbase.ipc.TestHBaseClient
Tests run: 1, Failures: 0, Errors: 0, Skipped: 0, Time elapsed: 1.538 sec - in org.apache.hadoop.hbase.ipc.TestHBaseClient
Tests run: 3, Failures: 0, Errors: 0, Skipped: 0, Time elapsed: 35.024 sec - in org.apache.hadoop.hbase.TestHColumnDescriptorDefaultVersions
Running org.apache.hadoop.hbase.TestNamespace
Tests run: 2, Failures: 0, Errors: 0, Skipped: 0, Time elapsed: 121.756 sec - in org.apache.hadoop.hbase.TestIOFencing
Tests run: 8, Failures: 0, Errors: 0, Skipped: 0, Time elapsed: 54.196 sec - in org.apache.hadoop.hbase.TestNamespace
Tests run: 5, Failures: 0, Errors: 0, Skipped: 0, Time elapsed: 123.391 sec - in org.apache.hadoop.hbase.backup.TestHFileArchiving
Tests run: 56, Failures: 0, Errors: 0, Skipped: 0, Time elapsed: 619.252 sec - in org.apache.hadoop.hbase.io.encoding.TestDataBlockEncoders

Results :

Tests in error: 
  TestSnapshotCloneIndependence.testOfflineSnapshotDeleteIndependent:179->runTestSnapshotDeleteIndependent:428->countRows:443
ยป RetriesExhausted

Tests run: 2566, Failures: 0, Errors: 1, Skipped: 51

[INFO] ------------------------------------------------------------------------
[INFO] Reactor Summary:
[INFO] 
[INFO] Apache HBase ...................................... SUCCESS [  3.181 s]
[INFO] Apache HBase - Checkstyle ......................... SUCCESS [  0.717 s]
[INFO] Apache HBase - Resource Bundle .................... SUCCESS [  0.212 s]
[INFO] Apache HBase - Annotations ........................ SUCCESS [  0.218 s]
[INFO] Apache HBase - Protocol ........................... SUCCESS [  2.759 s]
[INFO] Apache HBase - Common ............................. SUCCESS [02:49 min]
[INFO] Apache HBase - Procedure .......................... SUCCESS [02:06 min]
[INFO] Apache HBase - Client ............................. SUCCESS [02:07 min]
[INFO] Apache HBase - Hadoop Compatibility ............... SUCCESS [ 14.716 s]
[INFO] Apache HBase - Hadoop Two Compatibility ........... SUCCESS [ 17.579 s]
[INFO] Apache HBase - Prefix Tree ........................ SUCCESS [ 24.719 s]
[INFO] Apache HBase - Server ............................. FAILURE [  02:37 h]
[INFO] Apache HBase - Testing Util ....................... SKIPPED
[INFO] Apache HBase - Thrift ............................. SKIPPED
[INFO] Apache HBase - Shell .............................. SKIPPED
[INFO] Apache HBase - Integration Tests .................. SKIPPED
[INFO] Apache HBase - Examples ........................... SKIPPED
[INFO] Apache HBase - Rest ............................... SKIPPED
[INFO] Apache HBase - External Block Cache ............... SKIPPED
[INFO] Apache HBase - Assembly ........................... SKIPPED
[INFO] Apache HBase - Shaded ............................. SKIPPED
[INFO] Apache HBase - Shaded - Client .................... SKIPPED
[INFO] Apache HBase - Shaded - Server .................... SKIPPED
[INFO] Apache HBase - Spark .............................. SKIPPED
[INFO] ------------------------------------------------------------------------
[INFO] BUILD FAILURE
[INFO] ------------------------------------------------------------------------
[INFO] Total time: 02:45 h
[INFO] Finished at: 2015-10-07T05:20:31+00:00
[INFO] Final Memory: 64M/693M
[INFO] ------------------------------------------------------------------------
[ERROR] Failed to execute goal org.apache.maven.plugins:maven-surefire-plugin:2.18.1:test
(secondPartTestsExecution) on project hbase-server: There are test failures.
[ERROR] 
[ERROR] Please refer to <https://builds.apache.org/job/HBase-TRUNK/ws/hbase-server/target/surefire-reports>
for the individual test results.
[ERROR] -> [Help 1]
[ERROR] 
[ERROR] To see the full stack trace of the errors, re-run Maven with the -e switch.
[ERROR] Re-run Maven using the -X switch to enable full debug logging.
[ERROR] 
[ERROR] For more information about the errors and possible solutions, please read the following
articles:
[ERROR] [Help 1] http://cwiki.apache.org/confluence/display/MAVEN/MojoFailureException
[ERROR] 
[ERROR] After correcting the problems, you can resume the build with the command
[ERROR]   mvn <goals> -rf :hbase-server
Build step 'Invoke top-level Maven targets' marked build as failure
Performing Post build task...
Match found for :.* : True
Logical operation result is TRUE
Running script  :   ZOMBIE_TESTS_COUNT=`jps | grep surefirebooter | wc -l`
  if [[ $ZOMBIE_TESTS_COUNT != 0 ]] ; then
    #It seems sometimes the tests are not dying immediately. Let's give them 10s
    echo "Suspicious java process found - waiting 10s to see if there are just slow to stop"
    sleep 10   
    ZOMBIE_TESTS_COUNT=`jps | grep surefirebooter | wc -l`
    if [[ $ZOMBIE_TESTS_COUNT != 0 ]] ; then
      echo "There are $ZOMBIE_TESTS_COUNT zombie tests, they should have been killed by surefire
but survived"
      echo "************ BEGIN zombies jstack extract"
      ZB_STACK=`jps | grep surefirebooter | cut -d ' ' -f 1 | xargs -n 1 jstack | grep ".test"
| grep "\.java"`
      jps | grep surefirebooter | cut -d ' ' -f 1 | xargs -n 1 jstack
      echo "************ END  zombies jstack extract"
      JIRA_COMMENT="$JIRA_COMMENT

     {color:red}-1 core zombie tests{color}.  There are ${ZOMBIE_TESTS_COUNT} zombie test(s):
${ZB_STACK}"
      BAD=1
      jps | grep surefirebooter | cut -d ' ' -f 1 | xargs kill -9
    else
      echo "We're ok: there is no zombie test, but some tests took some time to stop"
    fi
  else
    echo "We're ok: there is no zombie test"
  fi
[HBase-TRUNK] $ /bin/bash -xe /tmp/hudson7814423771487948637.sh
++ jps
++ grep surefirebooter
++ wc -l
+ ZOMBIE_TESTS_COUNT=0
+ [[ 0 != 0 ]]
+ echo 'We'\''re ok: there is no zombie test'
We're ok: there is no zombie test
POST BUILD TASK : SUCCESS
END OF POST BUILD TASK : 0
Archiving artifacts
Recording test results
[FINDBUGS] Collecting findbugs analysis files...
[FINDBUGS] Finding all files that match the pattern **/findbugs.xml,**/findbugsXml.xml
[FINDBUGS] Parsing 28 files in <https://builds.apache.org/job/HBase-TRUNK/ws/>
[FINDBUGS] Successfully parsed file <https://builds.apache.org/job/HBase-TRUNK/6880/artifact/hbase-annotations/target/findbugs.xml>
with 0 unique warnings and 0 duplicates.
[FINDBUGS] Successfully parsed file <https://builds.apache.org/job/HBase-TRUNK/6880/artifact/hbase-annotations/target/findbugsXml.xml>
with 0 unique warnings and 0 duplicates.
[FINDBUGS] Successfully parsed file <https://builds.apache.org/job/HBase-TRUNK/6880/artifact/hbase-client/target/findbugs.xml>
with 0 unique warnings and 0 duplicates.
[FINDBUGS] Successfully parsed file <https://builds.apache.org/job/HBase-TRUNK/6880/artifact/hbase-client/target/findbugsXml.xml>
with 12 unique warnings and 0 duplicates.
[FINDBUGS] Successfully parsed file <https://builds.apache.org/job/HBase-TRUNK/6880/artifact/hbase-common/target/findbugs.xml>
with 12 unique warnings and 0 duplicates.
[FINDBUGS] Successfully parsed file <https://builds.apache.org/job/HBase-TRUNK/6880/artifact/hbase-common/target/findbugsXml.xml>
with 20 unique warnings and 0 duplicates.
[FINDBUGS] Successfully parsed file <https://builds.apache.org/job/HBase-TRUNK/6880/artifact/hbase-examples/target/findbugs.xml>
with 20 unique warnings and 0 duplicates.
[FINDBUGS] Successfully parsed file <https://builds.apache.org/job/HBase-TRUNK/6880/artifact/hbase-examples/target/findbugsXml.xml>
with 20 unique warnings and 0 duplicates.
[FINDBUGS] Successfully parsed file <https://builds.apache.org/job/HBase-TRUNK/6880/artifact/hbase-external-blockcache/target/findbugs.xml>
with 20 unique warnings and 0 duplicates.
[FINDBUGS] Successfully parsed file <https://builds.apache.org/job/HBase-TRUNK/6880/artifact/hbase-external-blockcache/target/findbugsXml.xml>
with 20 unique warnings and 0 duplicates.
[FINDBUGS] Successfully parsed file <https://builds.apache.org/job/HBase-TRUNK/6880/artifact/hbase-hadoop-compat/target/findbugs.xml>
with 20 unique warnings and 0 duplicates.
[FINDBUGS] Successfully parsed file <https://builds.apache.org/job/HBase-TRUNK/6880/artifact/hbase-hadoop-compat/target/findbugsXml.xml>
with 20 unique warnings and 0 duplicates.
[FINDBUGS] Successfully parsed file <https://builds.apache.org/job/HBase-TRUNK/6880/artifact/hbase-hadoop2-compat/target/findbugs.xml>
with 20 unique warnings and 0 duplicates.
[FINDBUGS] Successfully parsed file <https://builds.apache.org/job/HBase-TRUNK/6880/artifact/hbase-hadoop2-compat/target/findbugsXml.xml>
with 20 unique warnings and 0 duplicates.
[FINDBUGS] Successfully parsed file <https://builds.apache.org/job/HBase-TRUNK/6880/artifact/hbase-prefix-tree/target/findbugs.xml>
with 20 unique warnings and 0 duplicates.
[FINDBUGS] Successfully parsed file <https://builds.apache.org/job/HBase-TRUNK/6880/artifact/hbase-prefix-tree/target/findbugsXml.xml>
with 21 unique warnings and 0 duplicates.
[FINDBUGS] Successfully parsed file <https://builds.apache.org/job/HBase-TRUNK/6880/artifact/hbase-procedure/target/findbugs.xml>
with 21 unique warnings and 0 duplicates.
[FINDBUGS] Successfully parsed file <https://builds.apache.org/job/HBase-TRUNK/6880/artifact/hbase-procedure/target/findbugsXml.xml>
with 22 unique warnings and 0 duplicates.
[FINDBUGS] Successfully parsed file <https://builds.apache.org/job/HBase-TRUNK/6880/artifact/hbase-protocol/target/findbugs.xml>
with 22 unique warnings and 0 duplicates.
[FINDBUGS] Successfully parsed file <https://builds.apache.org/job/HBase-TRUNK/6880/artifact/hbase-protocol/target/findbugsXml.xml>
with 22 unique warnings and 0 duplicates.
[FINDBUGS] Successfully parsed file <https://builds.apache.org/job/HBase-TRUNK/6880/artifact/hbase-rest/target/findbugs.xml>
with 22 unique warnings and 0 duplicates.
[FINDBUGS] Successfully parsed file <https://builds.apache.org/job/HBase-TRUNK/6880/artifact/hbase-rest/target/findbugsXml.xml>
with 24 unique warnings and 0 duplicates.
[FINDBUGS] Successfully parsed file <https://builds.apache.org/job/HBase-TRUNK/6880/artifact/hbase-server/target/findbugs.xml>
with 24 unique warnings and 0 duplicates.
[FINDBUGS] Successfully parsed file <https://builds.apache.org/job/HBase-TRUNK/6880/artifact/hbase-server/target/findbugsXml.xml>
with 100 unique warnings and 1 duplicate.
[FINDBUGS] Successfully parsed file <https://builds.apache.org/job/HBase-TRUNK/6880/artifact/hbase-spark/target/findbugs.xml>
with 100 unique warnings and 0 duplicates.
[FINDBUGS] Successfully parsed file <https://builds.apache.org/job/HBase-TRUNK/6880/artifact/hbase-spark/target/findbugsXml.xml>
with 131 unique warnings and 0 duplicates.
[FINDBUGS] Successfully parsed file <https://builds.apache.org/job/HBase-TRUNK/6880/artifact/hbase-thrift/target/findbugs.xml>
with 131 unique warnings and 0 duplicates.
[FINDBUGS] Successfully parsed file <https://builds.apache.org/job/HBase-TRUNK/6880/artifact/hbase-thrift/target/findbugsXml.xml>
with 131 unique warnings and 0 duplicates.
[FINDBUGS] Computing warning deltas based on reference build #6751
[CHECKSTYLE] Collecting checkstyle analysis files...
[CHECKSTYLE] Finding all files that match the pattern **/checkstyle-result.xml
[CHECKSTYLE] Parsing 24 files in <https://builds.apache.org/job/HBase-TRUNK/ws/>
[CHECKSTYLE] Successfully parsed file <https://builds.apache.org/job/HBase-TRUNK/6880/artifact/hbase-annotations/target/checkstyle-result.xml>
with 0 unique warnings and 0 duplicates.
[CHECKSTYLE] Successfully parsed file <https://builds.apache.org/job/HBase-TRUNK/6880/artifact/hbase-assembly/target/checkstyle-result.xml>
with 0 unique warnings and 0 duplicates.
[CHECKSTYLE] Successfully parsed file <https://builds.apache.org/job/HBase-TRUNK/6880/artifact/hbase-checkstyle/target/checkstyle-result.xml>
with 0 unique warnings and 0 duplicates.
[CHECKSTYLE] Successfully parsed file <https://builds.apache.org/job/HBase-TRUNK/6880/artifact/hbase-client/target/checkstyle-result.xml>
with 202 unique warnings and 0 duplicates.
[CHECKSTYLE] Successfully parsed file <https://builds.apache.org/job/HBase-TRUNK/6880/artifact/hbase-common/target/checkstyle-result.xml>
with 303 unique warnings and 0 duplicates.
[CHECKSTYLE] Successfully parsed file <https://builds.apache.org/job/HBase-TRUNK/6880/artifact/hbase-examples/target/checkstyle-result.xml>
with 331 unique warnings and 0 duplicates.
[CHECKSTYLE] Successfully parsed file <https://builds.apache.org/job/HBase-TRUNK/6880/artifact/hbase-external-blockcache/target/checkstyle-result.xml>
with 331 unique warnings and 0 duplicates.
[CHECKSTYLE] Successfully parsed file <https://builds.apache.org/job/HBase-TRUNK/6880/artifact/hbase-hadoop-compat/target/checkstyle-result.xml>
with 333 unique warnings and 0 duplicates.
[CHECKSTYLE] Successfully parsed file <https://builds.apache.org/job/HBase-TRUNK/6880/artifact/hbase-hadoop2-compat/target/checkstyle-result.xml>
with 364 unique warnings and 0 duplicates.
[CHECKSTYLE] Successfully parsed file <https://builds.apache.org/job/HBase-TRUNK/6880/artifact/hbase-it/target/checkstyle-result.xml>
with 364 unique warnings and 0 duplicates.
[CHECKSTYLE] Successfully parsed file <https://builds.apache.org/job/HBase-TRUNK/6880/artifact/hbase-prefix-tree/target/checkstyle-result.xml>
with 380 unique warnings and 0 duplicates.
[CHECKSTYLE] Successfully parsed file <https://builds.apache.org/job/HBase-TRUNK/6880/artifact/hbase-procedure/target/checkstyle-result.xml>
with 380 unique warnings and 0 duplicates.
[CHECKSTYLE] Successfully parsed file <https://builds.apache.org/job/HBase-TRUNK/6880/artifact/hbase-protocol/target/checkstyle-result.xml>
with 382 unique warnings and 0 duplicates.
[CHECKSTYLE] Successfully parsed file <https://builds.apache.org/job/HBase-TRUNK/6880/artifact/hbase-resource-bundle/target/checkstyle-result.xml>
with 382 unique warnings and 0 duplicates.
[CHECKSTYLE] Successfully parsed file <https://builds.apache.org/job/HBase-TRUNK/6880/artifact/hbase-rest/target/checkstyle-result.xml>
with 424 unique warnings and 0 duplicates.
[CHECKSTYLE] Successfully parsed file <https://builds.apache.org/job/HBase-TRUNK/6880/artifact/hbase-server/target/checkstyle-result.xml>
with 1752 unique warnings and 0 duplicates.
[CHECKSTYLE] Successfully parsed file <https://builds.apache.org/job/HBase-TRUNK/6880/artifact/hbase-shaded/hbase-shaded-client/target/checkstyle-result.xml>
with 1752 unique warnings and 0 duplicates.
[CHECKSTYLE] Successfully parsed file <https://builds.apache.org/job/HBase-TRUNK/6880/artifact/hbase-shaded/hbase-shaded-server/target/checkstyle-result.xml>
with 1752 unique warnings and 0 duplicates.
[CHECKSTYLE] Successfully parsed file <https://builds.apache.org/job/HBase-TRUNK/6880/artifact/hbase-shaded/target/checkstyle-result.xml>
with 1752 unique warnings and 0 duplicates.
[CHECKSTYLE] Successfully parsed file <https://builds.apache.org/job/HBase-TRUNK/6880/artifact/hbase-shell/target/checkstyle-result.xml>
with 1752 unique warnings and 0 duplicates.
[CHECKSTYLE] Successfully parsed file <https://builds.apache.org/job/HBase-TRUNK/6880/artifact/hbase-spark/target/checkstyle-result.xml>
with 1752 unique warnings and 0 duplicates.
[CHECKSTYLE] Successfully parsed file <https://builds.apache.org/job/HBase-TRUNK/6880/artifact/hbase-testing-util/target/checkstyle-result.xml>
with 1752 unique warnings and 0 duplicates.
[CHECKSTYLE] Successfully parsed file <https://builds.apache.org/job/HBase-TRUNK/6880/artifact/hbase-thrift/target/checkstyle-result.xml>
with 1774 unique warnings and 0 duplicates.
[CHECKSTYLE] Successfully parsed file <https://builds.apache.org/job/HBase-TRUNK/6880/artifact/target/checkstyle-result.xml>
with 1774 unique warnings and 0 duplicates.
[CHECKSTYLE] Computing warning deltas based on reference build #6751
Updating HBASE-14271
Updating HBASE-12615
Updating HBASE-12983
Updating HBASE-14424

Mime
View raw message