hbase-builds mailing list archives

Site index · List index
Message view « Date » · « Thread »
Top « Date » · « Thread »
From Apache Jenkins Server <jenk...@builds.apache.org>
Subject Build failed in Jenkins: HBase-TRUNK #6875
Date Tue, 06 Oct 2015 03:13:07 GMT
See <https://builds.apache.org/job/HBase-TRUNK/6875/changes>

Changes:

[matteo.bertozzi] HBASE-14347 Add a switch to DynamicClassLoader to disable it (huaxiang

------------------------------------------
[...truncated 5544 lines...]
Tests run: 4, Failures: 0, Errors: 0, Skipped: 0, Time elapsed: 88.944 sec - in org.apache.hadoop.hbase.mapred.TestTableMapReduceUtil
Running org.apache.hadoop.hbase.mapred.TestTableSnapshotInputFormat
Running org.apache.hadoop.hbase.mapred.TestTableMapReduce
Tests run: 8, Failures: 0, Errors: 0, Skipped: 0, Time elapsed: 96.499 sec - in org.apache.hadoop.hbase.mapred.TestTableInputFormat
Running org.apache.hadoop.hbase.replication.TestReplicationTrackerZKImpl
Tests run: 5, Failures: 0, Errors: 0, Skipped: 0, Time elapsed: 1.846 sec - in org.apache.hadoop.hbase.replication.TestReplicationTrackerZKImpl
Running org.apache.hadoop.hbase.replication.TestReplicationEndpoint
Tests run: 3, Failures: 0, Errors: 0, Skipped: 0, Time elapsed: 3.103 sec - in org.apache.hadoop.hbase.replication.TestReplicationEndpoint
Tests run: 2, Failures: 0, Errors: 0, Skipped: 0, Time elapsed: 108.032 sec - in org.apache.hadoop.hbase.mapred.TestTableMapReduce
Tests run: 4, Failures: 0, Errors: 0, Skipped: 0, Time elapsed: 157.708 sec - in org.apache.hadoop.hbase.mapred.TestMultiTableSnapshotInputFormat
Running org.apache.hadoop.hbase.replication.TestReplicationDisableInactivePeer
Running org.apache.hadoop.hbase.replication.TestReplicationKillMasterRSCompressed
Tests run: 1, Failures: 0, Errors: 0, Skipped: 0, Time elapsed: 21.173 sec - in org.apache.hadoop.hbase.replication.TestReplicationDisableInactivePeer
Running org.apache.hadoop.hbase.replication.multiwal.TestReplicationEndpointWithMultipleWAL
Tests run: 3, Failures: 0, Errors: 0, Skipped: 0, Time elapsed: 4.276 sec - in org.apache.hadoop.hbase.replication.multiwal.TestReplicationEndpointWithMultipleWAL
Tests run: 1, Failures: 0, Errors: 0, Skipped: 0, Time elapsed: 31.44 sec - in org.apache.hadoop.hbase.replication.TestReplicationKillMasterRSCompressed
Running org.apache.hadoop.hbase.replication.multiwal.TestReplicationKillMasterRSCompressedWithMultipleWAL
Running org.apache.hadoop.hbase.replication.multiwal.TestReplicationSyncUpToolWithMultipleWAL
Running org.apache.hadoop.hbase.replication.TestPerTableCFReplication
Tests run: 1, Failures: 0, Errors: 0, Skipped: 0, Time elapsed: 26.396 sec - in org.apache.hadoop.hbase.replication.multiwal.TestReplicationKillMasterRSCompressedWithMultipleWAL
Tests run: 56, Failures: 0, Errors: 0, Skipped: 0, Time elapsed: 484.746 sec - in org.apache.hadoop.hbase.io.encoding.TestDataBlockEncoders
Running org.apache.hadoop.hbase.replication.regionserver.TestReplicationSourceManager
Running org.apache.hadoop.hbase.replication.regionserver.TestReplicationSink
Tests run: 5, Failures: 0, Errors: 0, Skipped: 0, Time elapsed: 5.869 sec - in org.apache.hadoop.hbase.replication.regionserver.TestReplicationSourceManager
Tests run: 5, Failures: 0, Errors: 0, Skipped: 0, Time elapsed: 2.45 sec - in org.apache.hadoop.hbase.replication.regionserver.TestReplicationSink
Tests run: 2, Failures: 0, Errors: 0, Skipped: 0, Time elapsed: 45.15 sec - in org.apache.hadoop.hbase.replication.TestPerTableCFReplication
Running org.apache.hadoop.hbase.replication.regionserver.TestReplicationWALReaderManager
Running org.apache.hadoop.hbase.replication.regionserver.TestRegionReplicaReplicationEndpoint
Tests run: 1, Failures: 0, Errors: 0, Skipped: 0, Time elapsed: 74.39 sec - in org.apache.hadoop.hbase.replication.multiwal.TestReplicationSyncUpToolWithMultipleWAL
Running org.apache.hadoop.hbase.replication.regionserver.TestRegionReplicaReplicationEndpointNoMaster
Running org.apache.hadoop.hbase.replication.TestReplicationSource
Tests run: 1, Failures: 0, Errors: 0, Skipped: 0, Time elapsed: 0.439 sec - in org.apache.hadoop.hbase.replication.TestReplicationSource
Running org.apache.hadoop.hbase.replication.TestReplicationChangingPeerRegionservers
Tests run: 1, Failures: 0, Errors: 0, Skipped: 0, Time elapsed: 4.779 sec - in org.apache.hadoop.hbase.replication.TestReplicationChangingPeerRegionservers
Tests run: 4, Failures: 0, Errors: 0, Skipped: 0, Time elapsed: 57.353 sec - in org.apache.hadoop.hbase.replication.regionserver.TestRegionReplicaReplicationEndpointNoMaster
Running org.apache.hadoop.hbase.replication.TestReplicationSyncUpTool
Tests run: 7, Failures: 0, Errors: 0, Skipped: 0, Time elapsed: 390.133 sec - in org.apache.hadoop.hbase.mapred.TestTableSnapshotInputFormat
Running org.apache.hadoop.hbase.replication.TestReplicationKillMasterRS
Running org.apache.hadoop.hbase.replication.TestMultiSlaveReplication
Tests run: 1, Failures: 0, Errors: 0, Skipped: 0, Time elapsed: 30.05 sec - in org.apache.hadoop.hbase.replication.TestReplicationKillMasterRS
Tests run: 9, Failures: 0, Errors: 0, Skipped: 0, Time elapsed: 152.215 sec - in org.apache.hadoop.hbase.replication.regionserver.TestRegionReplicaReplicationEndpoint
Tests run: 1, Failures: 0, Errors: 0, Skipped: 0, Time elapsed: 56.764 sec - in org.apache.hadoop.hbase.replication.TestMultiSlaveReplication
Running org.apache.hadoop.hbase.replication.TestReplicationStateZKImpl
Tests run: 6, Failures: 0, Errors: 0, Skipped: 0, Time elapsed: 3.282 sec - in org.apache.hadoop.hbase.replication.TestReplicationStateZKImpl
Running org.apache.hadoop.hbase.replication.TestReplicationWithTags
Tests run: 1, Failures: 0, Errors: 0, Skipped: 0, Time elapsed: 73.839 sec - in org.apache.hadoop.hbase.replication.TestReplicationSyncUpTool
Tests run: 1, Failures: 0, Errors: 0, Skipped: 0, Time elapsed: 2.94 sec - in org.apache.hadoop.hbase.replication.TestReplicationWithTags
Running org.apache.hadoop.hbase.replication.TestMasterReplication
Running org.apache.hadoop.hbase.replication.TestReplicationKillSlaveRS
Running org.apache.hadoop.hbase.util.TestMergeTool
Tests run: 1, Failures: 0, Errors: 0, Skipped: 0, Time elapsed: 28.901 sec - in org.apache.hadoop.hbase.replication.TestReplicationKillSlaveRS
Running org.apache.hadoop.hbase.util.TestFSTableDescriptors
Running org.apache.hadoop.hbase.replication.TestReplicationSmallTests
Tests run: 1, Failures: 0, Errors: 0, Skipped: 0, Time elapsed: 34.065 sec - in org.apache.hadoop.hbase.util.TestMergeTool
Tests run: 16, Failures: 0, Errors: 0, Skipped: 0, Time elapsed: 4.808 sec - in org.apache.hadoop.hbase.util.TestFSTableDescriptors
Running org.apache.hadoop.hbase.util.TestHBaseFsckEncryption
Running org.apache.hadoop.hbase.util.TestConnectionCache
Tests run: 1, Failures: 0, Errors: 0, Skipped: 0, Time elapsed: 22.738 sec - in org.apache.hadoop.hbase.util.TestHBaseFsckEncryption
Tests run: 1, Failures: 0, Errors: 0, Skipped: 0, Time elapsed: 26.598 sec - in org.apache.hadoop.hbase.util.TestConnectionCache
Running org.apache.hadoop.hbase.util.TestIdLock
Running org.apache.hadoop.hbase.util.TestMiniClusterLoadSequential
Tests run: 1, Failures: 0, Errors: 0, Skipped: 0, Time elapsed: 15.18 sec - in org.apache.hadoop.hbase.util.TestIdLock
Running org.apache.hadoop.hbase.util.TestMergeTable
Tests run: 10, Failures: 0, Errors: 0, Skipped: 0, Time elapsed: 72.722 sec - in org.apache.hadoop.hbase.replication.TestReplicationSmallTests
Running org.apache.hadoop.hbase.util.TestMiniClusterLoadParallel
Tests run: 1, Failures: 0, Errors: 0, Skipped: 0, Time elapsed: 40.769 sec - in org.apache.hadoop.hbase.util.TestMergeTable
Tests run: 3, Failures: 1, Errors: 0, Skipped: 0, Time elapsed: 139.419 sec <<< FAILURE!
- in org.apache.hadoop.hbase.replication.TestMasterReplication
testCyclicReplication2(org.apache.hadoop.hbase.replication.TestMasterReplication)  Time elapsed:
50.388 sec  <<< FAILURE!
java.lang.AssertionError: Waited too much time for replication. Row:row4. IsDeleteReplication:true
	at org.junit.Assert.fail(Assert.java:88)
	at org.apache.hadoop.hbase.replication.TestMasterReplication.wait(TestMasterReplication.java:386)
	at org.apache.hadoop.hbase.replication.TestMasterReplication.testCyclicReplication2(TestMasterReplication.java:204)

Running org.apache.hadoop.hbase.util.TestFSUtils
Running org.apache.hadoop.hbase.util.TestHBaseFsck
Tests run: 8, Failures: 0, Errors: 0, Skipped: 0, Time elapsed: 355.459 sec - in org.apache.hadoop.hbase.replication.regionserver.TestReplicationWALReaderManager
Tests run: 4, Failures: 0, Errors: 0, Skipped: 0, Time elapsed: 81.407 sec - in org.apache.hadoop.hbase.util.TestMiniClusterLoadSequential
Running org.apache.hadoop.hbase.util.TestProcessBasedCluster
Tests run: 1, Failures: 0, Errors: 0, Skipped: 0, Time elapsed: 0.06 sec - in org.apache.hadoop.hbase.util.TestProcessBasedCluster
Running org.apache.hadoop.hbase.util.TestTableName
Tests run: 6, Failures: 0, Errors: 0, Skipped: 0, Time elapsed: 0.452 sec - in org.apache.hadoop.hbase.util.TestTableName
Running org.apache.hadoop.hbase.util.TestMiniClusterLoadEncoded
Tests run: 11, Failures: 0, Errors: 0, Skipped: 0, Time elapsed: 37.369 sec - in org.apache.hadoop.hbase.util.TestFSUtils
Running org.apache.hadoop.hbase.util.TestRegionSplitter

Results :

Failed tests: 
  TestMasterReplication.testCyclicReplication2:204->wait:386 Waited too much time for replication.
Row:row4. IsDeleteReplication:true
Tests in error: 
  TestSnapshotCloneIndependence.testOfflineSnapshotAppendIndependent ? RestoreSnapshot
  TestSnapshotCloneIndependence.testOnlineSnapshotDeleteIndependent:184->runTestSnapshotDeleteIndependent:428->countRows:443
? RetriesExhausted

Tests run: 2380, Failures: 1, Errors: 2, Skipped: 21

[INFO] ------------------------------------------------------------------------
[INFO] Reactor Summary:
[INFO] 
[INFO] Apache HBase ...................................... SUCCESS [  2.845 s]
[INFO] Apache HBase - Checkstyle ......................... SUCCESS [  0.751 s]
[INFO] Apache HBase - Resource Bundle .................... SUCCESS [  0.187 s]
[INFO] Apache HBase - Annotations ........................ SUCCESS [  0.730 s]
[INFO] Apache HBase - Protocol ........................... SUCCESS [  6.097 s]
[INFO] Apache HBase - Common ............................. SUCCESS [04:02 min]
[INFO] Apache HBase - Procedure .......................... SUCCESS [02:08 min]
[INFO] Apache HBase - Client ............................. SUCCESS [02:03 min]
[INFO] Apache HBase - Hadoop Compatibility ............... SUCCESS [ 14.449 s]
[INFO] Apache HBase - Hadoop Two Compatibility ........... SUCCESS [ 21.083 s]
[INFO] Apache HBase - Prefix Tree ........................ SUCCESS [ 23.962 s]
[INFO] Apache HBase - Server ............................. FAILURE [  02:42 h]
[INFO] Apache HBase - Testing Util ....................... SKIPPED
[INFO] Apache HBase - Thrift ............................. SKIPPED
[INFO] Apache HBase - Shell .............................. SKIPPED
[INFO] Apache HBase - Integration Tests .................. SKIPPED
[INFO] Apache HBase - Examples ........................... SKIPPED
[INFO] Apache HBase - Rest ............................... SKIPPED
[INFO] Apache HBase - External Block Cache ............... SKIPPED
[INFO] Apache HBase - Assembly ........................... SKIPPED
[INFO] Apache HBase - Shaded ............................. SKIPPED
[INFO] Apache HBase - Shaded - Client .................... SKIPPED
[INFO] Apache HBase - Shaded - Server .................... SKIPPED
[INFO] Apache HBase - Spark .............................. SKIPPED
[INFO] ------------------------------------------------------------------------
[INFO] BUILD FAILURE
[INFO] ------------------------------------------------------------------------
[INFO] Total time: 02:52 h
[INFO] Finished at: 2015-10-06T03:10:58+00:00
[INFO] Final Memory: 448M/532M
[INFO] ------------------------------------------------------------------------
[ERROR] Failed to execute goal org.apache.maven.plugins:maven-surefire-plugin:2.18.1:test
(secondPartTestsExecution) on project hbase-server: ExecutionException: java.lang.RuntimeException:
The forked VM terminated without properly saying goodbye. VM crash or System.exit called?
[ERROR] Command was /bin/sh -c cd /x1/jenkins/jenkins-slave/workspace/HBase-TRUNK/hbase-server
&& /x1/jenkins/jenkins-slave/tools/hudson.model.JDK/jdk-1.7u51/jre/bin/java -enableassertions
-XX:MaxDirectMemorySize=1G -Xmx2800m -XX:MaxPermSize=256m -Djava.security.egd=file:/dev/./urandom
-Djava.net.preferIPv4Stack=true -Djava.awt.headless=true '-javaagent:/home/jenkins/.m2/repository/org/jacoco/org.jacoco.agent/0.7.5.201505241946/org.jacoco.agent-0.7.5.201505241946-runtime.jar=destfile=/x1/jenkins/jenkins-slave/workspace/HBase-TRUNK/hbase-server/target/jacoco.exec,excludes=**/generated/**/*.class'
-jar /x1/jenkins/jenkins-slave/workspace/HBase-TRUNK/hbase-server/target/surefire/surefirebooter3744243225577736909.jar
/x1/jenkins/jenkins-slave/workspace/HBase-TRUNK/hbase-server/target/surefire/surefire4455209414556584877tmp
/x1/jenkins/jenkins-slave/workspace/HBase-TRUNK/hbase-server/target/surefire/surefire_9371665493407939476839tmp
[ERROR] -> [Help 1]
[ERROR] 
[ERROR] To see the full stack trace of the errors, re-run Maven with the -e switch.
[ERROR] Re-run Maven using the -X switch to enable full debug logging.
[ERROR] 
[ERROR] For more information about the errors and possible solutions, please read the following
articles:
[ERROR] [Help 1] http://cwiki.apache.org/confluence/display/MAVEN/MojoFailureException
[ERROR] 
[ERROR] After correcting the problems, you can resume the build with the command
[ERROR]   mvn <goals> -rf :hbase-server
Build step 'Invoke top-level Maven targets' marked build as failure
Performing Post build task...
Match found for :.* : True
Logical operation result is TRUE
Running script  :   ZOMBIE_TESTS_COUNT=`jps | grep surefirebooter | wc -l`
  if [[ $ZOMBIE_TESTS_COUNT != 0 ]] ; then
    #It seems sometimes the tests are not dying immediately. Let's give them 10s
    echo "Suspicious java process found - waiting 10s to see if there are just slow to stop"
    sleep 10   
    ZOMBIE_TESTS_COUNT=`jps | grep surefirebooter | wc -l`
    if [[ $ZOMBIE_TESTS_COUNT != 0 ]] ; then
      echo "There are $ZOMBIE_TESTS_COUNT zombie tests, they should have been killed by surefire
but survived"
      echo "************ BEGIN zombies jstack extract"
      ZB_STACK=`jps | grep surefirebooter | cut -d ' ' -f 1 | xargs -n 1 jstack | grep ".test"
| grep "\.java"`
      jps | grep surefirebooter | cut -d ' ' -f 1 | xargs -n 1 jstack
      echo "************ END  zombies jstack extract"
      JIRA_COMMENT="$JIRA_COMMENT

     {color:red}-1 core zombie tests{color}.  There are ${ZOMBIE_TESTS_COUNT} zombie test(s):
${ZB_STACK}"
      BAD=1
      jps | grep surefirebooter | cut -d ' ' -f 1 | xargs kill -9
    else
      echo "We're ok: there is no zombie test, but some tests took some time to stop"
    fi
  else
    echo "We're ok: there is no zombie test"
  fi
[HBase-TRUNK] $ /bin/bash -xe /tmp/hudson5023173076724634472.sh
++ jps
++ grep surefirebooter
++ wc -l
+ ZOMBIE_TESTS_COUNT=4
+ [[ 4 != 0 ]]
+ echo 'Suspicious java process found - waiting 10s to see if there are just slow to stop'
Suspicious java process found - waiting 10s to see if there are just slow to stop
+ sleep 10
++ jps
++ grep surefirebooter
++ wc -l
+ ZOMBIE_TESTS_COUNT=0
+ [[ 0 != 0 ]]
+ echo 'We'\''re ok: there is no zombie test, but some tests took some time to stop'
We're ok: there is no zombie test, but some tests took some time to stop
POST BUILD TASK : SUCCESS
END OF POST BUILD TASK : 0
Archiving artifacts
Recording test results
[FINDBUGS] Collecting findbugs analysis files...
[FINDBUGS] Finding all files that match the pattern **/findbugs.xml,**/findbugsXml.xml
[FINDBUGS] Parsing 28 files in <https://builds.apache.org/job/HBase-TRUNK/ws/>
[FINDBUGS] Successfully parsed file <https://builds.apache.org/job/HBase-TRUNK/6875/artifact/hbase-annotations/target/findbugs.xml>
with 0 unique warnings and 0 duplicates.
[FINDBUGS] Successfully parsed file <https://builds.apache.org/job/HBase-TRUNK/6875/artifact/hbase-annotations/target/findbugsXml.xml>
with 0 unique warnings and 0 duplicates.
[FINDBUGS] Successfully parsed file <https://builds.apache.org/job/HBase-TRUNK/6875/artifact/hbase-client/target/findbugs.xml>
with 0 unique warnings and 0 duplicates.
[FINDBUGS] Successfully parsed file <https://builds.apache.org/job/HBase-TRUNK/6875/artifact/hbase-client/target/findbugsXml.xml>
with 12 unique warnings and 0 duplicates.
[FINDBUGS] Successfully parsed file <https://builds.apache.org/job/HBase-TRUNK/6875/artifact/hbase-common/target/findbugs.xml>
with 12 unique warnings and 0 duplicates.
[FINDBUGS] Successfully parsed file <https://builds.apache.org/job/HBase-TRUNK/6875/artifact/hbase-common/target/findbugsXml.xml>
with 19 unique warnings and 0 duplicates.
[FINDBUGS] Successfully parsed file <https://builds.apache.org/job/HBase-TRUNK/6875/artifact/hbase-examples/target/findbugs.xml>
with 19 unique warnings and 0 duplicates.
[FINDBUGS] Successfully parsed file <https://builds.apache.org/job/HBase-TRUNK/6875/artifact/hbase-examples/target/findbugsXml.xml>
with 19 unique warnings and 0 duplicates.
[FINDBUGS] Successfully parsed file <https://builds.apache.org/job/HBase-TRUNK/6875/artifact/hbase-external-blockcache/target/findbugs.xml>
with 19 unique warnings and 0 duplicates.
[FINDBUGS] Successfully parsed file <https://builds.apache.org/job/HBase-TRUNK/6875/artifact/hbase-external-blockcache/target/findbugsXml.xml>
with 19 unique warnings and 0 duplicates.
[FINDBUGS] Successfully parsed file <https://builds.apache.org/job/HBase-TRUNK/6875/artifact/hbase-hadoop-compat/target/findbugs.xml>
with 19 unique warnings and 0 duplicates.
[FINDBUGS] Successfully parsed file <https://builds.apache.org/job/HBase-TRUNK/6875/artifact/hbase-hadoop-compat/target/findbugsXml.xml>
with 19 unique warnings and 0 duplicates.
[FINDBUGS] Successfully parsed file <https://builds.apache.org/job/HBase-TRUNK/6875/artifact/hbase-hadoop2-compat/target/findbugs.xml>
with 19 unique warnings and 0 duplicates.
[FINDBUGS] Successfully parsed file <https://builds.apache.org/job/HBase-TRUNK/6875/artifact/hbase-hadoop2-compat/target/findbugsXml.xml>
with 19 unique warnings and 0 duplicates.
[FINDBUGS] Successfully parsed file <https://builds.apache.org/job/HBase-TRUNK/6875/artifact/hbase-prefix-tree/target/findbugs.xml>
with 19 unique warnings and 0 duplicates.
[FINDBUGS] Successfully parsed file <https://builds.apache.org/job/HBase-TRUNK/6875/artifact/hbase-prefix-tree/target/findbugsXml.xml>
with 20 unique warnings and 0 duplicates.
[FINDBUGS] Successfully parsed file <https://builds.apache.org/job/HBase-TRUNK/6875/artifact/hbase-procedure/target/findbugs.xml>
with 20 unique warnings and 0 duplicates.
[FINDBUGS] Successfully parsed file <https://builds.apache.org/job/HBase-TRUNK/6875/artifact/hbase-procedure/target/findbugsXml.xml>
with 21 unique warnings and 0 duplicates.
[FINDBUGS] Successfully parsed file <https://builds.apache.org/job/HBase-TRUNK/6875/artifact/hbase-protocol/target/findbugs.xml>
with 21 unique warnings and 0 duplicates.
[FINDBUGS] Successfully parsed file <https://builds.apache.org/job/HBase-TRUNK/6875/artifact/hbase-protocol/target/findbugsXml.xml>
with 21 unique warnings and 0 duplicates.
[FINDBUGS] Successfully parsed file <https://builds.apache.org/job/HBase-TRUNK/6875/artifact/hbase-rest/target/findbugs.xml>
with 21 unique warnings and 0 duplicates.
[FINDBUGS] Successfully parsed file <https://builds.apache.org/job/HBase-TRUNK/6875/artifact/hbase-rest/target/findbugsXml.xml>
with 23 unique warnings and 0 duplicates.
[FINDBUGS] Successfully parsed file <https://builds.apache.org/job/HBase-TRUNK/6875/artifact/hbase-server/target/findbugs.xml>
with 23 unique warnings and 0 duplicates.
[FINDBUGS] Successfully parsed file <https://builds.apache.org/job/HBase-TRUNK/6875/artifact/hbase-server/target/findbugsXml.xml>
with 99 unique warnings and 1 duplicate.
[FINDBUGS] Successfully parsed file <https://builds.apache.org/job/HBase-TRUNK/6875/artifact/hbase-spark/target/findbugs.xml>
with 99 unique warnings and 0 duplicates.
[FINDBUGS] Successfully parsed file <https://builds.apache.org/job/HBase-TRUNK/6875/artifact/hbase-spark/target/findbugsXml.xml>
with 130 unique warnings and 0 duplicates.
[FINDBUGS] Successfully parsed file <https://builds.apache.org/job/HBase-TRUNK/6875/artifact/hbase-thrift/target/findbugs.xml>
with 130 unique warnings and 0 duplicates.
[FINDBUGS] Successfully parsed file <https://builds.apache.org/job/HBase-TRUNK/6875/artifact/hbase-thrift/target/findbugsXml.xml>
with 130 unique warnings and 0 duplicates.
[FINDBUGS] Computing warning deltas based on reference build #6751
[CHECKSTYLE] Collecting checkstyle analysis files...
[CHECKSTYLE] Finding all files that match the pattern **/checkstyle-result.xml
[CHECKSTYLE] Parsing 24 files in <https://builds.apache.org/job/HBase-TRUNK/ws/>
[CHECKSTYLE] Successfully parsed file <https://builds.apache.org/job/HBase-TRUNK/6875/artifact/hbase-annotations/target/checkstyle-result.xml>
with 0 unique warnings and 0 duplicates.
[CHECKSTYLE] Successfully parsed file <https://builds.apache.org/job/HBase-TRUNK/6875/artifact/hbase-assembly/target/checkstyle-result.xml>
with 0 unique warnings and 0 duplicates.
[CHECKSTYLE] Successfully parsed file <https://builds.apache.org/job/HBase-TRUNK/6875/artifact/hbase-checkstyle/target/checkstyle-result.xml>
with 0 unique warnings and 0 duplicates.
[CHECKSTYLE] Successfully parsed file <https://builds.apache.org/job/HBase-TRUNK/6875/artifact/hbase-client/target/checkstyle-result.xml>
with 202 unique warnings and 0 duplicates.
[CHECKSTYLE] Successfully parsed file <https://builds.apache.org/job/HBase-TRUNK/6875/artifact/hbase-common/target/checkstyle-result.xml>
with 303 unique warnings and 0 duplicates.
[CHECKSTYLE] Successfully parsed file <https://builds.apache.org/job/HBase-TRUNK/6875/artifact/hbase-examples/target/checkstyle-result.xml>
with 331 unique warnings and 0 duplicates.
[CHECKSTYLE] Successfully parsed file <https://builds.apache.org/job/HBase-TRUNK/6875/artifact/hbase-external-blockcache/target/checkstyle-result.xml>
with 331 unique warnings and 0 duplicates.
[CHECKSTYLE] Successfully parsed file <https://builds.apache.org/job/HBase-TRUNK/6875/artifact/hbase-hadoop-compat/target/checkstyle-result.xml>
with 333 unique warnings and 0 duplicates.
[CHECKSTYLE] Successfully parsed file <https://builds.apache.org/job/HBase-TRUNK/6875/artifact/hbase-hadoop2-compat/target/checkstyle-result.xml>
with 364 unique warnings and 0 duplicates.
[CHECKSTYLE] Successfully parsed file <https://builds.apache.org/job/HBase-TRUNK/6875/artifact/hbase-it/target/checkstyle-result.xml>
with 364 unique warnings and 0 duplicates.
[CHECKSTYLE] Successfully parsed file <https://builds.apache.org/job/HBase-TRUNK/6875/artifact/hbase-prefix-tree/target/checkstyle-result.xml>
with 380 unique warnings and 0 duplicates.
[CHECKSTYLE] Successfully parsed file <https://builds.apache.org/job/HBase-TRUNK/6875/artifact/hbase-procedure/target/checkstyle-result.xml>
with 380 unique warnings and 0 duplicates.
[CHECKSTYLE] Successfully parsed file <https://builds.apache.org/job/HBase-TRUNK/6875/artifact/hbase-protocol/target/checkstyle-result.xml>
with 382 unique warnings and 0 duplicates.
[CHECKSTYLE] Successfully parsed file <https://builds.apache.org/job/HBase-TRUNK/6875/artifact/hbase-resource-bundle/target/checkstyle-result.xml>
with 382 unique warnings and 0 duplicates.
[CHECKSTYLE] Successfully parsed file <https://builds.apache.org/job/HBase-TRUNK/6875/artifact/hbase-rest/target/checkstyle-result.xml>
with 424 unique warnings and 0 duplicates.
[CHECKSTYLE] Successfully parsed file <https://builds.apache.org/job/HBase-TRUNK/6875/artifact/hbase-server/target/checkstyle-result.xml>
with 1758 unique warnings and 0 duplicates.
[CHECKSTYLE] Successfully parsed file <https://builds.apache.org/job/HBase-TRUNK/6875/artifact/hbase-shaded/hbase-shaded-client/target/checkstyle-result.xml>
with 1758 unique warnings and 0 duplicates.
[CHECKSTYLE] Successfully parsed file <https://builds.apache.org/job/HBase-TRUNK/6875/artifact/hbase-shaded/hbase-shaded-server/target/checkstyle-result.xml>
with 1758 unique warnings and 0 duplicates.
[CHECKSTYLE] Successfully parsed file <https://builds.apache.org/job/HBase-TRUNK/6875/artifact/hbase-shaded/target/checkstyle-result.xml>
with 1758 unique warnings and 0 duplicates.
[CHECKSTYLE] Successfully parsed file <https://builds.apache.org/job/HBase-TRUNK/6875/artifact/hbase-shell/target/checkstyle-result.xml>
with 1758 unique warnings and 0 duplicates.
[CHECKSTYLE] Successfully parsed file <https://builds.apache.org/job/HBase-TRUNK/6875/artifact/hbase-spark/target/checkstyle-result.xml>
with 1758 unique warnings and 0 duplicates.
[CHECKSTYLE] Successfully parsed file <https://builds.apache.org/job/HBase-TRUNK/6875/artifact/hbase-testing-util/target/checkstyle-result.xml>
with 1758 unique warnings and 0 duplicates.
[CHECKSTYLE] Successfully parsed file <https://builds.apache.org/job/HBase-TRUNK/6875/artifact/hbase-thrift/target/checkstyle-result.xml>
with 1780 unique warnings and 0 duplicates.
[CHECKSTYLE] Successfully parsed file <https://builds.apache.org/job/HBase-TRUNK/6875/artifact/target/checkstyle-result.xml>
with 1780 unique warnings and 0 duplicates.
[CHECKSTYLE] Computing warning deltas based on reference build #6751
Updating HBASE-14347

Mime
View raw message