hbase-builds mailing list archives

Site index · List index
Message view « Date » · « Thread »
Top « Date » · « Thread »
From Apache Jenkins Server <jenk...@builds.apache.org>
Subject Build failed in Jenkins: HBase-1.2 » latest1.7,Hadoop #251
Date Wed, 14 Oct 2015 05:17:19 GMT
See <https://builds.apache.org/job/HBase-1.2/jdk=latest1.7,label=Hadoop/251/changes>

Changes:

[liushaohui] HBASE-14591 Region with reference hfile may split after a forced split

------------------------------------------
[...truncated 29634 lines...]
Running org.apache.hadoop.hbase.TestHBaseConfiguration
Tests run: 2, Failures: 0, Errors: 0, Skipped: 0, Time elapsed: 0.573 sec - in org.apache.hadoop.hbase.TestHBaseConfiguration
Running org.apache.hadoop.hbase.util.TestWeakObjectPool
Tests run: 3, Failures: 0, Errors: 0, Skipped: 0, Time elapsed: 0.386 sec - in org.apache.hadoop.hbase.util.TestWeakObjectPool
Running org.apache.hadoop.hbase.util.TestDynamicClassLoader
Tests run: 3, Failures: 0, Errors: 0, Skipped: 0, Time elapsed: 1.632 sec - in org.apache.hadoop.hbase.util.TestDynamicClassLoader
Running org.apache.hadoop.hbase.util.TestConcatenatedLists
Tests run: 6, Failures: 0, Errors: 0, Skipped: 0, Time elapsed: 0.253 sec - in org.apache.hadoop.hbase.util.TestConcatenatedLists
Running org.apache.hadoop.hbase.util.TestThreads
Tests run: 1, Failures: 0, Errors: 0, Skipped: 0, Time elapsed: 3.053 sec - in org.apache.hadoop.hbase.util.TestThreads
Running org.apache.hadoop.hbase.util.TestOrderedBytes
Tests run: 19, Failures: 0, Errors: 0, Skipped: 0, Time elapsed: 0.753 sec - in org.apache.hadoop.hbase.util.TestOrderedBytes
Running org.apache.hadoop.hbase.util.TestBoundedArrayQueue
Tests run: 1, Failures: 0, Errors: 0, Skipped: 0, Time elapsed: 0.082 sec - in org.apache.hadoop.hbase.util.TestBoundedArrayQueue
Running org.apache.hadoop.hbase.util.TestSimpleMutableByteRange
Tests run: 3, Failures: 0, Errors: 0, Skipped: 0, Time elapsed: 0.158 sec - in org.apache.hadoop.hbase.util.TestSimpleMutableByteRange
Running org.apache.hadoop.hbase.util.TestBase64
Tests run: 1, Failures: 0, Errors: 0, Skipped: 0, Time elapsed: 0.084 sec - in org.apache.hadoop.hbase.util.TestBase64
Running org.apache.hadoop.hbase.util.TestSimplePositionedMutableByteRange
Tests run: 3, Failures: 0, Errors: 0, Skipped: 0, Time elapsed: 0.164 sec - in org.apache.hadoop.hbase.util.TestSimplePositionedMutableByteRange
Running org.apache.hadoop.hbase.util.TestCoprocessorClassLoader
Tests run: 3, Failures: 0, Errors: 0, Skipped: 0, Time elapsed: 1.56 sec - in org.apache.hadoop.hbase.util.TestCoprocessorClassLoader
Running org.apache.hadoop.hbase.util.TestShowProperties
Tests run: 1, Failures: 0, Errors: 0, Skipped: 0, Time elapsed: 0.053 sec - in org.apache.hadoop.hbase.util.TestShowProperties
Running org.apache.hadoop.hbase.util.TestEnvironmentEdgeManager
Tests run: 2, Failures: 0, Errors: 0, Skipped: 0, Time elapsed: 0.299 sec - in org.apache.hadoop.hbase.util.TestEnvironmentEdgeManager
Running org.apache.hadoop.hbase.util.TestLoadTestKVGenerator
Tests run: 3, Failures: 0, Errors: 0, Skipped: 0, Time elapsed: 0.888 sec - in org.apache.hadoop.hbase.util.TestLoadTestKVGenerator
Running org.apache.hadoop.hbase.util.TestBytes
Tests run: 31, Failures: 0, Errors: 0, Skipped: 0, Time elapsed: 2.267 sec - in org.apache.hadoop.hbase.util.TestBytes
Running org.apache.hadoop.hbase.util.TestKeyLocker
Tests run: 1, Failures: 0, Errors: 0, Skipped: 0, Time elapsed: 0.154 sec - in org.apache.hadoop.hbase.util.TestKeyLocker
Running org.apache.hadoop.hbase.util.TestCounter
Tests run: 2, Failures: 0, Errors: 0, Skipped: 0, Time elapsed: 4.782 sec - in org.apache.hadoop.hbase.util.TestCounter
Running org.apache.hadoop.hbase.util.TestDrainBarrier
Tests run: 6, Failures: 0, Errors: 0, Skipped: 0, Time elapsed: 1.239 sec - in org.apache.hadoop.hbase.util.TestDrainBarrier
Running org.apache.hadoop.hbase.util.TestByteRangeWithKVSerialization
Tests run: 1, Failures: 0, Errors: 0, Skipped: 0, Time elapsed: 1.049 sec - in org.apache.hadoop.hbase.util.TestByteRangeWithKVSerialization
Running org.apache.hadoop.hbase.util.TestOrder
Tests run: 2, Failures: 0, Errors: 0, Skipped: 0, Time elapsed: 0.079 sec - in org.apache.hadoop.hbase.util.TestOrder
Running org.apache.hadoop.hbase.TestClassFinder
Tests run: 11, Failures: 0, Errors: 0, Skipped: 0, Time elapsed: 4.048 sec - in org.apache.hadoop.hbase.TestClassFinder
Running org.apache.hadoop.hbase.TestCellUtil
Tests run: 5, Failures: 0, Errors: 0, Skipped: 0, Time elapsed: 0.317 sec - in org.apache.hadoop.hbase.TestCellUtil
Running org.apache.hadoop.hbase.TestChoreService
Tests run: 17, Failures: 0, Errors: 0, Skipped: 0, Time elapsed: 21.253 sec - in org.apache.hadoop.hbase.TestChoreService
Running org.apache.hadoop.hbase.TestCellComparator
Tests run: 2, Failures: 0, Errors: 0, Skipped: 0, Time elapsed: 0.099 sec - in org.apache.hadoop.hbase.TestCellComparator
Running org.apache.hadoop.hbase.TestTimeout
Tests run: 2, Failures: 0, Errors: 0, Skipped: 1, Time elapsed: 0.191 sec - in org.apache.hadoop.hbase.TestTimeout
Running org.apache.hadoop.hbase.codec.TestCellCodec
Tests run: 3, Failures: 0, Errors: 0, Skipped: 0, Time elapsed: 0.19 sec - in org.apache.hadoop.hbase.codec.TestCellCodec
Running org.apache.hadoop.hbase.codec.TestCellCodecWithTags
Tests run: 1, Failures: 0, Errors: 0, Skipped: 0, Time elapsed: 0.147 sec - in org.apache.hadoop.hbase.codec.TestCellCodecWithTags
Running org.apache.hadoop.hbase.codec.TestKeyValueCodec
Tests run: 3, Failures: 0, Errors: 0, Skipped: 0, Time elapsed: 0.181 sec - in org.apache.hadoop.hbase.codec.TestKeyValueCodec
Running org.apache.hadoop.hbase.codec.TestKeyValueCodecWithTags
Tests run: 1, Failures: 0, Errors: 0, Skipped: 0, Time elapsed: 0.129 sec - in org.apache.hadoop.hbase.codec.TestKeyValueCodecWithTags
Running org.apache.hadoop.hbase.TestCompoundConfiguration
Tests run: 6, Failures: 0, Errors: 0, Skipped: 0, Time elapsed: 0.604 sec - in org.apache.hadoop.hbase.TestCompoundConfiguration
Running org.apache.hadoop.hbase.types.TestFixedLengthWrapper
Tests run: 4, Failures: 0, Errors: 0, Skipped: 0, Time elapsed: 0.136 sec - in org.apache.hadoop.hbase.types.TestFixedLengthWrapper
Running org.apache.hadoop.hbase.types.TestStruct
Tests run: 2, Failures: 0, Errors: 0, Skipped: 0, Time elapsed: 0.088 sec - in org.apache.hadoop.hbase.types.TestStruct
Running org.apache.hadoop.hbase.types.TestOrderedBlob
Tests run: 1, Failures: 0, Errors: 0, Skipped: 0, Time elapsed: 0.06 sec - in org.apache.hadoop.hbase.types.TestOrderedBlob
Running org.apache.hadoop.hbase.types.TestRawString
Tests run: 1, Failures: 0, Errors: 0, Skipped: 0, Time elapsed: 0.106 sec - in org.apache.hadoop.hbase.types.TestRawString
Running org.apache.hadoop.hbase.types.TestUnion2
Tests run: 2, Failures: 0, Errors: 0, Skipped: 0, Time elapsed: 0.136 sec - in org.apache.hadoop.hbase.types.TestUnion2
Running org.apache.hadoop.hbase.types.TestOrderedBlobVar
Tests run: 1, Failures: 0, Errors: 0, Skipped: 0, Time elapsed: 0.058 sec - in org.apache.hadoop.hbase.types.TestOrderedBlobVar
Running org.apache.hadoop.hbase.types.TestStructNullExtension
Tests run: 2, Failures: 0, Errors: 0, Skipped: 0, Time elapsed: 0.151 sec - in org.apache.hadoop.hbase.types.TestStructNullExtension
Running org.apache.hadoop.hbase.types.TestTerminatedWrapper
Tests run: 8, Failures: 0, Errors: 0, Skipped: 0, Time elapsed: 0.271 sec - in org.apache.hadoop.hbase.types.TestTerminatedWrapper
Running org.apache.hadoop.hbase.types.TestOrderedString
Tests run: 1, Failures: 0, Errors: 0, Skipped: 0, Time elapsed: 0.094 sec - in org.apache.hadoop.hbase.types.TestOrderedString

Results :

Tests run: 208, Failures: 0, Errors: 0, Skipped: 1

[INFO] 
[INFO] --- maven-surefire-plugin:2.18.1:test (secondPartTestsExecution) @ hbase-common ---
[INFO] Tests are skipped.
[INFO] 
[INFO] --- jacoco-maven-plugin:0.7.5.201505241946:report (report) @ hbase-common ---
[INFO] Skipping JaCoCo execution because property jacoco.skip is set.
[INFO] 
[INFO] --- maven-source-plugin:2.2.1:jar-no-fork (attach-sources) @ hbase-common ---
[INFO] No sources in project. Archive not created.
[INFO] 
[INFO] --- maven-jar-plugin:2.4:test-jar (default) @ hbase-common ---
[INFO] Building jar: <https://builds.apache.org/job/HBase-1.2/jdk=latest1.7,label=Hadoop/ws/hbase-common/target/hbase-common-1.2.0-SNAPSHOT-tests.jar>
[INFO] 
[INFO] --- maven-jar-plugin:2.4:jar (default-jar) @ hbase-common ---
[INFO] Building jar: <https://builds.apache.org/job/HBase-1.2/jdk=latest1.7,label=Hadoop/ws/hbase-common/target/hbase-common-1.2.0-SNAPSHOT.jar>
[INFO] 
[INFO] --- maven-install-plugin:2.3.1:install (default-install) @ hbase-common ---
[INFO] Installing <https://builds.apache.org/job/HBase-1.2/jdk=latest1.7,label=Hadoop/ws/hbase-common/target/hbase-common-1.2.0-SNAPSHOT.jar>
to <https://builds.apache.org/job/HBase-1.2/jdk=latest1.7,label=Hadoop/ws/.repository/org/apache/hbase/hbase-common/1.2.0-SNAPSHOT/hbase-common-1.2.0-SNAPSHOT.jar>
[INFO] Installing <https://builds.apache.org/job/HBase-1.2/jdk=latest1.7,label=Hadoop/ws/hbase-common/pom.xml>
to <https://builds.apache.org/job/HBase-1.2/jdk=latest1.7,label=Hadoop/ws/.repository/org/apache/hbase/hbase-common/1.2.0-SNAPSHOT/hbase-common-1.2.0-SNAPSHOT.pom>
[INFO] Installing <https://builds.apache.org/job/HBase-1.2/jdk=latest1.7,label=Hadoop/ws/hbase-common/target/hbase-common-1.2.0-SNAPSHOT-tests.jar>
to <https://builds.apache.org/job/HBase-1.2/jdk=latest1.7,label=Hadoop/ws/.repository/org/apache/hbase/hbase-common/1.2.0-SNAPSHOT/hbase-common-1.2.0-SNAPSHOT-tests.jar>
[INFO]                                                                         
[INFO] ------------------------------------------------------------------------
[INFO] Building Apache HBase - Procedure 1.2.0-SNAPSHOT
[INFO] ------------------------------------------------------------------------
[INFO] 
[INFO] --- maven-enforcer-plugin:1.0.1:enforce (enforce) @ hbase-procedure ---
[INFO] 
[INFO] --- buildnumber-maven-plugin:1.3:create-timestamp (default) @ hbase-procedure ---
[INFO] 
[INFO] --- jacoco-maven-plugin:0.7.5.201505241946:prepare-agent (prepare-agent) @ hbase-procedure
---
[INFO] Skipping JaCoCo execution because property jacoco.skip is set.
[INFO] argLine set to empty
[INFO] 
[INFO] --- maven-remote-resources-plugin:1.5:process (default) @ hbase-procedure ---
[INFO] 
[INFO] --- maven-resources-plugin:2.6:resources (default-resources) @ hbase-procedure ---
[INFO] Using 'UTF-8' encoding to copy filtered resources.
[INFO] skip non existing resourceDirectory <https://builds.apache.org/job/HBase-1.2/jdk=latest1.7,label=Hadoop/ws/hbase-procedure/src/main/resources>
[INFO] Copying 3 resources
[INFO] 
[INFO] --- maven-compiler-plugin:2.5.1:compile (default-compile) @ hbase-procedure ---
[INFO] Compiling 27 source files to <https://builds.apache.org/job/HBase-1.2/jdk=latest1.7,label=Hadoop/ws/hbase-procedure/target/classes>
[INFO] 
[INFO] --- maven-resources-plugin:2.6:testResources (default-testResources) @ hbase-procedure
---
[INFO] Using 'UTF-8' encoding to copy filtered resources.
[INFO] skip non existing resourceDirectory <https://builds.apache.org/job/HBase-1.2/jdk=latest1.7,label=Hadoop/ws/hbase-procedure/src/test/resources>
[INFO] Copying 3 resources
[INFO] 
[INFO] --- maven-compiler-plugin:2.5.1:testCompile (default-testCompile) @ hbase-procedure
---
[INFO] Compiling 10 source files to <https://builds.apache.org/job/HBase-1.2/jdk=latest1.7,label=Hadoop/ws/hbase-procedure/target/test-classes>
[INFO] 
[INFO] --- maven-surefire-plugin:2.18.1:test (default-test) @ hbase-procedure ---
[INFO] Surefire report directory: <https://builds.apache.org/job/HBase-1.2/jdk=latest1.7,label=Hadoop/ws/hbase-procedure/target/surefire-reports>
[INFO] Using configured provider org.apache.maven.surefire.junitcore.JUnitCoreProvider
[INFO] parallel='none', perCoreThreadCount=true, threadCount=0, useUnlimitedThreads=false,
threadCountSuites=0, threadCountClasses=0, threadCountMethods=0, parallelOptimized=true

-------------------------------------------------------
 T E S T S
-------------------------------------------------------
Running org.apache.hadoop.hbase.procedure2.TestProcedureToString
Tests run: 2, Failures: 0, Errors: 0, Skipped: 0, Time elapsed: 0.013 sec - in org.apache.hadoop.hbase.procedure2.TestProcedureToString
Running org.apache.hadoop.hbase.procedure2.util.TestTimeoutBlockingQueue
Tests run: 2, Failures: 0, Errors: 0, Skipped: 0, Time elapsed: 26.769 sec - in org.apache.hadoop.hbase.procedure2.util.TestTimeoutBlockingQueue
Running org.apache.hadoop.hbase.procedure2.TestProcedureExecution
Tests run: 6, Failures: 0, Errors: 0, Skipped: 0, Time elapsed: 7.575 sec - in org.apache.hadoop.hbase.procedure2.TestProcedureExecution
Running org.apache.hadoop.hbase.procedure2.TestProcedureRecovery
Tests run: 8, Failures: 0, Errors: 0, Skipped: 0, Time elapsed: 12.058 sec - in org.apache.hadoop.hbase.procedure2.TestProcedureRecovery
Running org.apache.hadoop.hbase.procedure2.TestProcedureFairRunQueues
Tests run: 4, Failures: 0, Errors: 0, Skipped: 0, Time elapsed: 0.005 sec - in org.apache.hadoop.hbase.procedure2.TestProcedureFairRunQueues
Running org.apache.hadoop.hbase.procedure2.store.TestProcedureStoreTracker
Tests run: 6, Failures: 0, Errors: 0, Skipped: 0, Time elapsed: 19.57 sec - in org.apache.hadoop.hbase.procedure2.store.TestProcedureStoreTracker
Running org.apache.hadoop.hbase.procedure2.store.wal.TestWALProcedureStore
Tests run: 7, Failures: 0, Errors: 0, Skipped: 0, Time elapsed: 1.369 sec - in org.apache.hadoop.hbase.procedure2.store.wal.TestWALProcedureStore
Running org.apache.hadoop.hbase.procedure2.TestYieldProcedures
Tests run: 2, Failures: 0, Errors: 0, Skipped: 0, Time elapsed: 5.982 sec - in org.apache.hadoop.hbase.procedure2.TestYieldProcedures
Running org.apache.hadoop.hbase.procedure2.TestProcedureReplayOrder
Killed

Results :

Tests run: 37, Failures: 0, Errors: 0, Skipped: 0

[INFO] ------------------------------------------------------------------------
[INFO] Reactor Summary:
[INFO] 
[INFO] Apache HBase ...................................... SUCCESS [1:07.756s]
[INFO] Apache HBase - Checkstyle ......................... SUCCESS [5.357s]
[INFO] Apache HBase - Resource Bundle .................... SUCCESS [0.198s]
[INFO] Apache HBase - Annotations ........................ SUCCESS [0.995s]
[INFO] Apache HBase - Protocol ........................... SUCCESS [15.862s]
[INFO] Apache HBase - Common ............................. SUCCESS [2:40.107s]
[INFO] Apache HBase - Procedure .......................... FAILURE [1:51.118s]
[INFO] Apache HBase - Client ............................. SKIPPED
[INFO] Apache HBase - Hadoop Compatibility ............... SKIPPED
[INFO] Apache HBase - Hadoop Two Compatibility ........... SKIPPED
[INFO] Apache HBase - Prefix Tree ........................ SKIPPED
[INFO] Apache HBase - Server ............................. SKIPPED
[INFO] Apache HBase - Testing Util ....................... SKIPPED
[INFO] Apache HBase - Thrift ............................. SKIPPED
[INFO] Apache HBase - Rest ............................... SKIPPED
[INFO] Apache HBase - Shell .............................. SKIPPED
[INFO] Apache HBase - Integration Tests .................. SKIPPED
[INFO] Apache HBase - Examples ........................... SKIPPED
[INFO] Apache HBase - External Block Cache ............... SKIPPED
[INFO] Apache HBase - Assembly ........................... SKIPPED
[INFO] Apache HBase - Shaded ............................. SKIPPED
[INFO] Apache HBase - Shaded - Client .................... SKIPPED
[INFO] Apache HBase - Shaded - Server .................... SKIPPED
[INFO] ------------------------------------------------------------------------
[INFO] BUILD FAILURE
[INFO] ------------------------------------------------------------------------
[INFO] Total time: 6:19.886s
[INFO] Finished at: Wed Oct 14 05:17:56 UTC 2015
[INFO] Final Memory: 59M/722M
[INFO] ------------------------------------------------------------------------
[ERROR] Failed to execute goal org.apache.maven.plugins:maven-surefire-plugin:2.18.1:test
(default-test) on project hbase-procedure: ExecutionException: java.lang.RuntimeException:
The forked VM terminated without properly saying goodbye. VM crash or System.exit called?
[ERROR] Command was /bin/sh -c cd <https://builds.apache.org/job/HBase-1.2/jdk=latest1.7,label=Hadoop/ws/hbase-procedure>
&& /home/jenkins/jenkins-slave/tools/hudson.model.JDK/latest1.7/jre/bin/java -enableassertions
-XX:MaxDirectMemorySize=1G -Xmx2800m -XX:MaxPermSize=256m -Djava.security.egd=file:/dev/./urandom
-Djava.net.preferIPv4Stack=true -Djava.awt.headless=true -jar <https://builds.apache.org/job/HBase-1.2/jdk=latest1.7,label=Hadoop/ws/hbase-procedure/target/surefire/surefirebooter3043086444629770079.jar>
<https://builds.apache.org/job/HBase-1.2/jdk=latest1.7,label=Hadoop/ws/hbase-procedure/target/surefire/surefire2331784039197301262tmp>
<https://builds.apache.org/job/HBase-1.2/jdk=latest1.7,label=Hadoop/ws/hbase-procedure/target/surefire/surefire_571196099644754676273tmp>
[ERROR] -> [Help 1]
[ERROR] 
[ERROR] To see the full stack trace of the errors, re-run Maven with the -e switch.
[ERROR] Re-run Maven using the -X switch to enable full debug logging.
[ERROR] 
[ERROR] For more information about the errors and possible solutions, please read the following
articles:
[ERROR] [Help 1] http://cwiki.apache.org/confluence/display/MAVEN/MojoFailureException
[ERROR] 
[ERROR] After correcting the problems, you can resume the build with the command
[ERROR]   mvn <goals> -rf :hbase-procedure
Build step 'Invoke top-level Maven targets' marked build as failure
Performing Post build task...
Match found for :.* : True
Logical operation result is TRUE
Running script  :   ZOMBIE_TESTS_COUNT=`jps | grep surefirebooter | wc -l`
  if [[ $ZOMBIE_TESTS_COUNT != 0 ]] ; then
    #It seems sometimes the tests are not dying immediately. Let's give them 10s
    echo "Suspicious java process found - waiting 10s to see if there are just slow to stop"
    sleep 10   
    ZOMBIE_TESTS_COUNT=`jps | grep surefirebooter | wc -l`
    if [[ $ZOMBIE_TESTS_COUNT != 0 ]] ; then
      echo "There are $ZOMBIE_TESTS_COUNT zombie tests, they should have been killed by surefire
but survived"
      echo "************ BEGIN zombies jstack extract"
      ZB_STACK=`jps | grep surefirebooter | cut -d ' ' -f 1 | xargs -n 1 jstack | grep ".test"
| grep "\.java"`
      jps | grep surefirebooter | cut -d ' ' -f 1 | xargs -n 1 jstack
      echo "************ END  zombies jstack extract"
      JIRA_COMMENT="$JIRA_COMMENT

     {color:red}-1 core zombie tests{color}.  There are ${ZOMBIE_TESTS_COUNT} zombie test(s):
${ZB_STACK}"
      BAD=1
      jps | grep surefirebooter | cut -d ' ' -f 1 | xargs kill -9
    else
      echo "We're ok: there is no zombie test, but some tests took some time to stop"
    fi
  else
    echo "We're ok: there is no zombie test"
  fi
[Hadoop] $ /bin/bash -xe /tmp/hudson8641914770216814429.sh
++ jps
++ grep surefirebooter
++ wc -l
+ ZOMBIE_TESTS_COUNT=0
+ [[ 0 != 0 ]]
+ echo 'We'\''re ok: there is no zombie test'
We're ok: there is no zombie test
POST BUILD TASK : SUCCESS
END OF POST BUILD TASK : 0
Archiving artifacts
Compressed 571.07 KB of artifacts by 16.8% relative to #250

Mime
View raw message