hbase-builds mailing list archives

Site index · List index
Message view « Date » · « Thread »
Top « Date » · « Thread »
From Apache Jenkins Server <jenk...@builds.apache.org>
Subject Build failed in Jenkins: HBase-1.3 » latest1.7,Hadoop #271
Date Fri, 16 Oct 2015 12:49:41 GMT
See <https://builds.apache.org/job/HBase-1.3/jdk=latest1.7,label=Hadoop/271/changes>

Changes:

[tedyu] HBASE-14605 Split fails due to 'No valid credentials' error when

------------------------------------------
[...truncated 48404 lines...]
13244/13509 KB   
13248/13509 KB   
13249/13509 KB   
13250/13509 KB   
13254/13509 KB   
13255/13509 KB   
13259/13509 KB   
13263/13509 KB   
13267/13509 KB   
13269/13509 KB   
13270/13509 KB   
13274/13509 KB   
13275/13509 KB   
13277/13509 KB   
13281/13509 KB   
13282/13509 KB   
13283/13509 KB   
13287/13509 KB   
13288/13509 KB   
13290/13509 KB   
13294/13509 KB   
13298/13509 KB   
13302/13509 KB   
13306/13509 KB   
13310/13509 KB   
13314/13509 KB   
13315/13509 KB   
13319/13509 KB   
13323/13509 KB   
13327/13509 KB   
13331/13509 KB   
13335/13509 KB   
13339/13509 KB   
13343/13509 KB   
13347/13509 KB   
13351/13509 KB   
13355/13509 KB   
13359/13509 KB   
13363/13509 KB   
13367/13509 KB   
13371/13509 KB   
13375/13509 KB   
13379/13509 KB   
13381/13509 KB   
13382/13509 KB   
13386/13509 KB   
13387/13509 KB   
13388/13509 KB   
13392/13509 KB   
13394/13509 KB   
13398/13509 KB   
13400/13509 KB   
13403/13509 KB   
13407/13509 KB   
13408/13509 KB   
13412/13509 KB   
13413/13509 KB   
13417/13509 KB   
13420/13509 KB   
13421/13509 KB   
13425/13509 KB   
13427/13509 KB   
13431/13509 KB   
13433/13509 KB   
13437/13509 KB   
13441/13509 KB   
13445/13509 KB   
13446/13509 KB   
13449/13509 KB   
13453/13509 KB   
13457/13509 KB   
13461/13509 KB   
13465/13509 KB   
13466/13509 KB   
13467/13509 KB   
13471/13509 KB   
13475/13509 KB   
13479/13509 KB   
13483/13509 KB   
13486/13509 KB   
13490/13509 KB   
13492/13509 KB   
13496/13509 KB   
13499/13509 KB   
13500/13509 KB   
13504/13509 KB   
13508/13509 KB   
13509/13509 KB   
                 
Downloaded: http://repository.jboss.org/nexus/content/groups/public-jboss/org/jruby/jruby-complete/1.6.8/jruby-complete-1.6.8.jar
(13509 KB at 5488.9 KB/sec)
[INFO] 
[INFO] --- maven-enforcer-plugin:1.0.1:enforce (enforce) @ hbase-shell ---
[INFO] 
[INFO] --- buildnumber-maven-plugin:1.3:create-timestamp (default) @ hbase-shell ---
[INFO] 
[INFO] --- build-helper-maven-plugin:1.9.1:add-source (jspcSource-packageInfo-source) @ hbase-shell
---
[INFO] Source directory: <https://builds.apache.org/job/HBase-1.3/jdk=latest1.7,label=Hadoop/ws/hbase-shell/target/generated-jamon>
added.
[INFO] Source directory: <https://builds.apache.org/job/HBase-1.3/jdk=latest1.7,label=Hadoop/ws/hbase-shell/target/generated-sources/java>
added.
[INFO] 
[INFO] --- maven-remote-resources-plugin:1.5:process (default) @ hbase-shell ---
[INFO] 
[INFO] --- maven-resources-plugin:2.6:resources (default-resources) @ hbase-shell ---
[INFO] Using 'UTF-8' encoding to copy filtered resources.
[INFO] Copying 0 resource
[INFO] Copying 3 resources
[INFO] 
[INFO] --- maven-compiler-plugin:2.5.1:compile (default-compile) @ hbase-shell ---
[INFO] No sources to compile
[INFO] 
[INFO] --- maven-dependency-plugin:2.1:build-classpath (create-mrapp-generated-classpath)
@ hbase-shell ---
[INFO] Wrote classpath file '<https://builds.apache.org/job/HBase-1.3/jdk=latest1.7,label=Hadoop/ws/hbase-shell/target/test-classes/mrapp-generated-classpath'.>
[INFO] 
[INFO] --- maven-resources-plugin:2.6:testResources (default-testResources) @ hbase-shell
---
[INFO] Using 'UTF-8' encoding to copy filtered resources.
[INFO] skip non existing resourceDirectory <https://builds.apache.org/job/HBase-1.3/jdk=latest1.7,label=Hadoop/ws/hbase-shell/src/test/resources>
[INFO] Copying 3 resources
[INFO] 
[INFO] --- maven-compiler-plugin:2.5.1:testCompile (default-testCompile) @ hbase-shell ---
[INFO] Compiling 3 source files to <https://builds.apache.org/job/HBase-1.3/jdk=latest1.7,label=Hadoop/ws/hbase-shell/target/test-classes>
[INFO] 
[INFO] --- maven-surefire-plugin:2.18.1:test (default-test) @ hbase-shell ---
[INFO] Surefire report directory: <https://builds.apache.org/job/HBase-1.3/jdk=latest1.7,label=Hadoop/ws/hbase-shell/target/surefire-reports>
[INFO] Using configured provider org.apache.maven.surefire.junitcore.JUnitCoreProvider
[INFO] parallel='none', perCoreThreadCount=true, threadCount=0, useUnlimitedThreads=false,
threadCountSuites=0, threadCountClasses=0, threadCountMethods=0, parallelOptimized=true

-------------------------------------------------------
 T E S T S
-------------------------------------------------------

Results :

Tests run: 0, Failures: 0, Errors: 0, Skipped: 0

[INFO] 
[INFO] --- maven-surefire-plugin:2.18.1:test (secondPartTestsExecution) @ hbase-shell ---
[INFO] Surefire report directory: <https://builds.apache.org/job/HBase-1.3/jdk=latest1.7,label=Hadoop/ws/hbase-shell/target/surefire-reports>
[INFO] Using configured provider org.apache.maven.surefire.junitcore.JUnitCoreProvider
[INFO] parallel='none', perCoreThreadCount=true, threadCount=0, useUnlimitedThreads=false,
threadCountSuites=0, threadCountClasses=0, threadCountMethods=0, parallelOptimized=true

-------------------------------------------------------
 T E S T S
-------------------------------------------------------
Running org.apache.hadoop.hbase.client.TestShell
Running org.apache.hadoop.hbase.client.TestReplicationShell
Tests run: 1, Failures: 0, Errors: 1, Skipped: 0, Time elapsed: 110.931 sec <<< FAILURE!
- in org.apache.hadoop.hbase.client.TestReplicationShell
testRunShellTests(org.apache.hadoop.hbase.client.TestReplicationShell)  Time elapsed: 110.564
sec  <<< ERROR!
org.jruby.embed.EvalFailedException: (RuntimeError) Shell unit tests failed. Check output
file for details.
	at org.jruby.embed.internal.EmbedEvalUnitImpl.run(EmbedEvalUnitImpl.java:136)
	at org.jruby.embed.ScriptingContainer.runUnit(ScriptingContainer.java:1263)
	at org.jruby.embed.ScriptingContainer.runScriptlet(ScriptingContainer.java:1308)
	at org.apache.hadoop.hbase.client.TestReplicationShell.testRunShellTests(TestReplicationShell.java:34)
Caused by: org.jruby.exceptions.RaiseException: (RuntimeError) Shell unit tests failed. Check
output file for details.
	at (Anonymous).(root)(src/test/ruby/tests_runner.rb:84)

Tests run: 1, Failures: 0, Errors: 0, Skipped: 0, Time elapsed: 364.989 sec - in org.apache.hadoop.hbase.client.TestShell

Results :

Tests in error: 
  TestReplicationShell.testRunShellTests:34 » EvalFailed (RuntimeError) Shell un...

Tests run: 2, Failures: 0, Errors: 1, Skipped: 0

[INFO] ------------------------------------------------------------------------
[INFO] Reactor Summary:
[INFO] 
[INFO] Apache HBase ...................................... SUCCESS [1:09.425s]
[INFO] Apache HBase - Checkstyle ......................... SUCCESS [6.026s]
[INFO] Apache HBase - Resource Bundle .................... SUCCESS [0.216s]
[INFO] Apache HBase - Annotations ........................ SUCCESS [1.108s]
[INFO] Apache HBase - Protocol ........................... SUCCESS [16.129s]
[INFO] Apache HBase - Common ............................. SUCCESS [2:07.005s]
[INFO] Apache HBase - Procedure .......................... SUCCESS [1:55.625s]
[INFO] Apache HBase - Client ............................. SUCCESS [1:30.560s]
[INFO] Apache HBase - Hadoop Compatibility ............... SUCCESS [11.957s]
[INFO] Apache HBase - Hadoop Two Compatibility ........... SUCCESS [9.816s]
[INFO] Apache HBase - Prefix Tree ........................ SUCCESS [11.003s]
[INFO] Apache HBase - Server ............................. SUCCESS [1:55:53.928s]
[INFO] Apache HBase - Testing Util ....................... SUCCESS [2.013s]
[INFO] Apache HBase - Thrift ............................. SUCCESS [3:24.597s]
[INFO] Apache HBase - Rest ............................... SUCCESS [9:47.711s]
[INFO] Apache HBase - Shell .............................. FAILURE [6:23.770s]
[INFO] Apache HBase - Integration Tests .................. SKIPPED
[INFO] Apache HBase - Examples ........................... SKIPPED
[INFO] Apache HBase - External Block Cache ............... SKIPPED
[INFO] Apache HBase - Assembly ........................... SKIPPED
[INFO] Apache HBase - Shaded ............................. SKIPPED
[INFO] Apache HBase - Shaded - Client .................... SKIPPED
[INFO] Apache HBase - Shaded - Server .................... SKIPPED
[INFO] ------------------------------------------------------------------------
[INFO] BUILD FAILURE
[INFO] ------------------------------------------------------------------------
[INFO] Total time: 2:23:32.862s
[INFO] Finished at: Fri Oct 16 12:46:40 UTC 2015
[INFO] Final Memory: 114M/582M
[INFO] ------------------------------------------------------------------------
[ERROR] Failed to execute goal org.apache.maven.plugins:maven-surefire-plugin:2.18.1:test
(secondPartTestsExecution) on project hbase-shell: ExecutionException: java.lang.RuntimeException:
java.lang.RuntimeException: org.apache.maven.surefire.report.ReporterException: When writing
xml report stdout/stderr: /tmp/stdout1749066133580278937deferred (No such file or directory)
-> [Help 1]
[ERROR] 
[ERROR] To see the full stack trace of the errors, re-run Maven with the -e switch.
[ERROR] Re-run Maven using the -X switch to enable full debug logging.
[ERROR] 
[ERROR] For more information about the errors and possible solutions, please read the following
articles:
[ERROR] [Help 1] http://cwiki.apache.org/confluence/display/MAVEN/MojoFailureException
[ERROR] 
[ERROR] After correcting the problems, you can resume the build with the command
[ERROR]   mvn <goals> -rf :hbase-shell
Build step 'Invoke top-level Maven targets' marked build as failure
Performing Post build task...
Match found for :.* : True
Logical operation result is TRUE
Running script  :     ZOMBIE_TESTS_COUNT=`jps -v | grep surefirebooter | grep '-Dhbase.test'
| wc -l`
  if [[ $ZOMBIE_TESTS_COUNT != 0 ]] ; then
    #It seems sometimes the tests are not dying immediately. Let's give them 30s
    echo "Suspicious java process found - waiting 30s to see if there are just slow to stop"
    sleep 30
    ZOMBIE_TESTS_COUNT=`jps -v | grep surefirebooter | grep '-Dhbase.test' | wc -l`
    if [[ $ZOMBIE_TESTS_COUNT != 0 ]] ; then
      echo "There are $ZOMBIE_TESTS_COUNT zombie tests, they should have been killed by surefire
but survived"
      echo "************ zombies jps listing"
      jps -v
      jps -v | grep surefirebooter | grep '-Dhbase.test'
      echo "************ BEGIN zombies jstack extract"
      # HBase tests have been flagged with an innocuous '-Dhbase.test' just so they can
      # be identified as hbase in a process listing.
      ZB_STACK=`jps -v | grep surefirebooter | grep '-Dhbase.test' | cut -d ' ' -f 1 | xargs
-n 1 jstack | grep ".test" | grep "\.java"`
      jps -v | grep surefirebooter | grep '-Dhbase.test' | cut -d ' ' -f 1 | xargs -n 1 jstack
      echo "************ END  zombies jstack extract"
      JIRA_COMMENT="$JIRA_COMMENT

     {color:red}-1 core zombie tests{color}.  There are ${ZOMBIE_TESTS_COUNT} zombie test(s):
${ZB_STACK}"
      BAD=1
      # Killing these zombies
      echo 'Killing ZOMBIES!!!'
      jps -v
      jps -v | grep surefirebooter | grep '-Dhbase.test' | cut -d ' ' -f 1 | xargs kill -9
    else
      echo "We're ok: there is no zombie test, but some tests took some time to stop"
    fi
[Hadoop] $ /bin/bash -xe /tmp/hudson4445953102136221418.sh
++ jps -v
++ grep surefirebooter
++ wc -l
++ grep -Dhbase.test
grep: unknown devices method
+ ZOMBIE_TESTS_COUNT=0
/tmp/hudson4445953102136221418.sh: line 30: syntax error: unexpected end of file
POST BUILD TASK : FAILURE
END OF POST BUILD TASK : 0
Archiving artifacts

Mime
View raw message