hbase-builds mailing list archives

Site index · List index
Message view « Date » · « Thread »
Top « Date » · « Thread »
From Apache Jenkins Server <jenk...@builds.apache.org>
Subject Build failed in Jenkins: HBase-1.2 » latest1.8,Hadoop #222
Date Sat, 03 Oct 2015 06:12:36 GMT
See <https://builds.apache.org/job/HBase-1.2/jdk=latest1.8,label=Hadoop/222/changes>

Changes:

[larsh] HBASE-14539 Slight improvement of StoreScanner.optimize.

------------------------------------------
[...truncated 47283 lines...]
Running org.apache.hadoop.hbase.security.access.TestAccessController2
Running org.apache.hadoop.hbase.security.access.TestCellACLWithMultipleVersions
Tests run: 6, Failures: 0, Errors: 0, Skipped: 0, Time elapsed: 40.436 sec - in org.apache.hadoop.hbase.security.access.TestAccessController2
Java HotSpot(TM) 64-Bit Server VM warning: ignoring option MaxPermSize=256m; support was removed
in 8.0
Running org.apache.hadoop.hbase.security.access.TestZKPermissionsWatcher
Tests run: 8, Failures: 0, Errors: 0, Skipped: 0, Time elapsed: 53.371 sec - in org.apache.hadoop.hbase.security.access.TestCellACLWithMultipleVersions
Java HotSpot(TM) 64-Bit Server VM warning: ignoring option MaxPermSize=256m; support was removed
in 8.0
Java HotSpot(TM) 64-Bit Server VM warning: ignoring option MaxPermSize=256m; support was removed
in 8.0
Java HotSpot(TM) 64-Bit Server VM warning: ignoring option MaxPermSize=256m; support was removed
in 8.0
Tests run: 1, Failures: 0, Errors: 0, Skipped: 0, Time elapsed: 4.128 sec - in org.apache.hadoop.hbase.security.access.TestZKPermissionsWatcher
Java HotSpot(TM) 64-Bit Server VM warning: ignoring option MaxPermSize=256m; support was removed
in 8.0
Java HotSpot(TM) 64-Bit Server VM warning: ignoring option MaxPermSize=256m; support was removed
in 8.0
Java HotSpot(TM) 64-Bit Server VM warning: ignoring option MaxPermSize=256m; support was removed
in 8.0
Running org.apache.hadoop.hbase.security.token.TestZKSecretWatcher
Tests run: 1, Failures: 0, Errors: 0, Skipped: 0, Time elapsed: 13.357 sec - in org.apache.hadoop.hbase.security.token.TestZKSecretWatcher
Java HotSpot(TM) 64-Bit Server VM warning: ignoring option MaxPermSize=256m; support was removed
in 8.0
Running org.apache.hadoop.hbase.security.token.TestGenerateDelegationToken
Running org.apache.hadoop.hbase.security.token.TestTokenAuthentication
Tests run: 3, Failures: 0, Errors: 0, Skipped: 0, Time elapsed: 0.609 sec - in org.apache.hadoop.hbase.security.token.TestTokenAuthentication
Java HotSpot(TM) 64-Bit Server VM warning: ignoring option MaxPermSize=256m; support was removed
in 8.0
Tests run: 1, Failures: 0, Errors: 0, Skipped: 0, Time elapsed: 2.38 sec - in org.apache.hadoop.hbase.security.token.TestGenerateDelegationToken
Java HotSpot(TM) 64-Bit Server VM warning: ignoring option MaxPermSize=256m; support was removed
in 8.0
Java HotSpot(TM) 64-Bit Server VM warning: ignoring option MaxPermSize=256m; support was removed
in 8.0
Running org.apache.hadoop.hbase.security.visibility.TestVisibilityLabelsWithSLGStack
Tests run: 1, Failures: 0, Errors: 0, Skipped: 0, Time elapsed: 2.774 sec - in org.apache.hadoop.hbase.security.visibility.TestVisibilityLabelsWithSLGStack
Java HotSpot(TM) 64-Bit Server VM warning: ignoring option MaxPermSize=256m; support was removed
in 8.0
Running org.apache.hadoop.hbase.security.visibility.TestVisibilityLabelsReplication
Tests run: 1, Failures: 0, Errors: 0, Skipped: 0, Time elapsed: 25.491 sec - in org.apache.hadoop.hbase.security.visibility.TestVisibilityLabelsReplication
Java HotSpot(TM) 64-Bit Server VM warning: ignoring option MaxPermSize=256m; support was removed
in 8.0
Running org.apache.hadoop.hbase.security.visibility.TestWithDisabledAuthorization
Tests run: 2, Failures: 0, Errors: 0, Skipped: 0, Time elapsed: 3.322 sec - in org.apache.hadoop.hbase.security.visibility.TestWithDisabledAuthorization
Java HotSpot(TM) 64-Bit Server VM warning: ignoring option MaxPermSize=256m; support was removed
in 8.0
Java HotSpot(TM) 64-Bit Server VM warning: ignoring option MaxPermSize=256m; support was removed
in 8.0
Running org.apache.hadoop.hbase.security.visibility.TestVisibilityLabelsWithCustomVisLabService
Tests run: 21, Failures: 0, Errors: 0, Skipped: 0, Time elapsed: 33.539 sec - in org.apache.hadoop.hbase.security.visibility.TestVisibilityLabelsWithCustomVisLabService
Java HotSpot(TM) 64-Bit Server VM warning: ignoring option MaxPermSize=256m; support was removed
in 8.0
Running org.apache.hadoop.hbase.security.visibility.TestVisibilityLabelsWithDefaultVisLabelService
Tests run: 9, Failures: 0, Errors: 0, Skipped: 0, Time elapsed: 353.099 sec - in org.apache.hadoop.hbase.snapshot.TestSecureExportSnapshot
Java HotSpot(TM) 64-Bit Server VM warning: ignoring option MaxPermSize=256m; support was removed
in 8.0
Running org.apache.hadoop.hbase.security.visibility.TestDefaultScanLabelGeneratorStack
Tests run: 1, Failures: 0, Errors: 0, Skipped: 0, Time elapsed: 3.035 sec - in org.apache.hadoop.hbase.security.visibility.TestDefaultScanLabelGeneratorStack
Java HotSpot(TM) 64-Bit Server VM warning: ignoring option MaxPermSize=256m; support was removed
in 8.0
Running org.apache.hadoop.hbase.security.visibility.TestEnforcingScanLabelGenerator
Running org.apache.hadoop.hbase.security.access.TestNamespaceCommands
Tests run: 1, Failures: 0, Errors: 0, Skipped: 0, Time elapsed: 4.32 sec - in org.apache.hadoop.hbase.security.visibility.TestEnforcingScanLabelGenerator
Java HotSpot(TM) 64-Bit Server VM warning: ignoring option MaxPermSize=256m; support was removed
in 8.0
Tests run: 7, Failures: 0, Errors: 0, Skipped: 0, Time elapsed: 4.41 sec - in org.apache.hadoop.hbase.security.access.TestNamespaceCommands
Tests run: 25, Failures: 0, Errors: 0, Skipped: 0, Time elapsed: 36.944 sec - in org.apache.hadoop.hbase.security.visibility.TestVisibilityLabelsWithDefaultVisLabelService
Java HotSpot(TM) 64-Bit Server VM warning: ignoring option MaxPermSize=256m; support was removed
in 8.0
Java HotSpot(TM) 64-Bit Server VM warning: ignoring option MaxPermSize=256m; support was removed
in 8.0
Tests run: 9, Failures: 0, Errors: 0, Skipped: 0, Time elapsed: 366.566 sec - in org.apache.hadoop.hbase.snapshot.TestExportSnapshot
Java HotSpot(TM) 64-Bit Server VM warning: ignoring option MaxPermSize=256m; support was removed
in 8.0
Running org.apache.hadoop.hbase.security.visibility.TestVisibilityLablesWithGroups
Running org.apache.hadoop.hbase.security.visibility.TestVisibilityLabelsWithDeletes
Running org.apache.hadoop.hbase.security.visibility.TestVisibilityLabelsOpWithDifferentUsersNoACL
Tests run: 1, Failures: 0, Errors: 0, Skipped: 0, Time elapsed: 3.346 sec - in org.apache.hadoop.hbase.security.visibility.TestVisibilityLablesWithGroups
Java HotSpot(TM) 64-Bit Server VM warning: ignoring option MaxPermSize=256m; support was removed
in 8.0
Tests run: 1, Failures: 0, Errors: 0, Skipped: 0, Time elapsed: 1.87 sec - in org.apache.hadoop.hbase.security.visibility.TestVisibilityLabelsOpWithDifferentUsersNoACL
Running org.apache.hadoop.hbase.security.visibility.TestVisibilityWithCheckAuths
Java HotSpot(TM) 64-Bit Server VM warning: ignoring option MaxPermSize=256m; support was removed
in 8.0
Running org.apache.hadoop.hbase.security.visibility.TestVisibilityLabelReplicationWithExpAsString
Running org.apache.hadoop.hbase.TestGlobalMemStoreSize
Tests run: 2, Failures: 0, Errors: 0, Skipped: 0, Time elapsed: 5.076 sec - in org.apache.hadoop.hbase.security.visibility.TestVisibilityWithCheckAuths
Java HotSpot(TM) 64-Bit Server VM warning: ignoring option MaxPermSize=256m; support was removed
in 8.0
Java HotSpot(TM) 64-Bit Server VM warning: ignoring option MaxPermSize=256m; support was removed
in 8.0
Running org.apache.hadoop.hbase.TestNamespace
Tests run: 1, Failures: 0, Errors: 0, Skipped: 0, Time elapsed: 21.421 sec - in org.apache.hadoop.hbase.TestGlobalMemStoreSize
Java HotSpot(TM) 64-Bit Server VM warning: ignoring option MaxPermSize=256m; support was removed
in 8.0
Java HotSpot(TM) 64-Bit Server VM warning: ignoring option MaxPermSize=256m; support was removed
in 8.0
Tests run: 1, Failures: 0, Errors: 0, Skipped: 0, Time elapsed: 28.025 sec - in org.apache.hadoop.hbase.security.visibility.TestVisibilityLabelReplicationWithExpAsString
Java HotSpot(TM) 64-Bit Server VM warning: ignoring option MaxPermSize=256m; support was removed
in 8.0
Java HotSpot(TM) 64-Bit Server VM warning: ignoring option MaxPermSize=256m; support was removed
in 8.0
Java HotSpot(TM) 64-Bit Server VM warning: ignoring option MaxPermSize=256m; support was removed
in 8.0
Running org.apache.hadoop.hbase.constraint.TestConstraint
Running org.apache.hadoop.hbase.filter.TestFuzzyRowAndColumnRangeFilter
Tests run: 9, Failures: 0, Errors: 0, Skipped: 1, Time elapsed: 26.418 sec - in org.apache.hadoop.hbase.TestNamespace
Java HotSpot(TM) 64-Bit Server VM warning: ignoring option MaxPermSize=256m; support was removed
in 8.0
Java HotSpot(TM) 64-Bit Server VM warning: ignoring option MaxPermSize=256m; support was removed
in 8.0
Tests run: 1, Failures: 0, Errors: 0, Skipped: 0, Time elapsed: 4.334 sec - in org.apache.hadoop.hbase.filter.TestFuzzyRowAndColumnRangeFilter
Java HotSpot(TM) 64-Bit Server VM warning: ignoring option MaxPermSize=256m; support was removed
in 8.0
Tests run: 5, Failures: 0, Errors: 0, Skipped: 0, Time elapsed: 23.07 sec - in org.apache.hadoop.hbase.constraint.TestConstraint
Java HotSpot(TM) 64-Bit Server VM warning: ignoring option MaxPermSize=256m; support was removed
in 8.0
Java HotSpot(TM) 64-Bit Server VM warning: ignoring option MaxPermSize=256m; support was removed
in 8.0
Java HotSpot(TM) 64-Bit Server VM warning: ignoring option MaxPermSize=256m; support was removed
in 8.0
Java HotSpot(TM) 64-Bit Server VM warning: ignoring option MaxPermSize=256m; support was removed
in 8.0
Java HotSpot(TM) 64-Bit Server VM warning: ignoring option MaxPermSize=256m; support was removed
in 8.0
Java HotSpot(TM) 64-Bit Server VM warning: ignoring option MaxPermSize=256m; support was removed
in 8.0
Running org.apache.hadoop.hbase.filter.TestMultiRowRangeFilter
Running org.apache.hadoop.hbase.filter.TestFilterWrapper
Tests run: 1, Failures: 0, Errors: 0, Skipped: 0, Time elapsed: 4.001 sec - in org.apache.hadoop.hbase.filter.TestFilterWrapper
Java HotSpot(TM) 64-Bit Server VM warning: ignoring option MaxPermSize=256m; support was removed
in 8.0
Java HotSpot(TM) 64-Bit Server VM warning: ignoring option MaxPermSize=256m; support was removed
in 8.0
Running org.apache.hadoop.hbase.filter.TestColumnRangeFilter
Running org.apache.hadoop.hbase.filter.TestScanRowPrefix
Tests run: 1, Failures: 0, Errors: 0, Skipped: 0, Time elapsed: 8.924 sec - in org.apache.hadoop.hbase.filter.TestColumnRangeFilter
Java HotSpot(TM) 64-Bit Server VM warning: ignoring option MaxPermSize=256m; support was removed
in 8.0
Java HotSpot(TM) 64-Bit Server VM warning: ignoring option MaxPermSize=256m; support was removed
in 8.0
Tests run: 1, Failures: 0, Errors: 0, Skipped: 0, Time elapsed: 5.882 sec - in org.apache.hadoop.hbase.filter.TestScanRowPrefix
Java HotSpot(TM) 64-Bit Server VM warning: ignoring option MaxPermSize=256m; support was removed
in 8.0
Tests run: 20, Failures: 0, Errors: 0, Skipped: 0, Time elapsed: 23.071 sec - in org.apache.hadoop.hbase.filter.TestMultiRowRangeFilter
Java HotSpot(TM) 64-Bit Server VM warning: ignoring option MaxPermSize=256m; support was removed
in 8.0
Java HotSpot(TM) 64-Bit Server VM warning: ignoring option MaxPermSize=256m; support was removed
in 8.0
Java HotSpot(TM) 64-Bit Server VM warning: ignoring option MaxPermSize=256m; support was removed
in 8.0
Java HotSpot(TM) 64-Bit Server VM warning: ignoring option MaxPermSize=256m; support was removed
in 8.0
Java HotSpot(TM) 64-Bit Server VM warning: ignoring option MaxPermSize=256m; support was removed
in 8.0
Java HotSpot(TM) 64-Bit Server VM warning: ignoring option MaxPermSize=256m; support was removed
in 8.0
Java HotSpot(TM) 64-Bit Server VM warning: ignoring option MaxPermSize=256m; support was removed
in 8.0
Java HotSpot(TM) 64-Bit Server VM warning: ignoring option MaxPermSize=256m; support was removed
in 8.0
Java HotSpot(TM) 64-Bit Server VM warning: ignoring option MaxPermSize=256m; support was removed
in 8.0
Java HotSpot(TM) 64-Bit Server VM warning: ignoring option MaxPermSize=256m; support was removed
in 8.0
Java HotSpot(TM) 64-Bit Server VM warning: ignoring option MaxPermSize=256m; support was removed
in 8.0
Java HotSpot(TM) 64-Bit Server VM warning: ignoring option MaxPermSize=256m; support was removed
in 8.0
Java HotSpot(TM) 64-Bit Server VM warning: ignoring option MaxPermSize=256m; support was removed
in 8.0
Java HotSpot(TM) 64-Bit Server VM warning: ignoring option MaxPermSize=256m; support was removed
in 8.0
Tests run: 39, Failures: 0, Errors: 0, Skipped: 0, Time elapsed: 92.822 sec - in org.apache.hadoop.hbase.security.visibility.TestVisibilityLabelsWithDeletes
Java HotSpot(TM) 64-Bit Server VM warning: ignoring option MaxPermSize=256m; support was removed
in 8.0
Running org.apache.hadoop.hbase.TestHBaseTestingUtility
Java HotSpot(TM) 64-Bit Server VM warning: ignoring option MaxPermSize=256m; support was removed
in 8.0
Java HotSpot(TM) 64-Bit Server VM warning: ignoring option MaxPermSize=256m; support was removed
in 8.0
Java HotSpot(TM) 64-Bit Server VM warning: ignoring option MaxPermSize=256m; support was removed
in 8.0
Running org.apache.hadoop.hbase.filter.TestFuzzyRowFilterEndToEnd
Running org.apache.hadoop.hbase.filter.TestFilterWithScanLimits
Tests run: 1, Failures: 0, Errors: 0, Skipped: 0, Time elapsed: 4.236 sec - in org.apache.hadoop.hbase.filter.TestFilterWithScanLimits
Java HotSpot(TM) 64-Bit Server VM warning: ignoring option MaxPermSize=256m; support was removed
in 8.0
Running org.apache.hadoop.hbase.quotas.TestQuotaThrottle
Running org.apache.hadoop.hbase.quotas.TestQuotaAdmin
Tests run: 3, Failures: 0, Errors: 0, Skipped: 0, Time elapsed: 3.758 sec - in org.apache.hadoop.hbase.quotas.TestQuotaAdmin
Java HotSpot(TM) 64-Bit Server VM warning: ignoring option MaxPermSize=256m; support was removed
in 8.0
Tests run: 12, Failures: 0, Errors: 0, Skipped: 0, Time elapsed: 25.238 sec - in org.apache.hadoop.hbase.quotas.TestQuotaThrottle
Running org.apache.hadoop.hbase.quotas.TestQuotaTableUtil
Java HotSpot(TM) 64-Bit Server VM warning: ignoring option MaxPermSize=256m; support was removed
in 8.0
Java HotSpot(TM) 64-Bit Server VM warning: ignoring option MaxPermSize=256m; support was removed
in 8.0
Java HotSpot(TM) 64-Bit Server VM warning: ignoring option MaxPermSize=256m; support was removed
in 8.0
Tests run: 3, Failures: 0, Errors: 0, Skipped: 0, Time elapsed: 1.769 sec - in org.apache.hadoop.hbase.quotas.TestQuotaTableUtil
Java HotSpot(TM) 64-Bit Server VM warning: ignoring option MaxPermSize=256m; support was removed
in 8.0
Java HotSpot(TM) 64-Bit Server VM warning: ignoring option MaxPermSize=256m; support was removed
in 8.0
Java HotSpot(TM) 64-Bit Server VM warning: ignoring option MaxPermSize=256m; support was removed
in 8.0
Running org.apache.hadoop.hbase.io.encoding.TestDataBlockEncoders
Java HotSpot(TM) 64-Bit Server VM warning: ignoring option MaxPermSize=256m; support was removed
in 8.0
Tests run: 11, Failures: 0, Errors: 0, Skipped: 0, Time elapsed: 59.36 sec - in org.apache.hadoop.hbase.TestHBaseTestingUtility
Java HotSpot(TM) 64-Bit Server VM warning: ignoring option MaxPermSize=256m; support was removed
in 8.0
Java HotSpot(TM) 64-Bit Server VM warning: ignoring option MaxPermSize=256m; support was removed
in 8.0
Running org.apache.hadoop.hbase.io.encoding.TestEncodedSeekers
Running org.apache.hadoop.hbase.io.encoding.TestChangingEncoding

Results :

Tests run: 2016, Failures: 0, Errors: 0, Skipped: 40

[INFO] ------------------------------------------------------------------------
[INFO] Reactor Summary:
[INFO] 
[INFO] Apache HBase ...................................... SUCCESS [1:55.120s]
[INFO] Apache HBase - Checkstyle ......................... SUCCESS [9.185s]
[INFO] Apache HBase - Resource Bundle .................... SUCCESS [0.340s]
[INFO] Apache HBase - Annotations ........................ SUCCESS [1.523s]
[INFO] Apache HBase - Protocol ........................... SUCCESS [26.410s]
[INFO] Apache HBase - Common ............................. SUCCESS [3:28.954s]
[INFO] Apache HBase - Procedure .......................... SUCCESS [2:13.096s]
[INFO] Apache HBase - Client ............................. SUCCESS [2:19.188s]
[INFO] Apache HBase - Hadoop Compatibility ............... SUCCESS [10.311s]
[INFO] Apache HBase - Hadoop Two Compatibility ........... SUCCESS [15.298s]
[INFO] Apache HBase - Prefix Tree ........................ SUCCESS [16.485s]
[INFO] Apache HBase - Server ............................. FAILURE [1:35:25.642s]
[INFO] Apache HBase - Testing Util ....................... SKIPPED
[INFO] Apache HBase - Thrift ............................. SKIPPED
[INFO] Apache HBase - Rest ............................... SKIPPED
[INFO] Apache HBase - Shell .............................. SKIPPED
[INFO] Apache HBase - Integration Tests .................. SKIPPED
[INFO] Apache HBase - Examples ........................... SKIPPED
[INFO] Apache HBase - External Block Cache ............... SKIPPED
[INFO] Apache HBase - Assembly ........................... SKIPPED
[INFO] Apache HBase - Shaded ............................. SKIPPED
[INFO] Apache HBase - Shaded - Client .................... SKIPPED
[INFO] Apache HBase - Shaded - Server .................... SKIPPED
[INFO] ------------------------------------------------------------------------
[INFO] BUILD FAILURE
[INFO] ------------------------------------------------------------------------
[INFO] Total time: 1:47:10.185s
[INFO] Finished at: Sat Oct 03 06:10:58 UTC 2015
[INFO] Final Memory: 449M/623M
[INFO] ------------------------------------------------------------------------
[ERROR] Failed to execute goal org.apache.maven.plugins:maven-surefire-plugin:2.18.1:test
(secondPartTestsExecution) on project hbase-server: ExecutionException: java.lang.RuntimeException:
The forked VM terminated without properly saying goodbye. VM crash or System.exit called?
[ERROR] Command was /bin/sh -c cd <https://builds.apache.org/job/HBase-1.2/jdk=latest1.8,label=Hadoop/ws/hbase-server>
&& /home/jenkins/jenkins-slave/tools/hudson.model.JDK/latest1.8/jre/bin/java -enableassertions
-XX:MaxDirectMemorySize=1G -Xmx2800m -XX:MaxPermSize=256m -Djava.security.egd=file:/dev/./urandom
-Djava.net.preferIPv4Stack=true -Djava.awt.headless=true -jar <https://builds.apache.org/job/HBase-1.2/jdk=latest1.8,label=Hadoop/ws/hbase-server/target/surefire/surefirebooter4010261849745975615.jar>
<https://builds.apache.org/job/HBase-1.2/jdk=latest1.8,label=Hadoop/ws/hbase-server/target/surefire/surefire4364096982800830376tmp>
<https://builds.apache.org/job/HBase-1.2/jdk=latest1.8,label=Hadoop/ws/hbase-server/target/surefire/surefire_8661022422256989540154tmp>
[ERROR] -> [Help 1]
[ERROR] 
[ERROR] To see the full stack trace of the errors, re-run Maven with the -e switch.
[ERROR] Re-run Maven using the -X switch to enable full debug logging.
[ERROR] 
[ERROR] For more information about the errors and possible solutions, please read the following
articles:
[ERROR] [Help 1] http://cwiki.apache.org/confluence/display/MAVEN/MojoFailureException
[ERROR] 
[ERROR] After correcting the problems, you can resume the build with the command
[ERROR]   mvn <goals> -rf :hbase-server
Build step 'Invoke top-level Maven targets' marked build as failure
Performing Post build task...
Match found for :.* : True
Logical operation result is TRUE
Running script  :   ZOMBIE_TESTS_COUNT=`jps | grep surefirebooter | wc -l`
  if [[ $ZOMBIE_TESTS_COUNT != 0 ]] ; then
    #It seems sometimes the tests are not dying immediately. Let's give them 10s
    echo "Suspicious java process found - waiting 10s to see if there are just slow to stop"
    sleep 10   
    ZOMBIE_TESTS_COUNT=`jps | grep surefirebooter | wc -l`
    if [[ $ZOMBIE_TESTS_COUNT != 0 ]] ; then
      echo "There are $ZOMBIE_TESTS_COUNT zombie tests, they should have been killed by surefire
but survived"
      echo "************ BEGIN zombies jstack extract"
      ZB_STACK=`jps | grep surefirebooter | cut -d ' ' -f 1 | xargs -n 1 jstack | grep ".test"
| grep "\.java"`
      jps | grep surefirebooter | cut -d ' ' -f 1 | xargs -n 1 jstack
      echo "************ END  zombies jstack extract"
      JIRA_COMMENT="$JIRA_COMMENT

     {color:red}-1 core zombie tests{color}.  There are ${ZOMBIE_TESTS_COUNT} zombie test(s):
${ZB_STACK}"
      BAD=1
      jps | grep surefirebooter | cut -d ' ' -f 1 | xargs kill -9
    else
      echo "We're ok: there is no zombie test, but some tests took some time to stop"
    fi
  else
    echo "We're ok: there is no zombie test"
  fi
[Hadoop] $ /bin/bash -xe /tmp/hudson6984860324981708921.sh
++ jps
++ grep surefirebooter
++ wc -l
+ ZOMBIE_TESTS_COUNT=3
+ [[ 3 != 0 ]]
+ echo 'Suspicious java process found - waiting 10s to see if there are just slow to stop'
Suspicious java process found - waiting 10s to see if there are just slow to stop
+ sleep 10
++ jps
++ grep surefirebooter
++ wc -l
+ ZOMBIE_TESTS_COUNT=1
+ [[ 1 != 0 ]]
+ echo 'There are 1 zombie tests, they should have been killed by surefire but survived'
There are 1 zombie tests, they should have been killed by surefire but survived
+ echo '************ BEGIN zombies jstack extract'
************ BEGIN zombies jstack extract
++ grep '\.java'
++ grep .test
++ xargs -n 1 jstack
++ cut -d ' ' -f 1
++ grep surefirebooter
++ jps
+ ZB_STACK=
POST BUILD TASK : FAILURE
END OF POST BUILD TASK : 0
Archiving artifacts

Mime
View raw message