hbase-builds mailing list archives

Site index · List index
Message view « Date » · « Thread »
Top « Date » · « Thread »
From Apache Jenkins Server <jenk...@builds.apache.org>
Subject Build failed in Jenkins: HBase-1.2 » latest1.7,Hadoop #418
Date Wed, 02 Dec 2015 21:30:42 GMT
See <https://builds.apache.org/job/HBase-1.2/jdk=latest1.7,label=Hadoop/418/changes>

Changes:

[stack] HBASE-14819 hbase-it tests failing with OOME; permgen

[stack] HBASE-14908 TestRowCounter flakey especially on branch-1

------------------------------------------
[...truncated 44467 lines...]
Tests run: 4, Failures: 0, Errors: 0, Skipped: 0, Time elapsed: 18.228 sec - in org.apache.hadoop.hbase.replication.multiwal.TestReplicationEndpointWithMultipleWAL
Tests run: 12, Failures: 0, Errors: 0, Skipped: 0, Time elapsed: 227.699 sec - in org.apache.hadoop.hbase.TestZooKeeper
Tests run: 1, Failures: 0, Errors: 0, Skipped: 0, Time elapsed: 27.444 sec - in org.apache.hadoop.hbase.replication.TestReplicationDisableInactivePeer
Running org.apache.hadoop.hbase.replication.TestReplicationSource
Tests run: 1, Failures: 0, Errors: 0, Skipped: 0, Time elapsed: 0.611 sec - in org.apache.hadoop.hbase.replication.TestReplicationSource
Running org.apache.hadoop.hbase.replication.multiwal.TestReplicationSyncUpToolWithMultipleWAL
Running org.apache.hadoop.hbase.replication.TestReplicationSmallTests
Tests run: 1, Failures: 0, Errors: 0, Skipped: 0, Time elapsed: 92.896 sec - in org.apache.hadoop.hbase.replication.TestReplicationKillMasterRSCompressed
Running org.apache.hadoop.hbase.replication.TestReplicationEndpoint
Running org.apache.hadoop.hbase.replication.regionserver.TestReplicationWALReaderManager
Tests run: 1, Failures: 0, Errors: 0, Skipped: 0, Time elapsed: 101.051 sec - in org.apache.hadoop.hbase.replication.multiwal.TestReplicationKillMasterRSCompressedWithMultipleWAL
Tests run: 4, Failures: 0, Errors: 0, Skipped: 0, Time elapsed: 17.908 sec - in org.apache.hadoop.hbase.replication.TestReplicationEndpoint
Running org.apache.hadoop.hbase.replication.regionserver.TestReplicationSourceManager
Tests run: 5, Failures: 0, Errors: 0, Skipped: 0, Time elapsed: 6.206 sec - in org.apache.hadoop.hbase.replication.regionserver.TestReplicationSourceManager
Running org.apache.hadoop.hbase.replication.regionserver.TestReplicationSink
Tests run: 5, Failures: 0, Errors: 0, Skipped: 0, Time elapsed: 3.381 sec - in org.apache.hadoop.hbase.replication.regionserver.TestReplicationSink
Running org.apache.hadoop.hbase.replication.regionserver.TestRegionReplicaReplicationEndpoint
Tests run: 1, Failures: 0, Errors: 0, Skipped: 0, Time elapsed: 82.871 sec - in org.apache.hadoop.hbase.replication.multiwal.TestReplicationSyncUpToolWithMultipleWAL
Tests run: 10, Failures: 0, Errors: 0, Skipped: 0, Time elapsed: 96.73 sec - in org.apache.hadoop.hbase.replication.TestReplicationSmallTests
Running org.apache.hadoop.hbase.replication.regionserver.TestRegionReplicaReplicationEndpointNoMaster
Running org.apache.hadoop.hbase.replication.TestMasterReplication
Running org.apache.hadoop.hbase.replication.TestReplicationKillMasterRS
Tests run: 4, Failures: 0, Errors: 0, Skipped: 0, Time elapsed: 99.709 sec - in org.apache.hadoop.hbase.replication.regionserver.TestRegionReplicaReplicationEndpointNoMaster
Running org.apache.hadoop.hbase.replication.TestPerTableCFReplication
Tests run: 1, Failures: 0, Errors: 0, Skipped: 0, Time elapsed: 110.982 sec - in org.apache.hadoop.hbase.replication.TestReplicationKillMasterRS
Tests run: 4, Failures: 0, Errors: 0, Skipped: 0, Time elapsed: 151.087 sec - in org.apache.hadoop.hbase.replication.TestMasterReplication
Tests run: 2, Failures: 0, Errors: 0, Skipped: 0, Time elapsed: 49.496 sec - in org.apache.hadoop.hbase.replication.TestPerTableCFReplication
Running org.apache.hadoop.hbase.replication.TestMultiSlaveReplication
Running org.apache.hadoop.hbase.replication.TestReplicationWithTags
Running org.apache.hadoop.hbase.replication.TestReplicationChangingPeerRegionservers
Tests run: 1, Failures: 0, Errors: 0, Skipped: 0, Time elapsed: 4.85 sec - in org.apache.hadoop.hbase.replication.TestReplicationWithTags
Tests run: 1, Failures: 0, Errors: 0, Skipped: 0, Time elapsed: 10.565 sec - in org.apache.hadoop.hbase.replication.TestReplicationChangingPeerRegionservers
Tests run: 8, Failures: 0, Errors: 0, Skipped: 0, Time elapsed: 294.595 sec - in org.apache.hadoop.hbase.replication.regionserver.TestReplicationWALReaderManager
Tests run: 9, Failures: 0, Errors: 0, Skipped: 0, Time elapsed: 251.921 sec - in org.apache.hadoop.hbase.replication.regionserver.TestRegionReplicaReplicationEndpoint
Running org.apache.hadoop.hbase.replication.TestReplicationStateZKImpl
Running org.apache.hadoop.hbase.TestLocalHBaseCluster
Tests run: 6, Failures: 0, Errors: 0, Skipped: 0, Time elapsed: 4.306 sec - in org.apache.hadoop.hbase.replication.TestReplicationStateZKImpl
Tests run: 1, Failures: 0, Errors: 0, Skipped: 0, Time elapsed: 23.151 sec - in org.apache.hadoop.hbase.TestLocalHBaseCluster
Tests run: 1, Failures: 0, Errors: 0, Skipped: 0, Time elapsed: 58.421 sec - in org.apache.hadoop.hbase.replication.TestMultiSlaveReplication
Running org.apache.hadoop.hbase.replication.TestReplicationSyncUpTool
Running org.apache.hadoop.hbase.TestMetaTableAccessor
Running org.apache.hadoop.hbase.fs.TestBlockReorder
Running org.apache.hadoop.hbase.replication.TestReplicationKillSlaveRS
Running org.apache.hadoop.hbase.TestMultiVersions
Tests run: 13, Failures: 0, Errors: 0, Skipped: 0, Time elapsed: 31.154 sec - in org.apache.hadoop.hbase.TestMetaTableAccessor
Tests run: 3, Failures: 0, Errors: 0, Skipped: 0, Time elapsed: 21.186 sec - in org.apache.hadoop.hbase.TestMultiVersions
Tests run: 3, Failures: 0, Errors: 0, Skipped: 0, Time elapsed: 58.443 sec - in org.apache.hadoop.hbase.fs.TestBlockReorder
Running org.apache.hadoop.hbase.filter.TestFilterWithScanLimits
Running org.apache.hadoop.hbase.filter.TestFuzzyRowAndColumnRangeFilter
Tests run: 1, Failures: 0, Errors: 0, Skipped: 0, Time elapsed: 6.852 sec - in org.apache.hadoop.hbase.filter.TestFilterWithScanLimits
Tests run: 1, Failures: 0, Errors: 0, Skipped: 0, Time elapsed: 5.344 sec - in org.apache.hadoop.hbase.filter.TestFuzzyRowAndColumnRangeFilter
Tests run: 1, Failures: 0, Errors: 0, Skipped: 0, Time elapsed: 81.106 sec - in org.apache.hadoop.hbase.replication.TestReplicationSyncUpTool
Running org.apache.hadoop.hbase.filter.TestScanRowPrefix
Running org.apache.hadoop.hbase.filter.TestColumnRangeFilter
Tests run: 1, Failures: 0, Errors: 0, Skipped: 0, Time elapsed: 8.803 sec - in org.apache.hadoop.hbase.filter.TestScanRowPrefix
Tests run: 1, Failures: 0, Errors: 0, Skipped: 0, Time elapsed: 94.866 sec - in org.apache.hadoop.hbase.replication.TestReplicationKillSlaveRS
Running org.apache.hadoop.hbase.filter.TestFilterWrapper
Running org.apache.hadoop.hbase.filter.TestFuzzyRowFilterEndToEnd
Tests run: 1, Failures: 0, Errors: 0, Skipped: 0, Time elapsed: 16.864 sec - in org.apache.hadoop.hbase.filter.TestColumnRangeFilter
Tests run: 1, Failures: 0, Errors: 0, Skipped: 0, Time elapsed: 6.406 sec - in org.apache.hadoop.hbase.filter.TestFilterWrapper
Running org.apache.hadoop.hbase.mapreduce.TestHFileOutputFormat
Running org.apache.hadoop.hbase.filter.TestMultiRowRangeFilter
Running org.apache.hadoop.hbase.mapreduce.TestLoadIncrementalHFilesUseSecurityEndPoint
Running org.apache.hadoop.hbase.mapreduce.TestWALPlayer
Tests run: 20, Failures: 0, Errors: 0, Skipped: 0, Time elapsed: 32.816 sec - in org.apache.hadoop.hbase.filter.TestMultiRowRangeFilter
Running org.apache.hadoop.hbase.mapreduce.TestHLogRecordReader
Tests run: 2, Failures: 0, Errors: 0, Skipped: 0, Time elapsed: 2.206 sec - in org.apache.hadoop.hbase.mapreduce.TestHLogRecordReader
Running org.apache.hadoop.hbase.mapreduce.TestMultiTableInputFormat
Tests run: 4, Failures: 0, Errors: 0, Skipped: 0, Time elapsed: 88.178 sec - in org.apache.hadoop.hbase.mapreduce.TestWALPlayer
Running org.apache.hadoop.hbase.mapreduce.TestHashTable
Tests run: 3, Failures: 0, Errors: 0, Skipped: 0, Time elapsed: 290.128 sec - in org.apache.hadoop.hbase.filter.TestFuzzyRowFilterEndToEnd
Tests run: 1, Failures: 0, Errors: 0, Skipped: 0, Time elapsed: 126.329 sec - in org.apache.hadoop.hbase.mapreduce.TestHashTable
Running org.apache.hadoop.hbase.mapreduce.TestWALRecordReader
Tests run: 2, Failures: 0, Errors: 0, Skipped: 0, Time elapsed: 1.774 sec - in org.apache.hadoop.hbase.mapreduce.TestWALRecordReader
Running org.apache.hadoop.hbase.mapreduce.TestImportTSVWithOperationAttributes
Tests run: 16, Failures: 0, Errors: 0, Skipped: 0, Time elapsed: 319.468 sec - in org.apache.hadoop.hbase.mapreduce.TestLoadIncrementalHFilesUseSecurityEndPoint
Running org.apache.hadoop.hbase.mapreduce.TestSecureLoadIncrementalHFilesSplitRecovery
Running org.apache.hadoop.hbase.mapreduce.TestSyncTable
Tests run: 5, Failures: 0, Errors: 0, Skipped: 0, Time elapsed: 48.985 sec - in org.apache.hadoop.hbase.mapreduce.TestSecureLoadIncrementalHFilesSplitRecovery
Tests run: 4, Failures: 0, Errors: 0, Skipped: 0, Time elapsed: 294.26 sec - in org.apache.hadoop.hbase.mapreduce.TestMultiTableInputFormat
Running org.apache.hadoop.hbase.mapreduce.TestTableSnapshotInputFormat
Running org.apache.hadoop.hbase.mapreduce.TestTimeRangeMapRed
Tests run: 2, Failures: 0, Errors: 0, Skipped: 0, Time elapsed: 166.227 sec - in org.apache.hadoop.hbase.mapreduce.TestImportTSVWithOperationAttributes
Tests run: 13, Failures: 0, Errors: 0, Skipped: 1, Time elapsed: 500.808 sec - in org.apache.hadoop.hbase.mapreduce.TestHFileOutputFormat
Running org.apache.hadoop.hbase.mapreduce.TestImportTSVWithTTLs
Running org.apache.hadoop.hbase.mapreduce.TestCellCounter
Tests run: 1, Failures: 0, Errors: 0, Skipped: 0, Time elapsed: 107.053 sec - in org.apache.hadoop.hbase.mapreduce.TestTimeRangeMapRed
Tests run: 1, Failures: 0, Errors: 0, Skipped: 0, Time elapsed: 201.565 sec - in org.apache.hadoop.hbase.mapreduce.TestSyncTable
Running org.apache.hadoop.hbase.mapreduce.TestHRegionPartitioner
Running org.apache.hadoop.hbase.mapreduce.TestTableInputFormatScan1
Tests run: 1, Failures: 0, Errors: 0, Skipped: 0, Time elapsed: 7.468 sec - in org.apache.hadoop.hbase.mapreduce.TestHRegionPartitioner
Tests run: 1, Failures: 0, Errors: 0, Skipped: 0, Time elapsed: 92.903 sec - in org.apache.hadoop.hbase.mapreduce.TestImportTSVWithTTLs
Running org.apache.hadoop.hbase.mapreduce.TestLoadIncrementalHFiles
Running org.apache.hadoop.hbase.mapreduce.TestSecureLoadIncrementalHFiles
Tests run: 7, Failures: 0, Errors: 0, Skipped: 0, Time elapsed: 355.935 sec - in org.apache.hadoop.hbase.mapreduce.TestCellCounter
Running org.apache.hadoop.hbase.mapreduce.TestTableInputFormat
Tests run: 16, Failures: 0, Errors: 0, Skipped: 0, Time elapsed: 340.14 sec - in org.apache.hadoop.hbase.mapreduce.TestLoadIncrementalHFiles
Tests run: 16, Failures: 0, Errors: 0, Skipped: 0, Time elapsed: 342.887 sec - in org.apache.hadoop.hbase.mapreduce.TestSecureLoadIncrementalHFiles
Tests run: 8, Failures: 0, Errors: 0, Skipped: 0, Time elapsed: 587.5 sec - in org.apache.hadoop.hbase.mapreduce.TestTableSnapshotInputFormat
Running org.apache.hadoop.hbase.mapreduce.TestTableInputFormatScan2
Running org.apache.hadoop.hbase.mapreduce.TestImportExport
Tests run: 7, Failures: 0, Errors: 0, Skipped: 0, Time elapsed: 435.623 sec - in org.apache.hadoop.hbase.mapreduce.TestTableInputFormatScan1
Running org.apache.hadoop.hbase.mapreduce.TestRowCounter
Running org.apache.hadoop.hbase.mapreduce.TestCopyTable
Tests run: 8, Failures: 0, Errors: 0, Skipped: 0, Time elapsed: 161.464 sec - in org.apache.hadoop.hbase.mapreduce.TestTableInputFormat
Running org.apache.hadoop.hbase.mapreduce.TestLoadIncrementalHFilesSplitRecovery
Tests run: 5, Failures: 0, Errors: 0, Skipped: 0, Time elapsed: 63.841 sec - in org.apache.hadoop.hbase.mapreduce.TestLoadIncrementalHFilesSplitRecovery
Running org.apache.hadoop.hbase.mapreduce.TestHFileOutputFormat2
Tests run: 14, Failures: 0, Errors: 0, Skipped: 14, Time elapsed: 0.008 sec - in org.apache.hadoop.hbase.mapreduce.TestHFileOutputFormat2
Running org.apache.hadoop.hbase.mapreduce.TestMultithreadedTableMapper
Tests run: 5, Failures: 0, Errors: 0, Skipped: 0, Time elapsed: 328.081 sec - in org.apache.hadoop.hbase.mapreduce.TestCopyTable
Tests run: 1, Failures: 0, Errors: 0, Skipped: 0, Time elapsed: 205.996 sec - in org.apache.hadoop.hbase.mapreduce.TestMultithreadedTableMapper
Running org.apache.hadoop.hbase.mapreduce.TestImportTSVWithVisibilityLabels
Tests run: 6, Failures: 0, Errors: 0, Skipped: 0, Time elapsed: 429.117 sec - in org.apache.hadoop.hbase.mapreduce.TestRowCounter
Running org.apache.hadoop.hbase.mapreduce.TestImportTsv
Running org.apache.hadoop.hbase.mapreduce.TestTableMapReduce
Tests run: 7, Failures: 0, Errors: 0, Skipped: 0, Time elapsed: 515.759 sec - in org.apache.hadoop.hbase.mapreduce.TestTableInputFormatScan2
Running org.apache.hadoop.hbase.mapreduce.TestMultiTableSnapshotInputFormat
Tests run: 2, Failures: 0, Errors: 0, Skipped: 0, Time elapsed: 343.872 sec - in org.apache.hadoop.hbase.mapreduce.TestTableMapReduce
Tests run: 4, Failures: 0, Errors: 0, Skipped: 0, Time elapsed: 333.19 sec - in org.apache.hadoop.hbase.mapreduce.TestMultiTableSnapshotInputFormat
Tests run: 7, Failures: 0, Errors: 0, Skipped: 0, Time elapsed: 557.018 sec - in org.apache.hadoop.hbase.mapreduce.TestImportTSVWithVisibilityLabels
Tests run: 11, Failures: 0, Errors: 0, Skipped: 0, Time elapsed: 602.713 sec - in org.apache.hadoop.hbase.mapreduce.TestImportTsv

Results :

Flaked tests: 
org.apache.hadoop.hbase.client.TestMultiParallel.testFlushCommitsNoAbort(org.apache.hadoop.hbase.client.TestMultiParallel)
  Run 1: TestMultiParallel.testFlushCommitsNoAbort:241->doTestFlushCommits:293->validateLoadedData:676
null
  Run 2: PASS


Tests run: 2332, Failures: 0, Errors: 0, Skipped: 40, Flakes: 1

[INFO] ------------------------------------------------------------------------
[INFO] Reactor Summary:
[INFO] 
[INFO] Apache HBase ...................................... SUCCESS [2:22.410s]
[INFO] Apache HBase - Checkstyle ......................... SUCCESS [14.900s]
[INFO] Apache HBase - Resource Bundle .................... SUCCESS [0.888s]
[INFO] Apache HBase - Annotations ........................ SUCCESS [3.694s]
[INFO] Apache HBase - Protocol ........................... SUCCESS [39.302s]
[INFO] Apache HBase - Common ............................. SUCCESS [6:24.852s]
[INFO] Apache HBase - Procedure .......................... SUCCESS [4:31.334s]
[INFO] Apache HBase - Client ............................. SUCCESS [2:41.320s]
[INFO] Apache HBase - Hadoop Compatibility ............... SUCCESS [13.009s]
[INFO] Apache HBase - Hadoop Two Compatibility ........... SUCCESS [18.403s]
[INFO] Apache HBase - Prefix Tree ........................ SUCCESS [20.594s]
[INFO] Apache HBase - Server ............................. FAILURE [2:40:58.262s]
[INFO] Apache HBase - Testing Util ....................... SKIPPED
[INFO] Apache HBase - Thrift ............................. SKIPPED
[INFO] Apache HBase - Rest ............................... SKIPPED
[INFO] Apache HBase - Shell .............................. SKIPPED
[INFO] Apache HBase - Integration Tests .................. SKIPPED
[INFO] Apache HBase - Examples ........................... SKIPPED
[INFO] Apache HBase - External Block Cache ............... SKIPPED
[INFO] Apache HBase - Assembly ........................... SKIPPED
[INFO] Apache HBase - Shaded ............................. SKIPPED
[INFO] Apache HBase - Shaded - Client .................... SKIPPED
[INFO] Apache HBase - Shaded - Server .................... SKIPPED
[INFO] ------------------------------------------------------------------------
[INFO] BUILD FAILURE
[INFO] ------------------------------------------------------------------------
[INFO] Total time: 2:59:38.711s
[INFO] Finished at: Wed Dec 02 21:26:12 UTC 2015
[INFO] Final Memory: 93M/645M
[INFO] ------------------------------------------------------------------------
[ERROR] Failed to execute goal org.apache.maven.plugins:maven-surefire-plugin:2.18.1:test
(secondPartTestsExecution) on project hbase-server: There was a timeout or other error in
the fork -> [Help 1]
[ERROR] 
[ERROR] To see the full stack trace of the errors, re-run Maven with the -e switch.
[ERROR] Re-run Maven using the -X switch to enable full debug logging.
[ERROR] 
[ERROR] For more information about the errors and possible solutions, please read the following
articles:
[ERROR] [Help 1] http://cwiki.apache.org/confluence/display/MAVEN/MojoFailureException
[ERROR] 
[ERROR] After correcting the problems, you can resume the build with the command
[ERROR]   mvn <goals> -rf :hbase-server
Build step 'Invoke top-level Maven targets' marked build as failure
Performing Post build task...
Match found for :.* : True
Logical operation result is TRUE
Running script  : # Post-build task script. TODO: Check this in and have all builds reference
check-in.
pwd && ls
# NOTE!!!! The below code has been copied and pasted from ./dev-tools/run-test.sh
# Do not change here without syncing there and vice-versa.
ZOMBIE_TESTS_COUNT=`jps -v | grep surefirebooter | grep -e '-Dhbase.test' | wc -l`
if [[ $ZOMBIE_TESTS_COUNT != 0 ]] ; then
 echo "Suspicious java process found - waiting 30s to see if there are just slow to stop"
 sleep 30
 ZOMBIE_TESTS_COUNT=`jps -v | grep surefirebooter | grep -e '-Dhbase.test' | wc -l`
 if [[ $ZOMBIE_TESTS_COUNT != 0 ]] ; then
   echo " {color:red}There appear to be $ZOMBIE_TESTS_COUNT zombie tests{color}, they should
have been killed by surefire but survived"
   jps -v | grep surefirebooter | grep -e '-Dhbase.test'
   jps -v | grep surefirebooter | grep -e '-Dhbase.test' | cut -d ' ' -f 1 | xargs -n 1 jstack
   # Exit with error
   exit 1
 else
   echo "We're ok: there is no zombie test, but some tests took some time to stop"
 fi
else
  echo "We're ok: there is no zombie test"
fi
[Hadoop] $ /bin/bash -xe /tmp/hudson4404878465125984918.sh
+ pwd
<https://builds.apache.org/job/HBase-1.2/jdk=latest1.7,label=Hadoop/ws/>
+ ls
bin
CHANGES.txt
conf
dev-support
hbase-annotations
hbase-assembly
hbase-checkstyle
hbase-client
hbase-common
hbase-examples
hbase-external-blockcache
hbase-hadoop2-compat
hbase-hadoop-compat
hbase-it
hbase-native-client
hbase-prefix-tree
hbase-procedure
hbase-protocol
hbase-resource-bundle
hbase-rest
hbase-server
hbase-shaded
hbase-shell
hbase-spark
hbase-testing-util
hbase-thrift
LICENSE.txt
NOTICE.txt
pom.xml
README.txt
src
target
++ jps -v
++ grep surefirebooter
++ grep -e -Dhbase.test
++ wc -l
+ ZOMBIE_TESTS_COUNT=0
+ [[ 0 != 0 ]]
+ echo 'We'\''re ok: there is no zombie test'
We're ok: there is no zombie test
POST BUILD TASK : SUCCESS
END OF POST BUILD TASK : 0
Archiving artifacts
Recording test results

Mime
View raw message