hbase-builds mailing list archives

Site index · List index
Message view « Date » · « Thread »
Top « Date » · « Thread »
From Apache Jenkins Server <jenk...@builds.apache.org>
Subject Build failed in Jenkins: HBase-1.2-IT » IntegrationTestAcidGuarantees,latest1.8,Hadoop #323
Date Wed, 02 Dec 2015 21:19:34 GMT
See <https://builds.apache.org/job/HBase-1.2-IT/it.test=IntegrationTestAcidGuarantees,jdk=latest1.8,label=Hadoop/323/changes>

Changes:

[stack]   HBASE-14909 NPE testing for RIT; addendum -- forgot import

[stack] HBASE-14541 TestHFileOutputFormat.testMRIncrementalLoadWithSplit failed

------------------------------------------
[...truncated 2326 lines...]
     bool UseGCLogFileRotation                      = false                              
{product}
     bool UseGCOverheadLimit                        = true                               
{product}
     bool UseGCTaskAffinity                         = false                              
{product}
     bool UseHeavyMonitors                          = false                              
{product}
     bool UseHugeTLBFS                              = false                              
{product}
     bool UseInlineCaches                           = true                               
{product}
     bool UseInterpreter                            = true                               
{product}
     bool UseJumpTables                             = true                               
{C2 product}
     bool UseLWPSynchronization                     = true                               
{product}
     bool UseLargePages                             = false                              
{pd product}
     bool UseLargePagesInMetaspace                  = false                              
{product}
     bool UseLargePagesIndividualAllocation         = false                              
{pd product}
     bool UseLinuxPosixThreadCPUClocks              = true                               
{product}
     bool UseLockedTracing                          = false                              
{product}
     bool UseLoopCounter                            = true                               
{product}
     bool UseLoopInvariantCodeMotion                = true                               
{C1 product}
     bool UseLoopPredicate                          = true                               
{C2 product}
     bool UseMathExactIntrinsics                    = true                               
{C2 product}
     bool UseMaximumCompactionOnSystemGC            = true                               
{product}
     bool UseMembar                                 = false                              
{pd product}
     bool UseMultiplyToLenIntrinsic                 = true                               
{C2 product}
     bool UseNUMA                                   = false                              
{product}
     bool UseNUMAInterleaving                       = false                              
{product}
     bool UseNewLongLShift                          = false                              
{ARCH product}
     bool UseOSErrorReporting                       = false                              
{pd product}
     bool UseOldInlining                            = true                               
{C2 product}
     bool UseOnStackReplacement                     = true                               
{pd product}
     bool UseOnlyInlinedBimorphic                   = true                               
{C2 product}
     bool UseOprofile                               = false                              
{product}
     bool UseOptoBiasInlining                       = true                               
{C2 product}
     bool UsePSAdaptiveSurvivorSizePolicy           = true                               
{product}
     bool UseParNewGC                               = false                              
{product}
     bool UseParallelGC                            := true                               
{product}
     bool UseParallelOldGC                          = true                               
{product}
     bool UsePerfData                               = true                               
{product}
     bool UsePopCountInstruction                    = true                               
{product}
     bool UseRDPCForConstantTableBase               = false                              
{C2 product}
     bool UseRTMDeopt                               = false                              
{ARCH product}
     bool UseRTMLocking                             = false                              
{ARCH product}
     bool UseSHA                                    = false                              
{product}
     bool UseSHA1Intrinsics                         = false                              
{product}
     bool UseSHA256Intrinsics                       = false                              
{product}
     bool UseSHA512Intrinsics                       = false                              
{product}
     bool UseSHM                                    = false                              
{product}
     intx UseSSE                                    = 4                                  
{product}
     bool UseSSE42Intrinsics                        = true                               
{product}
     bool UseSerialGC                               = false                              
{product}
     bool UseSharedSpaces                           = false                              
{product}
     bool UseSignalChaining                         = true                               
{product}
     bool UseStoreImmI16                            = false                              
{ARCH product}
     bool UseStringDeduplication                    = false                              
{product}
     bool UseSuperWord                              = true                               
{C2 product}
     bool UseTLAB                                   = true                               
{pd product}
     bool UseThreadPriorities                       = true                               
{pd product}
     bool UseTransparentHugePages                   = false                              
{product}
     bool UseTypeProfile                            = true                               
{product}
     bool UseTypeSpeculation                        = true                               
{C2 product}
     bool UseUnalignedLoadStores                    = true                               
{ARCH product}
     bool UseVMInterruptibleIO                      = false                              
{product}
     bool UseXMMForArrayCopy                        = true                               
{product}
     bool UseXmmI2D                                 = false                              
{ARCH product}
     bool UseXmmI2F                                 = false                              
{ARCH product}
     bool UseXmmLoadAndClearUpper                   = true                               
{ARCH product}
     bool UseXmmRegToRegMoveAll                     = true                               
{ARCH product}
     bool VMThreadHintNoPreempt                     = false                              
{product}
     intx VMThreadPriority                          = -1                                 
{product}
     intx VMThreadStackSize                         = 1024                               
{pd product}
     intx ValueMapInitialSize                       = 11                                 
{C1 product}
     intx ValueMapMaxLoopSize                       = 8                                  
{C1 product}
     intx ValueSearchLimit                          = 1000                               
{C2 product}
     bool VerifyMergedCPBytecodes                   = true                               
{product}
     bool VerifySharedSpaces                        = false                              
{product}
     intx WorkAroundNPTLTimedWaitHang               = 1                                  
{product}
    uintx YoungGenerationSizeIncrement              = 20                                 
{product}
    uintx YoungGenerationSizeSupplement             = 80                                 
{product}
    uintx YoungGenerationSizeSupplementDecay        = 8                                  
{product}
    uintx YoungPLABSize                             = 4096                               
{product}
     bool ZeroTLAB                                  = false                              
{product}
     intx hashCode                                  = 5                                  
{product}
Running org.apache.hadoop.hbase.IntegrationTestAcidGuarantees
SUREFIRE-859: [GC (Allocation Failure)  193536K->67798K(741888K), 0.1628509 secs]
SUREFIRE-859: [GC (Metadata GC Threshold)  104176K->43454K(935424K), 0.0163892 secs]
SUREFIRE-859: [Full GC (Metadata GC Threshold)  43454K->7745K(731648K), 0.0731637 secs]
SUREFIRE-859: [GC (Metadata GC Threshold)  299152K->88266K(731648K), 0.1806169 secs]
SUREFIRE-859: [Full GC (Metadata GC Threshold)  88266K->85283K(969728K), 0.2373134 secs]
SUREFIRE-859: [GC (Allocation Failure)  472355K->135190K(1127936K), 0.0470226 secs]
SUREFIRE-859: [GC (Allocation Failure)  680470K->137492K(1247744K), 0.0591300 secs]
SUREFIRE-859: [GC (Metadata GC Threshold)  244739K->142410K(1393664K), 0.0683544 secs]
SUREFIRE-859: [Full GC (Metadata GC Threshold)  142410K->103957K(1503744K), 0.3741963 secs]
SUREFIRE-859: [GC (Allocation Failure)  855061K->133333K(1499648K), 0.0551546 secs]
SUREFIRE-859: [GC (Allocation Failure)  884437K->138522K(1812480K), 0.0462253 secs]
SUREFIRE-859: [GC (Allocation Failure)  1242398K->146944K(1854976K), 0.2112137 secs]
SUREFIRE-859: [GC (Allocation Failure)  1258496K->205394K(1967616K), 0.2321231 secs]
SUREFIRE-859: [GC (Allocation Failure)  1434194K->190885K(1973760K), 0.1091458 secs]
SUREFIRE-859: [GC (Allocation Failure)  1419685K->276640K(1912832K), 0.1522312 secs]
SUREFIRE-859: [GC (Allocation Failure)  1445024K->297585K(1929728K), 0.0725674 secs]
SUREFIRE-859: [GC (Allocation Failure)  1465963K->309146K(1907200K), 0.0884549 secs]
SUREFIRE-859: [GC (Allocation Failure)  1430426K->317804K(1903104K), 0.0709508 secs]
Tests run: 3, Failures: 0, Errors: 1, Skipped: 0, Time elapsed: 1,155.055 sec <<<
FAILURE! - in org.apache.hadoop.hbase.IntegrationTestAcidGuarantees
testGetAtomicity(org.apache.hadoop.hbase.IntegrationTestAcidGuarantees)  Time elapsed: 681.235
sec  <<< ERROR!
java.lang.RuntimeException: Deferred
	at org.apache.hadoop.hbase.MultithreadedTestUtil$TestContext.checkException(MultithreadedTestUtil.java:78)
	at org.apache.hadoop.hbase.MultithreadedTestUtil$TestContext.stop(MultithreadedTestUtil.java:105)
	at org.apache.hadoop.hbase.TestAcidGuarantees.runTestAtomicity(TestAcidGuarantees.java:316)
	at org.apache.hadoop.hbase.TestAcidGuarantees.runTestAtomicity(TestAcidGuarantees.java:254)
	at org.apache.hadoop.hbase.IntegrationTestAcidGuarantees.testGetAtomicity(IntegrationTestAcidGuarantees.java:96)
Caused by: org.apache.hadoop.hbase.client.RetriesExhaustedWithDetailsException: Failed 1 action:
FailedServerException: 1 time, 
	at org.apache.hadoop.hbase.client.AsyncProcess$BatchErrors.makeException(AsyncProcess.java:228)
	at org.apache.hadoop.hbase.client.AsyncProcess$BatchErrors.access$1800(AsyncProcess.java:208)
	at org.apache.hadoop.hbase.client.AsyncProcess.waitForAllPreviousOpsAndReset(AsyncProcess.java:1712)
	at org.apache.hadoop.hbase.client.BufferedMutatorImpl.backgroundFlushCommits(BufferedMutatorImpl.java:240)
	at org.apache.hadoop.hbase.client.BufferedMutatorImpl.flush(BufferedMutatorImpl.java:190)
	at org.apache.hadoop.hbase.client.HTable.flushCommits(HTable.java:1430)
	at org.apache.hadoop.hbase.client.HTable.put(HTable.java:1021)
	at org.apache.hadoop.hbase.TestAcidGuarantees$AtomicityWriter.doAnAction(TestAcidGuarantees.java:128)
	at org.apache.hadoop.hbase.MultithreadedTestUtil$RepeatingTestThread.doWork(MultithreadedTestUtil.java:147)
	at org.apache.hadoop.hbase.MultithreadedTestUtil$TestThread.run(MultithreadedTestUtil.java:123)


Results :

Tests in error: 
  IntegrationTestAcidGuarantees.testGetAtomicity:96 » Runtime Deferred

Tests run: 3, Failures: 0, Errors: 1, Skipped: 0

[WARNING] File encoding has not been set, using platform encoding ISO-8859-1, i.e. build is
platform dependent! The file encoding for reports output files should be provided by the POM
property ${project.reporting.outputEncoding}.
[INFO] 
[INFO] --- maven-failsafe-plugin:2.18.1:verify (verify) @ hbase-it ---
[INFO] Failsafe report directory: <https://builds.apache.org/job/HBase-1.2-IT/it.test=IntegrationTestAcidGuarantees,jdk=latest1.8,label=Hadoop/ws/hbase-it/target/failsafe-reports>
[WARNING] File encoding has not been set, using platform encoding ISO-8859-1, i.e. build is
platform dependent! The file encoding for reports output files should be provided by the POM
property ${project.reporting.outputEncoding}.
[INFO] ------------------------------------------------------------------------
[INFO] Reactor Summary:
[INFO] 
[INFO] Apache HBase ...................................... SUCCESS [4.458s]
[INFO] Apache HBase - Checkstyle ......................... SUCCESS [1.587s]
[INFO] Apache HBase - Resource Bundle .................... SUCCESS [0.665s]
[INFO] Apache HBase - Annotations ........................ SUCCESS [2.155s]
[INFO] Apache HBase - Protocol ........................... SUCCESS [24.090s]
[INFO] Apache HBase - Common ............................. SUCCESS [13.383s]
[INFO] Apache HBase - Procedure .......................... SUCCESS [2.471s]
[INFO] Apache HBase - Client ............................. SUCCESS [10.443s]
[INFO] Apache HBase - Hadoop Compatibility ............... SUCCESS [0.667s]
[INFO] Apache HBase - Hadoop Two Compatibility ........... SUCCESS [1.924s]
[INFO] Apache HBase - Prefix Tree ........................ SUCCESS [1.882s]
[INFO] Apache HBase - Server ............................. SUCCESS [50.647s]
[INFO] Apache HBase - Testing Util ....................... SUCCESS [2.346s]
[INFO] Apache HBase - Thrift ............................. SUCCESS [9.696s]
[INFO] Apache HBase - Rest ............................... SUCCESS [4.709s]
[INFO] Apache HBase - Shell .............................. SUCCESS [1.542s]
[INFO] Apache HBase - Integration Tests .................. FAILURE [19:27.672s]
[INFO] Apache HBase - Examples ........................... SKIPPED
[INFO] Apache HBase - External Block Cache ............... SKIPPED
[INFO] Apache HBase - Assembly ........................... SKIPPED
[INFO] Apache HBase - Shaded ............................. SKIPPED
[INFO] Apache HBase - Shaded - Client .................... SKIPPED
[INFO] Apache HBase - Shaded - Server .................... SKIPPED
[INFO] ------------------------------------------------------------------------
[INFO] BUILD FAILURE
[INFO] ------------------------------------------------------------------------
[INFO] Total time: 21:42.690s
[INFO] Finished at: Wed Dec 02 21:19:30 UTC 2015
[INFO] Final Memory: 178M/3043M
[INFO] ------------------------------------------------------------------------
[ERROR] Failed to execute goal org.apache.maven.plugins:maven-failsafe-plugin:2.18.1:verify
(verify) on project hbase-it: There are test failures.
[ERROR] 
[ERROR] Please refer to <https://builds.apache.org/job/HBase-1.2-IT/it.test=IntegrationTestAcidGuarantees,jdk=latest1.8,label=Hadoop/ws/hbase-it/target/failsafe-reports>
for the individual test results.
[ERROR] -> [Help 1]
[ERROR] 
[ERROR] To see the full stack trace of the errors, re-run Maven with the -e switch.
[ERROR] Re-run Maven using the -X switch to enable full debug logging.
[ERROR] 
[ERROR] For more information about the errors and possible solutions, please read the following
articles:
[ERROR] [Help 1] http://cwiki.apache.org/confluence/display/MAVEN/MojoFailureException
[ERROR] 
[ERROR] After correcting the problems, you can resume the build with the command
[ERROR]   mvn <goals> -rf :hbase-it
Build step 'Invoke top-level Maven targets' marked build as failure
Performing Post build task...
Match found for :.* : True
Logical operation result is TRUE
Running script  : # Post-build task script. TODO: Check this in and have all builds reference
check-in.
pwd && ls
# NOTE!!!! The below code has been copied and pasted from ./dev-tools/run-test.sh
# Do not change here without syncing there and vice-versa.
ZOMBIE_TESTS_COUNT=`jps -v | grep surefirebooter | grep -e '-Dhbase.test' | wc -l`
if [[ $ZOMBIE_TESTS_COUNT != 0 ]] ; then
 echo "Suspicious java process found - waiting 30s to see if there are just slow to stop"
 sleep 30
 ZOMBIE_TESTS_COUNT=`jps -v | grep surefirebooter | grep -e '-Dhbase.test' | wc -l`
 if [[ $ZOMBIE_TESTS_COUNT != 0 ]] ; then
   echo " {color:red}There appear to be $ZOMBIE_TESTS_COUNT zombie tests{color}, they should
have been killed by surefire but survived"
   jps -v | grep surefirebooter | grep -e '-Dhbase.test'
   jps -v | grep surefirebooter | grep -e '-Dhbase.test' | cut -d ' ' -f 1 | xargs -n 1 jstack
   # Exit with error
   exit 1
 else
   echo "We're ok: there is no zombie test, but some tests took some time to stop"
 fi
else
  echo "We're ok: there is no zombie test"
fi
[Hadoop] $ /bin/bash -xe /tmp/hudson5000446007447085884.sh
+ pwd
<https://builds.apache.org/job/HBase-1.2-IT/it.test=IntegrationTestAcidGuarantees,jdk=latest1.8,label=Hadoop/ws/>
+ ls
bin
CHANGES.txt
conf
dev-support
hbase-annotations
hbase-assembly
hbase-checkstyle
hbase-client
hbase-common
hbase-examples
hbase-external-blockcache
hbase-hadoop2-compat
hbase-hadoop-compat
hbase-it
hbase-native-client
hbase-prefix-tree
hbase-procedure
hbase-protocol
hbase-resource-bundle
hbase-rest
hbase-server
hbase-shaded
hbase-shell
hbase-spark
hbase-testing-util
hbase-thrift
LICENSE.txt
NOTICE.txt
pom.xml
README.txt
src
target
++ jps -v
++ grep surefirebooter
++ wc -l
++ grep -e -Dhbase.test
+ ZOMBIE_TESTS_COUNT=0
+ [[ 0 != 0 ]]
+ echo 'We'\''re ok: there is no zombie test'
We're ok: there is no zombie test
POST BUILD TASK : SUCCESS
END OF POST BUILD TASK : 0
Archiving artifacts

Mime
View raw message