hbase-builds mailing list archives

Site index · List index
Message view « Date » · « Thread »
Top « Date » · « Thread »
From Apache Jenkins Server <jenk...@builds.apache.org>
Subject Build failed in Jenkins: HBase-1.3 » latest1.8,yahoo-not-h2 #539
Date Fri, 05 Feb 2016 17:58:57 GMT
See <https://builds.apache.org/job/HBase-1.3/jdk=latest1.8,label=yahoo-not-h2/539/changes>

Changes:

[tedyu] HBASE-11262 Avoid empty columns while doing bulk-load (Ashish Kumar)

------------------------------------------
[...truncated 42990 lines...]
25/25 KB   5/5 KB   79/246 KB   224/281 KB   4/20 KB   
25/25 KB   5/5 KB   83/246 KB   224/281 KB   4/20 KB   
25/25 KB   5/5 KB   83/246 KB   228/281 KB   4/20 KB   
25/25 KB   5/5 KB   83/246 KB   228/281 KB   8/20 KB   
25/25 KB   5/5 KB   87/246 KB   232/281 KB   8/20 KB   
25/25 KB   5/5 KB   87/246 KB   232/281 KB   8/20 KB   
25/25 KB   5/5 KB   87/246 KB   232/281 KB   12/20 KB   
25/25 KB   5/5 KB   91/246 KB   232/281 KB   12/20 KB   
25/25 KB   5/5 KB   91/246 KB   236/281 KB   16/20 KB   
25/25 KB   5/5 KB   91/246 KB   236/281 KB   16/20 KB   
25/25 KB   5/5 KB   95/246 KB   236/281 KB   16/20 KB   
25/25 KB   5/5 KB   95/246 KB   240/281 KB   16/20 KB   
25/25 KB   5/5 KB   95/246 KB   240/281 KB   20/20 KB   
25/25 KB   5/5 KB   99/246 KB   240/281 KB   20/20 KB   
25/25 KB   5/5 KB   99/246 KB   244/281 KB   20/20 KB   
25/25 KB   5/5 KB   99/246 KB   244/281 KB   20/20 KB   
25/25 KB   5/5 KB   103/246 KB   244/281 KB   20/20 KB   
25/25 KB   5/5 KB   103/246 KB   248/281 KB   20/20 KB   
25/25 KB   5/5 KB   107/246 KB   248/281 KB   20/20 KB   
25/25 KB   5/5 KB   107/246 KB   252/281 KB   20/20 KB   
25/25 KB   5/5 KB   111/246 KB   252/281 KB   20/20 KB   
25/25 KB   5/5 KB   111/246 KB   256/281 KB   20/20 KB   
25/25 KB   5/5 KB   111/246 KB   260/281 KB   20/20 KB   
25/25 KB   5/5 KB   111/246 KB   264/281 KB   20/20 KB   
25/25 KB   5/5 KB   115/246 KB   264/281 KB   20/20 KB   
25/25 KB   5/5 KB   115/246 KB   268/281 KB   20/20 KB   
25/25 KB   5/5 KB   119/246 KB   268/281 KB   20/20 KB   
25/25 KB   5/5 KB   119/246 KB   272/281 KB   20/20 KB   
25/25 KB   5/5 KB   123/246 KB   272/281 KB   20/20 KB   
25/25 KB   5/5 KB   123/246 KB   276/281 KB   20/20 KB   
25/25 KB   5/5 KB   127/246 KB   276/281 KB   20/20 KB   
25/25 KB   5/5 KB   127/246 KB   280/281 KB   20/20 KB   
25/25 KB   5/5 KB   131/246 KB   280/281 KB   20/20 KB   
25/25 KB   5/5 KB   131/246 KB   281/281 KB   20/20 KB   
25/25 KB   5/5 KB   135/246 KB   281/281 KB   20/20 KB   
25/25 KB   5/5 KB   139/246 KB   281/281 KB   20/20 KB   
25/25 KB   5/5 KB   143/246 KB   281/281 KB   20/20 KB   
25/25 KB   5/5 KB   147/246 KB   281/281 KB   20/20 KB   
25/25 KB   5/5 KB   151/246 KB   281/281 KB   20/20 KB   
25/25 KB   5/5 KB   155/246 KB   281/281 KB   20/20 KB   
25/25 KB   5/5 KB   159/246 KB   281/281 KB   20/20 KB   
25/25 KB   5/5 KB   163/246 KB   281/281 KB   20/20 KB   
25/25 KB   5/5 KB   167/246 KB   281/281 KB   20/20 KB   
25/25 KB   5/5 KB   171/246 KB   281/281 KB   20/20 KB   
25/25 KB   5/5 KB   175/246 KB   281/281 KB   20/20 KB   
25/25 KB   5/5 KB   179/246 KB   281/281 KB   20/20 KB   
25/25 KB   5/5 KB   183/246 KB   281/281 KB   20/20 KB   
25/25 KB   5/5 KB   187/246 KB   281/281 KB   20/20 KB   
25/25 KB   5/5 KB   191/246 KB   281/281 KB   20/20 KB   
25/25 KB   5/5 KB   195/246 KB   281/281 KB   20/20 KB   
25/25 KB   5/5 KB   199/246 KB   281/281 KB   20/20 KB   
25/25 KB   5/5 KB   203/246 KB   281/281 KB   20/20 KB   
25/25 KB   5/5 KB   207/246 KB   281/281 KB   20/20 KB   
25/25 KB   5/5 KB   211/246 KB   281/281 KB   20/20 KB   
25/25 KB   5/5 KB   215/246 KB   281/281 KB   20/20 KB   
25/25 KB   5/5 KB   219/246 KB   281/281 KB   20/20 KB   
25/25 KB   5/5 KB   223/246 KB   281/281 KB   20/20 KB   
25/25 KB   5/5 KB   227/246 KB   281/281 KB   20/20 KB   
25/25 KB   5/5 KB   231/246 KB   281/281 KB   20/20 KB   
25/25 KB   5/5 KB   235/246 KB   281/281 KB   20/20 KB   
25/25 KB   5/5 KB   239/246 KB   281/281 KB   20/20 KB   
25/25 KB   5/5 KB   243/246 KB   281/281 KB   20/20 KB   
25/25 KB   5/5 KB   246/246 KB   281/281 KB   20/20 KB   
                                                         
Downloaded: http://repo.maven.apache.org/maven2/org/jamon/jamon-api/2.3.0/jamon-api-2.3.0.jar
(5 KB at 66.1 KB/sec)
                                                         
Downloaded: http://repo.maven.apache.org/maven2/org/jamon/jamon-runtime/2.4.0/jamon-runtime-2.4.0.jar
(25 KB at 347.3 KB/sec)
                                                         
Downloaded: http://repo.maven.apache.org/maven2/org/codehaus/plexus/plexus-compiler-api/1.8.1/plexus-compiler-api-1.8.1.jar
(20 KB at 274.6 KB/sec)
                                                         
Downloaded: http://repo.maven.apache.org/maven2/org/jamon/jamon-processor/2.4.1/jamon-processor-2.4.1.jar
(281 KB at 3741.0 KB/sec)
                                                         
Downloaded: http://repo.maven.apache.org/maven2/org/codehaus/plexus/plexus-utils/1.5.5/plexus-utils-1.5.5.jar
(246 KB at 3271.8 KB/sec)
[INFO] Translating 10 templates from <https://builds.apache.org/job/HBase-1.3/jdk=latest1.8,label=yahoo-not-h2/ws/hbase-server/src/main/jamon>
to <https://builds.apache.org/job/HBase-1.3/jdk=latest1.8,label=yahoo-not-h2/ws/hbase-server/target/generated-jamon>
[INFO] 
[INFO] --- maven-antrun-plugin:1.6:run (generate) @ hbase-server ---
[INFO] Executing tasks

main:
    [mkdir] Created dir: <https://builds.apache.org/job/HBase-1.3/jdk=latest1.8,label=yahoo-not-h2/ws/hbase-server/target/hbase-webapps>
     [copy] Copying 20 files to <https://builds.apache.org/job/HBase-1.3/jdk=latest1.8,label=yahoo-not-h2/ws/hbase-server/target/hbase-webapps>
log4j:WARN No appenders could be found for logger (org.mortbay.log).
log4j:WARN Please initialize the log4j system properly.
log4j:WARN See http://logging.apache.org/log4j/1.2/faq.html#noconfig for more info.
    [mkdir] Created dir: <https://builds.apache.org/job/HBase-1.3/jdk=latest1.8,label=yahoo-not-h2/ws/hbase-server/target/hbase-webapps/master/WEB-INF>
    [mkdir] Created dir: <https://builds.apache.org/job/HBase-1.3/jdk=latest1.8,label=yahoo-not-h2/ws/hbase-server/target/hbase-webapps/regionserver/WEB-INF>
[INFO] Executed tasks
[INFO] 
[INFO] --- maven-remote-resources-plugin:1.5:process (default) @ hbase-server ---
[INFO] 
[INFO] --- maven-resources-plugin:2.6:resources (default-resources) @ hbase-server ---
[INFO] Using 'UTF-8' encoding to copy filtered resources.
[INFO] Copying 22 resources
[INFO] Copying 2 resources
[INFO] 
[INFO] --- maven-compiler-plugin:2.5.1:compile (default-compile) @ hbase-server ---
[INFO] Compiling 808 source files to <https://builds.apache.org/job/HBase-1.3/jdk=latest1.8,label=yahoo-not-h2/ws/hbase-server/target/classes>
[WARNING] <https://builds.apache.org/job/HBase-1.3/jdk=latest1.8,label=yahoo-not-h2/ws/hbase-server/src/main/java/org/apache/hadoop/hbase/regionserver/HRegionServer.java>:[196,15]
Signal is internal proprietary API and may be removed in a future release
[WARNING] <https://builds.apache.org/job/HBase-1.3/jdk=latest1.8,label=yahoo-not-h2/ws/hbase-server/src/main/java/org/apache/hadoop/hbase/regionserver/HRegionServer.java>:[197,15]
SignalHandler is internal proprietary API and may be removed in a future release
[WARNING] <https://builds.apache.org/job/HBase-1.3/jdk=latest1.8,label=yahoo-not-h2/ws/hbase-server/src/main/java/org/apache/hadoop/hbase/regionserver/HRegionServer.java>:[617,24]
Signal is internal proprietary API and may be removed in a future release
[WARNING] <https://builds.apache.org/job/HBase-1.3/jdk=latest1.8,label=yahoo-not-h2/ws/hbase-server/src/main/java/org/apache/hadoop/hbase/regionserver/HRegionServer.java>:[617,43]
SignalHandler is internal proprietary API and may be removed in a future release
[WARNING] <https://builds.apache.org/job/HBase-1.3/jdk=latest1.8,label=yahoo-not-h2/ws/hbase-server/src/main/java/org/apache/hadoop/hbase/regionserver/HRegionServer.java>:[618,27]
Signal is internal proprietary API and may be removed in a future release
[WARNING] <https://builds.apache.org/job/HBase-1.3/jdk=latest1.8,label=yahoo-not-h2/ws/hbase-server/src/main/java/org/apache/hadoop/hbase/regionserver/HRegionServer.java>:[617,6]
Signal is internal proprietary API and may be removed in a future release
[INFO] 
[INFO] --- maven-dependency-plugin:2.1:build-classpath (create-mrapp-generated-classpath)
@ hbase-server ---
[INFO] Wrote classpath file '<https://builds.apache.org/job/HBase-1.3/jdk=latest1.8,label=yahoo-not-h2/ws/hbase-server/target/test-classes/mrapp-generated-classpath'.>
[INFO] 
[INFO] --- maven-resources-plugin:2.6:testResources (default-testResources) @ hbase-server
---
[INFO] Using 'UTF-8' encoding to copy filtered resources.
[INFO] Copying 1 resource to META-INF/
[INFO] Copying 16 resources
[INFO] 
[INFO] --- maven-compiler-plugin:2.5.1:testCompile (default-testCompile) @ hbase-server ---
[INFO] Compiling 748 source files to <https://builds.apache.org/job/HBase-1.3/jdk=latest1.8,label=yahoo-not-h2/ws/hbase-server/target/test-classes>
[INFO] -------------------------------------------------------------
[ERROR] COMPILATION ERROR : 
[INFO] -------------------------------------------------------------
[ERROR] <https://builds.apache.org/job/HBase-1.3/jdk=latest1.8,label=yahoo-not-h2/ws/hbase-server/src/test/java/org/apache/hadoop/hbase/mapreduce/TestImportTsv.java>:[371,63]
error: cannot find symbol
[ERROR]   symbol:   variable tn
  location: class TestImportTsv
<https://builds.apache.org/job/HBase-1.3/jdk=latest1.8,label=yahoo-not-h2/ws/hbase-server/src/test/java/org/apache/hadoop/hbase/mapreduce/TestImportTsv.java>:[378,26]
error: cannot find symbol
[ERROR]   symbol:   variable tn
  location: class TestImportTsv
<https://builds.apache.org/job/HBase-1.3/jdk=latest1.8,label=yahoo-not-h2/ws/hbase-server/src/test/java/org/apache/hadoop/hbase/mapreduce/TestImportTsv.java>:[379,21]
error: cannot find symbol
[INFO] 3 errors 
[INFO] -------------------------------------------------------------
[INFO] ------------------------------------------------------------------------
[INFO] Reactor Summary:
[INFO] 
[INFO] Apache HBase ...................................... SUCCESS [1:11.193s]
[INFO] Apache HBase - Checkstyle ......................... SUCCESS [6.655s]
[INFO] Apache HBase - Resource Bundle .................... SUCCESS [0.387s]
[INFO] Apache HBase - Annotations ........................ SUCCESS [2.567s]
[INFO] Apache HBase - Protocol ........................... SUCCESS [31.873s]
[INFO] Apache HBase - Common ............................. SUCCESS [3:20.743s]
[INFO] Apache HBase - Procedure .......................... SUCCESS [4:17.248s]
[INFO] Apache HBase - Client ............................. SUCCESS [1:30.364s]
[INFO] Apache HBase - Hadoop Compatibility ............... SUCCESS [9.435s]
[INFO] Apache HBase - Hadoop Two Compatibility ........... SUCCESS [12.157s]
[INFO] Apache HBase - Prefix Tree ........................ SUCCESS [11.101s]
[INFO] Apache HBase - Server ............................. FAILURE [40.000s]
[INFO] Apache HBase - Testing Util ....................... SKIPPED
[INFO] Apache HBase - Thrift ............................. SKIPPED
[INFO] Apache HBase - Rest ............................... SKIPPED
[INFO] Apache HBase - Shell .............................. SKIPPED
[INFO] Apache HBase - Integration Tests .................. SKIPPED
[INFO] Apache HBase - Examples ........................... SKIPPED
[INFO] Apache HBase - External Block Cache ............... SKIPPED
[INFO] Apache HBase - Assembly ........................... SKIPPED
[INFO] Apache HBase - Shaded ............................. SKIPPED
[INFO] Apache HBase - Shaded - Client .................... SKIPPED
[INFO] Apache HBase - Shaded - Server .................... SKIPPED
[INFO] ------------------------------------------------------------------------
[INFO] BUILD FAILURE
[INFO] ------------------------------------------------------------------------
[INFO] Total time: 12:36.678s
[INFO] Finished at: Fri Feb 05 17:58:25 UTC 2016
[INFO] Final Memory: 115M/2126M
[INFO] ------------------------------------------------------------------------
[ERROR] Failed to execute goal org.apache.maven.plugins:maven-compiler-plugin:2.5.1:testCompile
(default-testCompile) on project hbase-server: Compilation failure: Compilation failure:
[ERROR] <https://builds.apache.org/job/HBase-1.3/jdk=latest1.8,label=yahoo-not-h2/ws/hbase-server/src/test/java/org/apache/hadoop/hbase/mapreduce/TestImportTsv.java>:[371,63]
error: cannot find symbol
[ERROR] symbol:   variable tn
[ERROR] location: class TestImportTsv
[ERROR] <https://builds.apache.org/job/HBase-1.3/jdk=latest1.8,label=yahoo-not-h2/ws/hbase-server/src/test/java/org/apache/hadoop/hbase/mapreduce/TestImportTsv.java>:[378,26]
error: cannot find symbol
[ERROR] symbol:   variable tn
[ERROR] location: class TestImportTsv
[ERROR] <https://builds.apache.org/job/HBase-1.3/jdk=latest1.8,label=yahoo-not-h2/ws/hbase-server/src/test/java/org/apache/hadoop/hbase/mapreduce/TestImportTsv.java>:[379,21]
error: cannot find symbol
[ERROR] -> [Help 1]
[ERROR] 
[ERROR] To see the full stack trace of the errors, re-run Maven with the -e switch.
[ERROR] Re-run Maven using the -X switch to enable full debug logging.
[ERROR] 
[ERROR] For more information about the errors and possible solutions, please read the following
articles:
[ERROR] [Help 1] http://cwiki.apache.org/confluence/display/MAVEN/MojoFailureException
[ERROR] 
[ERROR] After correcting the problems, you can resume the build with the command
[ERROR]   mvn <goals> -rf :hbase-server
Build step 'Invoke top-level Maven targets' marked build as failure
Performing Post build task...
Match found for :.* : True
Logical operation result is TRUE
Running script  : # Post-build task script. TODO: Check this in and have all builds reference
check-in.
pwd && ls
# NOTE!!!! The below code has been copied and pasted from ./dev-tools/run-test.sh
# Do not change here without syncing there and vice-versa.
ZOMBIE_TESTS_COUNT=`jps -v | grep surefirebooter | grep -e '-Dhbase.test' | wc -l`
if [[ $ZOMBIE_TESTS_COUNT != 0 ]] ; then
 echo "Suspicious java process found - waiting 30s to see if there are just slow to stop"
 sleep 30
 ZOMBIE_TESTS_COUNT=`jps -v | grep surefirebooter | grep -e '-Dhbase.test' | wc -l`
 if [[ $ZOMBIE_TESTS_COUNT != 0 ]] ; then
   echo " {color:red}There appear to be $ZOMBIE_TESTS_COUNT zombie tests{color}, they should
have been killed by surefire but survived"
   jps -v | grep surefirebooter | grep -e '-Dhbase.test'
   jps -v | grep surefirebooter | grep -e '-Dhbase.test' | cut -d ' ' -f 1 | xargs -n 1 jstack
   # Exit with error
   exit 1
 else
   echo "We're ok: there is no zombie test, but some tests took some time to stop"
 fi
else
  echo "We're ok: there is no zombie test"
fi
[yahoo-not-h2] $ /bin/bash -xe /tmp/hudson1898660957392912669.sh
+ pwd
<https://builds.apache.org/job/HBase-1.3/jdk=latest1.8,label=yahoo-not-h2/ws/>
+ ls
bin
CHANGES.txt
conf
dev-support
hbase-annotations
hbase-assembly
hbase-checkstyle
hbase-client
hbase-common
hbase-examples
hbase-external-blockcache
hbase-hadoop2-compat
hbase-hadoop-compat
hbase-it
hbase-native-client
hbase-prefix-tree
hbase-procedure
hbase-protocol
hbase-resource-bundle
hbase-rest
hbase-server
hbase-shaded
hbase-shell
hbase-testing-util
hbase-thrift
LICENSE.txt
NOTICE.txt
pom.xml
README.txt
src
target
++ jps -v
++ grep surefirebooter
++ grep -e -Dhbase.test
++ wc -l
+ ZOMBIE_TESTS_COUNT=0
+ [[ 0 != 0 ]]
+ echo 'We'\''re ok: there is no zombie test'
We're ok: there is no zombie test
POST BUILD TASK : SUCCESS
END OF POST BUILD TASK : 0
Archiving artifacts
Recording test results

Mime
View raw message