hbase-builds mailing list archives

Site index · List index
Message view « Date » · « Thread »
Top « Date » · « Thread »
From Apache Jenkins Server <jenk...@builds.apache.org>
Subject Build failed in Jenkins: HBase-Trunk_matrix » latest1.7,yahoo-not-h2 #819
Date Fri, 01 Apr 2016 03:57:04 GMT
See <https://builds.apache.org/job/HBase-Trunk_matrix/jdk=latest1.7,label=yahoo-not-h2/819/changes>

Changes:

[tedyu] HBASE-15571 Make MasterProcedureManagerHost accessible through

------------------------------------------
[...truncated 5552 lines...]
Tests run: 1, Failures: 0, Errors: 0, Skipped: 0, Time elapsed: 15.603 sec - in org.apache.hadoop.hbase.TestHBaseOnOtherDfsCluster
Running org.apache.hadoop.hbase.security.access.TestZKPermissionsWatcher
Running org.apache.hadoop.hbase.security.access.TestScanEarlyTermination
Tests run: 1, Failures: 0, Errors: 0, Skipped: 0, Time elapsed: 4.301 sec - in org.apache.hadoop.hbase.security.access.TestZKPermissionsWatcher
Running org.apache.hadoop.hbase.security.access.TestAccessControlFilter
Tests run: 1, Failures: 0, Errors: 0, Skipped: 0, Time elapsed: 6.157 sec - in org.apache.hadoop.hbase.security.access.TestScanEarlyTermination
Tests run: 1, Failures: 0, Errors: 0, Skipped: 0, Time elapsed: 2.986 sec - in org.apache.hadoop.hbase.security.access.TestAccessControlFilter
Running org.apache.hadoop.hbase.security.access.TestWithDisabledAuthorization
Running org.apache.hadoop.hbase.security.access.TestCellACLs
Running org.apache.hadoop.hbase.security.access.TestTablePermissions
Tests run: 2, Failures: 0, Errors: 0, Skipped: 0, Time elapsed: 13.603 sec - in org.apache.hadoop.hbase.security.access.TestCellACLs
Tests run: 7, Failures: 0, Errors: 0, Skipped: 0, Time elapsed: 15.941 sec - in org.apache.hadoop.hbase.security.access.TestTablePermissions
Running org.apache.hadoop.hbase.security.access.TestCellACLWithMultipleVersions
Tests run: 6, Failures: 0, Errors: 0, Skipped: 0, Time elapsed: 32.659 sec - in org.apache.hadoop.hbase.security.access.TestWithDisabledAuthorization
Running org.apache.hadoop.hbase.security.access.TestAccessController
Tests run: 8, Failures: 0, Errors: 0, Skipped: 0, Time elapsed: 50.406 sec - in org.apache.hadoop.hbase.security.access.TestCellACLWithMultipleVersions
Running org.apache.hadoop.hbase.security.access.TestAccessController2
Tests run: 9, Failures: 0, Errors: 0, Skipped: 0, Time elapsed: 290.26 sec - in org.apache.hadoop.hbase.snapshot.TestMobExportSnapshot
Tests run: 64, Failures: 0, Errors: 0, Skipped: 0, Time elapsed: 65.754 sec - in org.apache.hadoop.hbase.security.access.TestAccessController
Running org.apache.hadoop.hbase.security.token.TestZKSecretWatcher
Tests run: 1, Failures: 0, Errors: 0, Skipped: 0, Time elapsed: 13.214 sec - in org.apache.hadoop.hbase.security.token.TestZKSecretWatcher
Tests run: 6, Failures: 0, Errors: 0, Skipped: 0, Time elapsed: 48.516 sec - in org.apache.hadoop.hbase.security.access.TestAccessController2
Running org.apache.hadoop.hbase.security.token.TestTokenAuthentication
Tests run: 3, Failures: 0, Errors: 0, Skipped: 0, Time elapsed: 0.575 sec - in org.apache.hadoop.hbase.security.token.TestTokenAuthentication
Running org.apache.hadoop.hbase.security.token.TestGenerateDelegationToken
Running org.apache.hadoop.hbase.security.visibility.TestEnforcingScanLabelGenerator
Tests run: 1, Failures: 0, Errors: 0, Skipped: 0, Time elapsed: 2.455 sec - in org.apache.hadoop.hbase.security.token.TestGenerateDelegationToken
Tests run: 1, Failures: 0, Errors: 0, Skipped: 0, Time elapsed: 3.071 sec - in org.apache.hadoop.hbase.security.visibility.TestEnforcingScanLabelGenerator
Running org.apache.hadoop.hbase.security.visibility.TestVisibilityWithCheckAuths
Running org.apache.hadoop.hbase.security.visibility.TestVisibilityLabelsWithSLGStack
Tests run: 2, Failures: 0, Errors: 0, Skipped: 0, Time elapsed: 4.362 sec - in org.apache.hadoop.hbase.security.visibility.TestVisibilityWithCheckAuths
Tests run: 1, Failures: 0, Errors: 0, Skipped: 0, Time elapsed: 2.536 sec - in org.apache.hadoop.hbase.security.visibility.TestVisibilityLabelsWithSLGStack
Running org.apache.hadoop.hbase.security.visibility.TestVisibilityLablesWithGroups
Tests run: 1, Failures: 0, Errors: 0, Skipped: 0, Time elapsed: 2.665 sec - in org.apache.hadoop.hbase.security.visibility.TestVisibilityLablesWithGroups
Running org.apache.hadoop.hbase.security.visibility.TestWithDisabledAuthorization
Tests run: 2, Failures: 0, Errors: 0, Skipped: 0, Time elapsed: 3.131 sec - in org.apache.hadoop.hbase.security.visibility.TestWithDisabledAuthorization
Running org.apache.hadoop.hbase.security.visibility.TestVisibilityLabelsOpWithDifferentUsersNoACL
Tests run: 1, Failures: 0, Errors: 0, Skipped: 0, Time elapsed: 1.53 sec - in org.apache.hadoop.hbase.security.visibility.TestVisibilityLabelsOpWithDifferentUsersNoACL
Running org.apache.hadoop.hbase.security.visibility.TestDefaultScanLabelGeneratorStack
Tests run: 1, Failures: 0, Errors: 0, Skipped: 0, Time elapsed: 2.696 sec - in org.apache.hadoop.hbase.security.visibility.TestDefaultScanLabelGeneratorStack
Running org.apache.hadoop.hbase.security.visibility.TestVisibilityLabelsWithDefaultVisLabelService
Tests run: 26, Failures: 0, Errors: 0, Skipped: 0, Time elapsed: 33.624 sec - in org.apache.hadoop.hbase.security.visibility.TestVisibilityLabelsWithDefaultVisLabelService
Running org.apache.hadoop.hbase.security.visibility.TestVisibilityLabelsWithDeletes
Running org.apache.hadoop.hbase.security.access.TestAccessController3
Tests run: 1, Failures: 0, Errors: 0, Skipped: 0, Time elapsed: 5.249 sec - in org.apache.hadoop.hbase.security.access.TestAccessController3
Running org.apache.hadoop.hbase.security.visibility.TestVisibilityLabelsWithACL
Running org.apache.hadoop.hbase.security.visibility.TestVisibilityLabelsWithCustomVisLabService
Tests run: 21, Failures: 0, Errors: 0, Skipped: 0, Time elapsed: 28.062 sec - in org.apache.hadoop.hbase.security.visibility.TestVisibilityLabelsWithCustomVisLabService
Running org.apache.hadoop.hbase.security.visibility.TestVisibilityLabelsReplication
Tests run: 1, Failures: 0, Errors: 0, Skipped: 0, Time elapsed: 23.025 sec - in org.apache.hadoop.hbase.security.visibility.TestVisibilityLabelsReplication
Running org.apache.hadoop.hbase.security.visibility.TestVisibilityLabelReplicationWithExpAsString
Tests run: 44, Failures: 0, Errors: 0, Skipped: 0, Time elapsed: 87.744 sec - in org.apache.hadoop.hbase.security.visibility.TestVisibilityLabelsWithDeletes
Running org.apache.hadoop.hbase.fs.TestBlockReorder
Tests run: 1, Failures: 0, Errors: 0, Skipped: 0, Time elapsed: 22.175 sec - in org.apache.hadoop.hbase.security.visibility.TestVisibilityLabelReplicationWithExpAsString
Tests run: 3, Failures: 0, Errors: 0, Skipped: 0, Time elapsed: 22.415 sec - in org.apache.hadoop.hbase.fs.TestBlockReorder
Running org.apache.hadoop.hbase.TestInfoServers
Tests run: 3, Failures: 0, Errors: 0, Skipped: 0, Time elapsed: 3.348 sec - in org.apache.hadoop.hbase.TestInfoServers
Running org.apache.hadoop.hbase.wal.TestWALFactory
Running org.apache.hadoop.hbase.wal.TestDefaultWALProviderWithHLogKey
Tests run: 5, Failures: 0, Errors: 0, Skipped: 0, Time elapsed: 8.476 sec - in org.apache.hadoop.hbase.wal.TestDefaultWALProviderWithHLogKey
Running org.apache.hadoop.hbase.wal.TestWALReaderOnSecureWAL
Tests run: 9, Failures: 0, Errors: 0, Skipped: 0, Time elapsed: 15.506 sec - in org.apache.hadoop.hbase.wal.TestWALFactory
Tests run: 2, Failures: 0, Errors: 0, Skipped: 0, Time elapsed: 1.71 sec - in org.apache.hadoop.hbase.wal.TestWALReaderOnSecureWAL
Running org.apache.hadoop.hbase.wal.TestSecureWAL
Running org.apache.hadoop.hbase.wal.TestWALSplit
Tests run: 2, Failures: 0, Errors: 0, Skipped: 0, Time elapsed: 2.12 sec - in org.apache.hadoop.hbase.wal.TestSecureWAL
Running org.apache.hadoop.hbase.wal.TestBoundedRegionGroupingStrategy
Tests run: 5, Failures: 0, Errors: 0, Skipped: 0, Time elapsed: 23.768 sec - in org.apache.hadoop.hbase.wal.TestBoundedRegionGroupingStrategy
Running org.apache.hadoop.hbase.wal.TestWALFiltering
Running org.apache.hadoop.hbase.wal.TestDefaultWALProvider
Tests run: 5, Failures: 0, Errors: 0, Skipped: 0, Time elapsed: 8.647 sec - in org.apache.hadoop.hbase.wal.TestDefaultWALProvider
Tests run: 1, Failures: 0, Errors: 0, Skipped: 0, Time elapsed: 26.666 sec - in org.apache.hadoop.hbase.wal.TestWALFiltering
Running org.apache.hadoop.hbase.wal.TestWALSplitCompressed
Running org.apache.hadoop.hbase.backup.TestHFileArchiving
Tests run: 32, Failures: 0, Errors: 0, Skipped: 0, Time elapsed: 80.209 sec - in org.apache.hadoop.hbase.wal.TestWALSplit
Running org.apache.hadoop.hbase.backup.example.TestZooKeeperTableArchiveClient
Tests run: 3, Failures: 0, Errors: 0, Skipped: 0, Time elapsed: 3.766 sec - in org.apache.hadoop.hbase.backup.example.TestZooKeeperTableArchiveClient
Running org.apache.hadoop.hbase.zookeeper.TestHQuorumPeer
Tests run: 3, Failures: 0, Errors: 0, Skipped: 0, Time elapsed: 0.752 sec - in org.apache.hadoop.hbase.zookeeper.TestHQuorumPeer
Running org.apache.hadoop.hbase.security.access.TestNamespaceCommands
Running org.apache.hadoop.hbase.zookeeper.lock.TestZKInterProcessReadWriteLock
Tests run: 6, Failures: 0, Errors: 0, Skipped: 0, Time elapsed: 24.493 sec - in org.apache.hadoop.hbase.zookeeper.lock.TestZKInterProcessReadWriteLock
Running org.apache.hadoop.hbase.zookeeper.TestRecoverableZooKeeper
Tests run: 1, Failures: 0, Errors: 0, Skipped: 0, Time elapsed: 1.195 sec - in org.apache.hadoop.hbase.zookeeper.TestRecoverableZooKeeper
Running org.apache.hadoop.hbase.zookeeper.TestZKLeaderManager
Tests run: 1, Failures: 0, Errors: 0, Skipped: 0, Time elapsed: 0.104 sec - in org.apache.hadoop.hbase.zookeeper.TestZKLeaderManager
Running org.apache.hadoop.hbase.zookeeper.TestZooKeeperACL
Tests run: 7, Failures: 0, Errors: 0, Skipped: 0, Time elapsed: 0.39 sec - in org.apache.hadoop.hbase.zookeeper.TestZooKeeperACL
Running org.apache.hadoop.hbase.zookeeper.TestZooKeeperNodeTracker
Tests run: 3, Failures: 0, Errors: 0, Skipped: 0, Time elapsed: 0.913 sec - in org.apache.hadoop.hbase.zookeeper.TestZooKeeperNodeTracker
Running org.apache.hadoop.hbase.zookeeper.TestZKMulti
Tests run: 12, Failures: 0, Errors: 0, Skipped: 0, Time elapsed: 1.784 sec - in org.apache.hadoop.hbase.zookeeper.TestZKMulti
Tests run: 32, Failures: 0, Errors: 0, Skipped: 0, Time elapsed: 83.477 sec - in org.apache.hadoop.hbase.wal.TestWALSplitCompressed
Running org.apache.hadoop.hbase.TestPartialResultsFromClientSide
Running org.apache.hadoop.hbase.mapreduce.TestTableInputFormatScan2
Tests run: 5, Failures: 0, Errors: 0, Skipped: 0, Time elapsed: 94.554 sec - in org.apache.hadoop.hbase.backup.TestHFileArchiving
Running org.apache.hadoop.hbase.mapreduce.TestTableMapReduce
Tests run: 7, Failures: 0, Errors: 0, Skipped: 0, Time elapsed: 35.599 sec - in org.apache.hadoop.hbase.mapreduce.TestTableInputFormatScan2
Running org.apache.hadoop.hbase.mapreduce.TestHLogRecordReader
Tests run: 2, Failures: 0, Errors: 0, Skipped: 0, Time elapsed: 1.829 sec - in org.apache.hadoop.hbase.mapreduce.TestHLogRecordReader
Tests run: 2, Failures: 0, Errors: 0, Skipped: 0, Time elapsed: 28.506 sec - in org.apache.hadoop.hbase.mapreduce.TestTableMapReduce
Running org.apache.hadoop.hbase.mapreduce.TestHashTable
Running org.apache.hadoop.hbase.mapreduce.TestImportExport
Tests run: 1, Failures: 0, Errors: 0, Skipped: 0, Time elapsed: 13.783 sec - in org.apache.hadoop.hbase.mapreduce.TestHashTable
Tests run: 18, Failures: 0, Errors: 0, Skipped: 0, Time elapsed: 75.558 sec - in org.apache.hadoop.hbase.TestPartialResultsFromClientSide
Running org.apache.hadoop.hbase.mapreduce.TestWALPlayer
Tests run: 5, Failures: 0, Errors: 0, Skipped: 0, Time elapsed: 369.763 sec - in org.apache.hadoop.hbase.security.visibility.TestVisibilityLabelsWithACL
Running org.apache.hadoop.hbase.mapreduce.TestMultiTableSnapshotInputFormat
Tests run: 4, Failures: 0, Errors: 0, Skipped: 0, Time elapsed: 9.628 sec - in org.apache.hadoop.hbase.mapreduce.TestWALPlayer
Running org.apache.hadoop.hbase.mapreduce.TestSyncTable
Running org.apache.hadoop.hbase.mapreduce.TestCopyTable
Tests run: 1, Failures: 0, Errors: 0, Skipped: 0, Time elapsed: 25.625 sec - in org.apache.hadoop.hbase.mapreduce.TestSyncTable
Tests run: 4, Failures: 0, Errors: 0, Skipped: 0, Time elapsed: 35.609 sec - in org.apache.hadoop.hbase.mapreduce.TestMultiTableSnapshotInputFormat
Running org.apache.hadoop.hbase.mapreduce.TestImportTSVWithOperationAttributes
Running org.apache.hadoop.hbase.mapreduce.TestRowCounter
Tests run: 12, Failures: 0, Errors: 0, Skipped: 0, Time elapsed: 80.709 sec - in org.apache.hadoop.hbase.mapreduce.TestImportExport
Running org.apache.hadoop.hbase.mapreduce.TestImportTsv
Tests run: 5, Failures: 0, Errors: 0, Skipped: 0, Time elapsed: 53.824 sec - in org.apache.hadoop.hbase.mapreduce.TestCopyTable
Tests run: 2, Failures: 0, Errors: 0, Skipped: 0, Time elapsed: 23.268 sec - in org.apache.hadoop.hbase.mapreduce.TestImportTSVWithOperationAttributes
Running org.apache.hadoop.hbase.mapreduce.TestLoadIncrementalHFilesUseSecurityEndPoint
Running org.apache.hadoop.hbase.mapreduce.TestSecureLoadIncrementalHFiles
Tests run: 7, Failures: 0, Errors: 0, Skipped: 0, Time elapsed: 39.301 sec - in org.apache.hadoop.hbase.mapreduce.TestRowCounter
Running org.apache.hadoop.hbase.mapreduce.TestTableInputFormat
Tests run: 8, Failures: 0, Errors: 0, Skipped: 0, Time elapsed: 17.723 sec - in org.apache.hadoop.hbase.mapreduce.TestTableInputFormat
Running org.apache.hadoop.hbase.mapreduce.TestTimeRangeMapRed
Tests run: 1, Failures: 0, Errors: 0, Skipped: 0, Time elapsed: 7.462 sec - in org.apache.hadoop.hbase.mapreduce.TestTimeRangeMapRed
Running org.apache.hadoop.hbase.mapreduce.TestTableSnapshotInputFormat
Tests run: 18, Failures: 0, Errors: 0, Skipped: 0, Time elapsed: 128.59 sec - in org.apache.hadoop.hbase.mapreduce.TestImportTsv
Running org.apache.hadoop.hbase.mapreduce.TestImportTSVWithTTLs
Tests run: 1, Failures: 0, Errors: 0, Skipped: 0, Time elapsed: 12.098 sec - in org.apache.hadoop.hbase.mapreduce.TestImportTSVWithTTLs
Tests run: 22, Failures: 0, Errors: 0, Skipped: 0, Time elapsed: 137.921 sec - in org.apache.hadoop.hbase.mapreduce.TestLoadIncrementalHFilesUseSecurityEndPoint
Running org.apache.hadoop.hbase.mapreduce.TestLoadIncrementalHFiles
Running org.apache.hadoop.hbase.mapreduce.TestHRegionPartitioner
Tests run: 1, Failures: 0, Errors: 0, Skipped: 0, Time elapsed: 4.048 sec - in org.apache.hadoop.hbase.mapreduce.TestHRegionPartitioner
Tests run: 22, Failures: 0, Errors: 0, Skipped: 0, Time elapsed: 152.342 sec - in org.apache.hadoop.hbase.mapreduce.TestSecureLoadIncrementalHFiles
Running org.apache.hadoop.hbase.mapreduce.TestLoadIncrementalHFilesSplitRecovery
Running org.apache.hadoop.hbase.mapreduce.TestImportTSVWithVisibilityLabels
Tests run: 8, Failures: 0, Errors: 0, Skipped: 0, Time elapsed: 115.3 sec - in org.apache.hadoop.hbase.mapreduce.TestTableSnapshotInputFormat
Running org.apache.hadoop.hbase.mapreduce.TestHFileOutputFormat2
Tests run: 14, Failures: 0, Errors: 0, Skipped: 14, Time elapsed: 0.004 sec - in org.apache.hadoop.hbase.mapreduce.TestHFileOutputFormat2
Running org.apache.hadoop.hbase.mapreduce.TestMultithreadedTableMapper
Running org.apache.hadoop.hbase.mapreduce.TestTableInputFormatScan1
Tests run: 5, Failures: 0, Errors: 0, Skipped: 0, Time elapsed: 43.284 sec - in org.apache.hadoop.hbase.mapreduce.TestLoadIncrementalHFilesSplitRecovery
Running org.apache.hadoop.hbase.mapreduce.TestCellCounter
Tests run: 7, Failures: 0, Errors: 0, Skipped: 0, Time elapsed: 35.688 sec - in org.apache.hadoop.hbase.mapreduce.TestTableInputFormatScan1
Tests run: 1, Failures: 0, Errors: 0, Skipped: 0, Time elapsed: 43.226 sec - in org.apache.hadoop.hbase.mapreduce.TestMultithreadedTableMapper
Running org.apache.hadoop.hbase.mapreduce.TestWALRecordReader
Tests run: 2, Failures: 0, Errors: 0, Skipped: 0, Time elapsed: 0.909 sec - in org.apache.hadoop.hbase.mapreduce.TestWALRecordReader
Tests run: 7, Failures: 0, Errors: 0, Skipped: 0, Time elapsed: 73.331 sec - in org.apache.hadoop.hbase.mapreduce.TestImportTSVWithVisibilityLabels
Running org.apache.hadoop.hbase.mapreduce.TestMultiTableInputFormat
Running org.apache.hadoop.hbase.mapreduce.TestSecureLoadIncrementalHFilesSplitRecovery
Tests run: 7, Failures: 0, Errors: 0, Skipped: 0, Time elapsed: 32.198 sec - in org.apache.hadoop.hbase.mapreduce.TestCellCounter
Running org.apache.hadoop.hbase.filter.TestMultiRowRangeFilter
Running org.apache.hadoop.hbase.filter.TestScanRowPrefix
Tests run: 1, Failures: 0, Errors: 0, Skipped: 0, Time elapsed: 5.556 sec - in org.apache.hadoop.hbase.filter.TestScanRowPrefix
Tests run: 20, Failures: 0, Errors: 0, Skipped: 0, Time elapsed: 17.61 sec - in org.apache.hadoop.hbase.filter.TestMultiRowRangeFilter
Tests run: 5, Failures: 0, Errors: 0, Skipped: 0, Time elapsed: 28.971 sec - in org.apache.hadoop.hbase.mapreduce.TestSecureLoadIncrementalHFilesSplitRecovery
Tests run: 4, Failures: 0, Errors: 0, Skipped: 0, Time elapsed: 31.542 sec - in org.apache.hadoop.hbase.mapreduce.TestMultiTableInputFormat
Running org.apache.hadoop.hbase.filter.TestFilterWithScanLimits
Running org.apache.hadoop.hbase.filter.TestFuzzyRowAndColumnRangeFilter
Tests run: 1, Failures: 0, Errors: 0, Skipped: 0, Time elapsed: 2.883 sec - in org.apache.hadoop.hbase.filter.TestFuzzyRowAndColumnRangeFilter
Tests run: 22, Failures: 0, Errors: 0, Skipped: 0, Time elapsed: 140.773 sec - in org.apache.hadoop.hbase.mapreduce.TestLoadIncrementalHFiles
Running org.apache.hadoop.hbase.filter.TestColumnRangeFilter
Running org.apache.hadoop.hbase.filter.TestFilterWrapper
Tests run: 1, Failures: 0, Errors: 0, Skipped: 0, Time elapsed: 3.573 sec - in org.apache.hadoop.hbase.filter.TestFilterWrapper
Tests run: 1, Failures: 0, Errors: 0, Skipped: 0, Time elapsed: 7.216 sec - in org.apache.hadoop.hbase.filter.TestColumnRangeFilter
Running org.apache.hadoop.hbase.filter.TestFuzzyRowFilterEndToEnd
Running org.apache.hadoop.hbase.filter.TestFilterListOrOperatorWithBlkCnt
Running org.apache.hadoop.hbase.TestMetaTableAccessor
Tests run: 1, Failures: 0, Errors: 0, Skipped: 0, Time elapsed: 16.83 sec - in org.apache.hadoop.hbase.filter.TestFilterListOrOperatorWithBlkCnt
Tests run: 15, Failures: 0, Errors: 0, Skipped: 0, Time elapsed: 24.328 sec - in org.apache.hadoop.hbase.TestMetaTableAccessor
Tests run: 1, Failures: 0, Errors: 0, Skipped: 0, Time elapsed: 51.852 sec - in org.apache.hadoop.hbase.filter.TestFilterWithScanLimits
Tests run: 3, Failures: 0, Errors: 0, Skipped: 0, Time elapsed: 353.047 sec - in org.apache.hadoop.hbase.filter.TestFuzzyRowFilterEndToEnd

Results :

Tests run: 2719, Failures: 0, Errors: 0, Skipped: 65

[INFO] ------------------------------------------------------------------------
[INFO] Reactor Summary:
[INFO] 
[INFO] Apache HBase ...................................... SUCCESS [  2.534 s]
[INFO] Apache HBase - Checkstyle ......................... SUCCESS [  0.657 s]
[INFO] Apache HBase - Resource Bundle .................... SUCCESS [  0.187 s]
[INFO] Apache HBase - Annotations ........................ SUCCESS [  0.219 s]
[INFO] Apache HBase - Protocol ........................... SUCCESS [  2.953 s]
[INFO] Apache HBase - Common ............................. SUCCESS [01:33 min]
[INFO] Apache HBase - Procedure .......................... SUCCESS [02:25 min]
[INFO] Apache HBase - Client ............................. SUCCESS [ 39.142 s]
[INFO] Apache HBase - Hadoop Compatibility ............... SUCCESS [  7.535 s]
[INFO] Apache HBase - Hadoop Two Compatibility ........... SUCCESS [  8.508 s]
[INFO] Apache HBase - Prefix Tree ........................ SUCCESS [ 11.434 s]
[INFO] Apache HBase - Server ............................. FAILURE [  01:39 h]
[INFO] Apache HBase - Testing Util ....................... SKIPPED
[INFO] Apache HBase - Thrift ............................. SKIPPED
[INFO] Apache HBase - RSGroup ............................ SKIPPED
[INFO] Apache HBase - Shell .............................. SKIPPED
[INFO] Apache HBase - Integration Tests .................. SKIPPED
[INFO] Apache HBase - Examples ........................... SKIPPED
[INFO] Apache HBase - Rest ............................... SKIPPED
[INFO] Apache HBase - External Block Cache ............... SKIPPED
[INFO] Apache HBase - Spark .............................. SKIPPED
[INFO] Apache HBase - Assembly ........................... SKIPPED
[INFO] Apache HBase - Shaded ............................. SKIPPED
[INFO] Apache HBase - Shaded - Client .................... SKIPPED
[INFO] Apache HBase - Shaded - Server .................... SKIPPED
[INFO] Apache HBase - Archetypes ......................... SKIPPED
[INFO] Apache HBase - Exemplar for hbase-client archetype  SKIPPED
[INFO] Apache HBase - Exemplar for hbase-shaded-client archetype  SKIPPED
[INFO] Apache HBase - Archetype builder .................. SKIPPED
[INFO] ------------------------------------------------------------------------
[INFO] BUILD FAILURE
[INFO] ------------------------------------------------------------------------
[INFO] Total time: 01:44 h
[INFO] Finished at: 2016-04-01T03:49:30+00:00
[INFO] Final Memory: 480M/704M
[INFO] ------------------------------------------------------------------------
[ERROR] Failed to execute goal org.apache.maven.plugins:maven-surefire-plugin:2.18.1:test
(secondPartTestsExecution) on project hbase-server: There was a timeout or other error in
the fork -> [Help 1]
[ERROR] 
[ERROR] To see the full stack trace of the errors, re-run Maven with the -e switch.
[ERROR] Re-run Maven using the -X switch to enable full debug logging.
[ERROR] 
[ERROR] For more information about the errors and possible solutions, please read the following
articles:
[ERROR] [Help 1] http://cwiki.apache.org/confluence/display/MAVEN/MojoFailureException
[ERROR] 
[ERROR] After correcting the problems, you can resume the build with the command
[ERROR]   mvn <goals> -rf :hbase-server
Build step 'Invoke top-level Maven targets' marked build as failure
Performing Post build task...
Match found for :.* : True
Logical operation result is TRUE
Running script  : # Run zombie detector script
./dev-support/zombie-detector.sh --jenkins ${BUILD_ID}
[yahoo-not-h2] $ /bin/bash -xe /tmp/hudson296632607711099101.sh
+ ./dev-support/zombie-detector.sh --jenkins 819
Fri Apr  1 03:49:32 UTC 2016 Found 2 suspicious java process(es) listed below; waiting 30s
to see if just slow to stop
18063 surefirebooter4414824520997189580.jar -enableassertions -Dhbase.build.id=819 -Xmx2800m
-XX:MaxPermSize=256m -Djava.security.egd=file:/dev/./urandom -Djava.net.preferIPv4Stack=true
-Djava.awt.headless=true 9987 surefirebooter83662083017432773.jar -enableassertions -Dhbase.build.id=819
-Xmx2800m -XX:MaxPermSize=256m -Djava.security.egd=file:/dev/./urandom -Djava.net.preferIPv4Stack=true
-Djava.awt.headless=true
tail: cannot open '+2' for reading: No such file or directory
tail: cannot open '+2' for reading: No such file or directory
Fri Apr  1 03:50:02 UTC 2016 We're ok: there was a zombie candidate but it went away


    {color:green}+1 zombies{color}. No zombie tests found running at the end of the build
(There were candidates but they seem to have gone away).
POST BUILD TASK : SUCCESS
END OF POST BUILD TASK : 0
Archiving artifacts
Recording test results
[FINDBUGS] Skipping publisher since build result is FAILURE
[CHECKSTYLE] Skipping publisher since build result is FAILURE

Mime
View raw message