hbase-builds mailing list archives

Site index · List index
Message view « Date » · « Thread »
Top « Date » · « Thread »
From Apache Jenkins Server <jenk...@builds.apache.org>
Subject Build failed in Jenkins: HBase-Trunk_matrix » latest1.8,yahoo-not-h2 #819
Date Fri, 01 Apr 2016 04:59:57 GMT
See <https://builds.apache.org/job/HBase-Trunk_matrix/jdk=latest1.8,label=yahoo-not-h2/819/changes>

Changes:

[tedyu] HBASE-15571 Make MasterProcedureManagerHost accessible through

------------------------------------------
[...truncated 7126 lines...]
Running org.apache.hadoop.hbase.master.TestAssignmentManagerOnCluster
Running org.apache.hadoop.hbase.master.TestTableStateManager
Tests run: 3, Failures: 0, Errors: 0, Skipped: 0, Time elapsed: 60.686 sec - in org.apache.hadoop.hbase.master.TestMasterFailover
Java HotSpot(TM) 64-Bit Server VM warning: ignoring option MaxPermSize=256m; support was removed
in 8.0
Running org.apache.hadoop.hbase.master.TestMasterShutdown
Tests run: 1, Failures: 0, Errors: 0, Skipped: 0, Time elapsed: 28.772 sec - in org.apache.hadoop.hbase.master.TestTableStateManager
Java HotSpot(TM) 64-Bit Server VM warning: ignoring option MaxPermSize=256m; support was removed
in 8.0
Tests run: 1, Failures: 0, Errors: 0, Skipped: 0, Time elapsed: 33.387 sec - in org.apache.hadoop.hbase.master.TestMetaShutdownHandler
Java HotSpot(TM) 64-Bit Server VM warning: ignoring option MaxPermSize=256m; support was removed
in 8.0
Running org.apache.hadoop.hbase.master.TestMasterNoCluster
Tests run: 8, Failures: 0, Errors: 0, Skipped: 0, Time elapsed: 136.213 sec - in org.apache.hadoop.hbase.master.procedure.TestMasterFailoverWithProcedures
Java HotSpot(TM) 64-Bit Server VM warning: ignoring option MaxPermSize=256m; support was removed
in 8.0
Java HotSpot(TM) 64-Bit Server VM warning: ignoring option MaxPermSize=256m; support was removed
in 8.0
Running org.apache.hadoop.hbase.master.TestMasterFileSystem
Tests run: 2, Failures: 0, Errors: 0, Skipped: 0, Time elapsed: 1.662 sec - in org.apache.hadoop.hbase.master.TestMasterFileSystem
Running org.apache.hadoop.hbase.master.balancer.TestStochasticLoadBalancer
Java HotSpot(TM) 64-Bit Server VM warning: ignoring option MaxPermSize=256m; support was removed
in 8.0
Tests run: 3, Failures: 0, Errors: 0, Skipped: 0, Time elapsed: 18.321 sec - in org.apache.hadoop.hbase.master.TestMasterNoCluster
Tests run: 2, Failures: 0, Errors: 0, Skipped: 0, Time elapsed: 29.94 sec - in org.apache.hadoop.hbase.master.TestMasterShutdown
Java HotSpot(TM) 64-Bit Server VM warning: ignoring option MaxPermSize=256m; support was removed
in 8.0
Java HotSpot(TM) 64-Bit Server VM warning: ignoring option MaxPermSize=256m; support was removed
in 8.0
Java HotSpot(TM) 64-Bit Server VM warning: ignoring option MaxPermSize=256m; support was removed
in 8.0
Java HotSpot(TM) 64-Bit Server VM warning: ignoring option MaxPermSize=256m; support was removed
in 8.0
Running org.apache.hadoop.hbase.master.balancer.TestStochasticLoadBalancer2
Running org.apache.hadoop.hbase.master.balancer.TestDefaultLoadBalancer
Running org.apache.hadoop.hbase.master.balancer.TestBaseLoadBalancer
Tests run: 6, Failures: 0, Errors: 0, Skipped: 0, Time elapsed: 1.711 sec - in org.apache.hadoop.hbase.master.balancer.TestBaseLoadBalancer
Java HotSpot(TM) 64-Bit Server VM warning: ignoring option MaxPermSize=256m; support was removed
in 8.0
Java HotSpot(TM) 64-Bit Server VM warning: ignoring option MaxPermSize=256m; support was removed
in 8.0
Tests run: 1, Failures: 0, Errors: 0, Skipped: 0, Time elapsed: 6.797 sec - in org.apache.hadoop.hbase.master.balancer.TestDefaultLoadBalancer
Java HotSpot(TM) 64-Bit Server VM warning: ignoring option MaxPermSize=256m; support was removed
in 8.0
Running org.apache.hadoop.hbase.master.TestActiveMasterManager
Tests run: 2, Failures: 0, Errors: 0, Skipped: 0, Time elapsed: 2.178 sec - in org.apache.hadoop.hbase.master.TestActiveMasterManager
Java HotSpot(TM) 64-Bit Server VM warning: ignoring option MaxPermSize=256m; support was removed
in 8.0
Running org.apache.hadoop.hbase.master.TestRestartCluster
Running org.apache.hadoop.hbase.master.TestRegionPlacement2
Tests run: 2, Failures: 0, Errors: 0, Skipped: 0, Time elapsed: 2.827 sec - in org.apache.hadoop.hbase.master.TestRegionPlacement2
Java HotSpot(TM) 64-Bit Server VM warning: ignoring option MaxPermSize=256m; support was removed
in 8.0
Running org.apache.hadoop.hbase.master.TestMasterTransitions
Tests run: 3, Failures: 0, Errors: 0, Skipped: 3, Time elapsed: 0.002 sec - in org.apache.hadoop.hbase.master.TestMasterTransitions
Java HotSpot(TM) 64-Bit Server VM warning: ignoring option MaxPermSize=256m; support was removed
in 8.0
Running org.apache.hadoop.hbase.master.TestTableLockManager
Tests run: 22, Failures: 0, Errors: 0, Skipped: 0, Time elapsed: 112.067 sec - in org.apache.hadoop.hbase.master.TestAssignmentManagerOnCluster
Java HotSpot(TM) 64-Bit Server VM warning: ignoring option MaxPermSize=256m; support was removed
in 8.0
Running org.apache.hadoop.hbase.master.handler.TestTableDescriptorModification
Tests run: 2, Failures: 0, Errors: 0, Skipped: 0, Time elapsed: 62.736 sec - in org.apache.hadoop.hbase.master.TestRestartCluster
Java HotSpot(TM) 64-Bit Server VM warning: ignoring option MaxPermSize=256m; support was removed
in 8.0
Running org.apache.hadoop.hbase.master.handler.TestTableDeleteFamilyHandler
Tests run: 7, Failures: 0, Errors: 0, Skipped: 0, Time elapsed: 39.146 sec - in org.apache.hadoop.hbase.master.handler.TestTableDescriptorModification
Tests run: 2, Failures: 0, Errors: 0, Skipped: 0, Time elapsed: 18.107 sec - in org.apache.hadoop.hbase.master.handler.TestTableDeleteFamilyHandler
Java HotSpot(TM) 64-Bit Server VM warning: ignoring option MaxPermSize=256m; support was removed
in 8.0
Java HotSpot(TM) 64-Bit Server VM warning: ignoring option MaxPermSize=256m; support was removed
in 8.0
Running org.apache.hadoop.hbase.master.handler.TestEnableTableHandler
Running org.apache.hadoop.hbase.master.handler.TestCreateTableHandler
Tests run: 4, Failures: 0, Errors: 0, Skipped: 0, Time elapsed: 122.841 sec - in org.apache.hadoop.hbase.master.TestTableLockManager
Java HotSpot(TM) 64-Bit Server VM warning: ignoring option MaxPermSize=256m; support was removed
in 8.0
Tests run: 3, Failures: 0, Errors: 0, Skipped: 0, Time elapsed: 45.023 sec - in org.apache.hadoop.hbase.master.handler.TestCreateTableHandler
Java HotSpot(TM) 64-Bit Server VM warning: ignoring option MaxPermSize=256m; support was removed
in 8.0
Running org.apache.hadoop.hbase.master.TestGetLastFlushedSequenceId
Running org.apache.hadoop.hbase.master.TestRollingRestart
Tests run: 2, Failures: 0, Errors: 0, Skipped: 0, Time elapsed: 47.654 sec - in org.apache.hadoop.hbase.master.handler.TestEnableTableHandler
Java HotSpot(TM) 64-Bit Server VM warning: ignoring option MaxPermSize=256m; support was removed
in 8.0
Java HotSpot(TM) 64-Bit Server VM warning: ignoring option MaxPermSize=256m; support was removed
in 8.0
Running org.apache.hadoop.hbase.master.TestHMasterRPCException
Tests run: 1, Failures: 0, Errors: 0, Skipped: 0, Time elapsed: 6.89 sec - in org.apache.hadoop.hbase.master.TestHMasterRPCException
Java HotSpot(TM) 64-Bit Server VM warning: ignoring option MaxPermSize=256m; support was removed
in 8.0
Running org.apache.hadoop.hbase.master.TestSplitLogManager
Tests run: 1, Failures: 0, Errors: 0, Skipped: 0, Time elapsed: 28.185 sec - in org.apache.hadoop.hbase.master.TestGetLastFlushedSequenceId
Java HotSpot(TM) 64-Bit Server VM warning: ignoring option MaxPermSize=256m; support was removed
in 8.0
Tests run: 1, Failures: 0, Errors: 0, Skipped: 0, Time elapsed: 48.57 sec - in org.apache.hadoop.hbase.master.TestRollingRestart
Running org.apache.hadoop.hbase.master.TestMaster
Java HotSpot(TM) 64-Bit Server VM warning: ignoring option MaxPermSize=256m; support was removed
in 8.0
Running org.apache.hadoop.hbase.master.TestClusterStatusPublisher
Tests run: 3, Failures: 0, Errors: 0, Skipped: 0, Time elapsed: 0.632 sec - in org.apache.hadoop.hbase.master.TestClusterStatusPublisher
Java HotSpot(TM) 64-Bit Server VM warning: ignoring option MaxPermSize=256m; support was removed
in 8.0
Running org.apache.hadoop.hbase.master.TestGetInfoPort
Tests run: 4, Failures: 0, Errors: 0, Skipped: 0, Time elapsed: 15.256 sec - in org.apache.hadoop.hbase.master.TestMaster
Java HotSpot(TM) 64-Bit Server VM warning: ignoring option MaxPermSize=256m; support was removed
in 8.0
Tests run: 1, Failures: 0, Errors: 0, Skipped: 0, Time elapsed: 20.456 sec - in org.apache.hadoop.hbase.master.TestGetInfoPort
Java HotSpot(TM) 64-Bit Server VM warning: ignoring option MaxPermSize=256m; support was removed
in 8.0
Java HotSpot(TM) 64-Bit Server VM warning: ignoring option MaxPermSize=256m; support was removed
in 8.0
Running org.apache.hadoop.hbase.master.TestDeadServer
Tests run: 4, Failures: 0, Errors: 0, Skipped: 0, Time elapsed: 2.351 sec - in org.apache.hadoop.hbase.master.TestDeadServer
Java HotSpot(TM) 64-Bit Server VM warning: ignoring option MaxPermSize=256m; support was removed
in 8.0
Running org.apache.hadoop.hbase.master.TestMasterStatusServlet
Tests run: 4, Failures: 0, Errors: 0, Skipped: 0, Time elapsed: 2.738 sec - in org.apache.hadoop.hbase.master.TestMasterStatusServlet
Java HotSpot(TM) 64-Bit Server VM warning: ignoring option MaxPermSize=256m; support was removed
in 8.0
Running org.apache.hadoop.hbase.master.cleaner.TestHFileLinkCleaner
Running org.apache.hadoop.hbase.master.normalizer.TestSimpleRegionNormalizerOnCluster
Tests run: 1, Failures: 0, Errors: 0, Skipped: 0, Time elapsed: 10.983 sec - in org.apache.hadoop.hbase.master.cleaner.TestHFileLinkCleaner
Java HotSpot(TM) 64-Bit Server VM warning: ignoring option MaxPermSize=256m; support was removed
in 8.0
Running org.apache.hadoop.hbase.master.cleaner.TestSnapshotFromMaster
Tests run: 20, Failures: 0, Errors: 0, Skipped: 1, Time elapsed: 314.433 sec - in org.apache.hadoop.hbase.master.balancer.TestStochasticLoadBalancer
Java HotSpot(TM) 64-Bit Server VM warning: ignoring option MaxPermSize=256m; support was removed
in 8.0
Tests run: 2, Failures: 0, Errors: 0, Skipped: 0, Time elapsed: 47.248 sec - in org.apache.hadoop.hbase.master.normalizer.TestSimpleRegionNormalizerOnCluster
Java HotSpot(TM) 64-Bit Server VM warning: ignoring option MaxPermSize=256m; support was removed
in 8.0
Java HotSpot(TM) 64-Bit Server VM warning: ignoring option MaxPermSize=256m; support was removed
in 8.0
Java HotSpot(TM) 64-Bit Server VM warning: ignoring option MaxPermSize=256m; support was removed
in 8.0
Running org.apache.hadoop.hbase.master.cleaner.TestLogsCleaner
Running org.apache.hadoop.hbase.master.cleaner.TestHFileCleaner
Tests run: 3, Failures: 0, Errors: 0, Skipped: 0, Time elapsed: 1.531 sec - in org.apache.hadoop.hbase.master.cleaner.TestHFileCleaner
Java HotSpot(TM) 64-Bit Server VM warning: ignoring option MaxPermSize=256m; support was removed
in 8.0
Tests run: 15, Failures: 0, Errors: 0, Skipped: 1, Time elapsed: 144.245 sec - in org.apache.hadoop.hbase.master.TestSplitLogManager
Java HotSpot(TM) 64-Bit Server VM warning: ignoring option MaxPermSize=256m; support was removed
in 8.0
Tests run: 2, Failures: 0, Errors: 0, Skipped: 0, Time elapsed: 12.437 sec - in org.apache.hadoop.hbase.master.cleaner.TestLogsCleaner
Java HotSpot(TM) 64-Bit Server VM warning: ignoring option MaxPermSize=256m; support was removed
in 8.0
Java HotSpot(TM) 64-Bit Server VM warning: ignoring option MaxPermSize=256m; support was removed
in 8.0
Tests run: 4, Failures: 0, Errors: 0, Skipped: 0, Time elapsed: 38.199 sec - in org.apache.hadoop.hbase.master.cleaner.TestSnapshotFromMaster
Java HotSpot(TM) 64-Bit Server VM warning: ignoring option MaxPermSize=256m; support was removed
in 8.0
Running org.apache.hadoop.hbase.master.TestMasterRestartAfterDisablingTable
Running org.apache.hadoop.hbase.master.TestDistributedLogSplitting
Running org.apache.hadoop.hbase.master.TestMasterMetrics
Tests run: 3, Failures: 0, Errors: 0, Skipped: 0, Time elapsed: 2.648 sec - in org.apache.hadoop.hbase.master.TestMasterMetrics
Java HotSpot(TM) 64-Bit Server VM warning: ignoring option MaxPermSize=256m; support was removed
in 8.0
Running org.apache.hadoop.hbase.master.TestRegionPlacement
Tests run: 2, Failures: 0, Errors: 0, Skipped: 2, Time elapsed: 0.004 sec - in org.apache.hadoop.hbase.master.TestRegionPlacement
Java HotSpot(TM) 64-Bit Server VM warning: ignoring option MaxPermSize=256m; support was removed
in 8.0
Java HotSpot(TM) 64-Bit Server VM warning: ignoring option MaxPermSize=256m; support was removed
in 8.0
Java HotSpot(TM) 64-Bit Server VM warning: ignoring option MaxPermSize=256m; support was removed
in 8.0
Running org.apache.hadoop.hbase.master.TestMasterOperationsForRegionReplicas
Tests run: 1, Failures: 0, Errors: 0, Skipped: 0, Time elapsed: 32.156 sec - in org.apache.hadoop.hbase.master.TestMasterRestartAfterDisablingTable
Java HotSpot(TM) 64-Bit Server VM warning: ignoring option MaxPermSize=256m; support was removed
in 8.0
Running org.apache.hadoop.hbase.master.TestAssignmentListener
Tests run: 2, Failures: 0, Errors: 0, Skipped: 0, Time elapsed: 12.54 sec - in org.apache.hadoop.hbase.master.TestAssignmentListener
Java HotSpot(TM) 64-Bit Server VM warning: ignoring option MaxPermSize=256m; support was removed
in 8.0
Java HotSpot(TM) 64-Bit Server VM warning: ignoring option MaxPermSize=256m; support was removed
in 8.0
Java HotSpot(TM) 64-Bit Server VM warning: ignoring option MaxPermSize=256m; support was removed
in 8.0
Tests run: 2, Failures: 0, Errors: 0, Skipped: 0, Time elapsed: 33.543 sec - in org.apache.hadoop.hbase.master.TestMasterOperationsForRegionReplicas
Java HotSpot(TM) 64-Bit Server VM warning: ignoring option MaxPermSize=256m; support was removed
in 8.0
Running org.apache.hadoop.hbase.master.TestMasterMetricsWrapper
Java HotSpot(TM) 64-Bit Server VM warning: ignoring option MaxPermSize=256m; support was removed
in 8.0
Java HotSpot(TM) 64-Bit Server VM warning: ignoring option MaxPermSize=256m; support was removed
in 8.0
Tests run: 1, Failures: 0, Errors: 0, Skipped: 0, Time elapsed: 3.315 sec - in org.apache.hadoop.hbase.master.TestMasterMetricsWrapper
Java HotSpot(TM) 64-Bit Server VM warning: ignoring option MaxPermSize=256m; support was removed
in 8.0
Running org.apache.hadoop.hbase.snapshot.TestSnapshotClientRetries
Tests run: 18, Failures: 0, Errors: 0, Skipped: 15, Time elapsed: 56.603 sec - in org.apache.hadoop.hbase.master.TestDistributedLogSplitting
Java HotSpot(TM) 64-Bit Server VM warning: ignoring option MaxPermSize=256m; support was removed
in 8.0
Running org.apache.hadoop.hbase.master.snapshot.TestSnapshotFileCache
Running org.apache.hadoop.hbase.snapshot.TestFlushSnapshotFromClient
Tests run: 2, Failures: 0, Errors: 0, Skipped: 0, Time elapsed: 33.205 sec - in org.apache.hadoop.hbase.snapshot.TestSnapshotClientRetries
Java HotSpot(TM) 64-Bit Server VM warning: ignoring option MaxPermSize=256m; support was removed
in 8.0
Running org.apache.hadoop.hbase.snapshot.TestExportSnapshot
Running org.apache.hadoop.hbase.snapshot.TestMobFlushSnapshotFromClient
Tests run: 4, Failures: 0, Errors: 0, Skipped: 0, Time elapsed: 68.228 sec - in org.apache.hadoop.hbase.master.snapshot.TestSnapshotFileCache
Java HotSpot(TM) 64-Bit Server VM warning: ignoring option MaxPermSize=256m; support was removed
in 8.0
Running org.apache.hadoop.hbase.snapshot.TestSnapshotDescriptionUtils
Tests run: 2, Failures: 0, Errors: 0, Skipped: 0, Time elapsed: 0.242 sec - in org.apache.hadoop.hbase.snapshot.TestSnapshotDescriptionUtils
Java HotSpot(TM) 64-Bit Server VM warning: ignoring option MaxPermSize=256m; support was removed
in 8.0
Tests run: 9, Failures: 0, Errors: 0, Skipped: 0, Time elapsed: 90.457 sec - in org.apache.hadoop.hbase.snapshot.TestFlushSnapshotFromClient
Java HotSpot(TM) 64-Bit Server VM warning: ignoring option MaxPermSize=256m; support was removed
in 8.0
Running org.apache.hadoop.hbase.snapshot.TestMobSecureExportSnapshot
Running org.apache.hadoop.hbase.snapshot.TestMobRestoreFlushSnapshotFromClient
Tests run: 4, Failures: 0, Errors: 0, Skipped: 0, Time elapsed: 554.719 sec - in org.apache.hadoop.hbase.master.balancer.TestStochasticLoadBalancer2
Java HotSpot(TM) 64-Bit Server VM warning: ignoring option MaxPermSize=256m; support was removed
in 8.0
Java HotSpot(TM) 64-Bit Server VM warning: ignoring option MaxPermSize=256m; support was removed
in 8.0
Java HotSpot(TM) 64-Bit Server VM warning: ignoring option MaxPermSize=256m; support was removed
in 8.0
Running org.apache.hadoop.hbase.snapshot.TestMobExportSnapshot
Tests run: 5, Failures: 0, Errors: 0, Skipped: 0, Time elapsed: 148.515 sec - in org.apache.hadoop.hbase.snapshot.TestMobRestoreFlushSnapshotFromClient
Java HotSpot(TM) 64-Bit Server VM warning: ignoring option MaxPermSize=256m; support was removed
in 8.0
Running org.apache.hadoop.hbase.snapshot.TestRestoreFlushSnapshotFromClient
Tests run: 5, Failures: 0, Errors: 0, Skipped: 0, Time elapsed: 88.931 sec - in org.apache.hadoop.hbase.snapshot.TestRestoreFlushSnapshotFromClient
Java HotSpot(TM) 64-Bit Server VM warning: ignoring option MaxPermSize=256m; support was removed
in 8.0
Running org.apache.hadoop.hbase.snapshot.TestSecureExportSnapshot
Tests run: 9, Failures: 0, Errors: 0, Skipped: 0, Time elapsed: 497.239 sec - in org.apache.hadoop.hbase.snapshot.TestExportSnapshot
Tests run: 9, Failures: 0, Errors: 0, Skipped: 0, Time elapsed: 514.099 sec - in org.apache.hadoop.hbase.snapshot.TestMobSecureExportSnapshot
Tests run: 9, Failures: 0, Errors: 0, Skipped: 0, Time elapsed: 505.643 sec - in org.apache.hadoop.hbase.snapshot.TestMobExportSnapshot
Tests run: 9, Failures: 0, Errors: 0, Skipped: 0, Time elapsed: 417.124 sec - in org.apache.hadoop.hbase.snapshot.TestSecureExportSnapshot

Results :

Failed tests: 
  TestHRegion.testBatchPut_whileNoRowLocksHeld:1513 Metrics Counters should be equal expected:<161>
but was:<160>
Tests in error: 
  TestFailedAppendAndSync.testLockupAroundBadAssignSync:239 » TestTimedOut test ...
  TestRegionMergeTransactionOnCluster.testMergeWithReplicas:367->createTableAndLoadData:461
» RetriesExhausted
  TestRegionMergeTransactionOnCluster.testWholesomeMerge:148->mergeRegionsAndVerifyRegionNum:407->waitAndVerifyRegionNum:431
» RetriesExhausted

Tests run: 2719, Failures: 1, Errors: 3, Skipped: 65

[INFO] ------------------------------------------------------------------------
[INFO] Reactor Summary:
[INFO] 
[INFO] Apache HBase ...................................... SUCCESS [  4.873 s]
[INFO] Apache HBase - Checkstyle ......................... SUCCESS [  0.810 s]
[INFO] Apache HBase - Resource Bundle .................... SUCCESS [  0.194 s]
[INFO] Apache HBase - Annotations ........................ SUCCESS [  0.244 s]
[INFO] Apache HBase - Protocol ........................... SUCCESS [  3.082 s]
[INFO] Apache HBase - Common ............................. SUCCESS [02:08 min]
[INFO] Apache HBase - Procedure .......................... SUCCESS [02:59 min]
[INFO] Apache HBase - Client ............................. SUCCESS [ 54.552 s]
[INFO] Apache HBase - Hadoop Compatibility ............... SUCCESS [  9.646 s]
[INFO] Apache HBase - Hadoop Two Compatibility ........... SUCCESS [ 14.559 s]
[INFO] Apache HBase - Prefix Tree ........................ SUCCESS [ 14.585 s]
[INFO] Apache HBase - Server ............................. FAILURE [  02:26 h]
[INFO] Apache HBase - Testing Util ....................... SKIPPED
[INFO] Apache HBase - Thrift ............................. SKIPPED
[INFO] Apache HBase - RSGroup ............................ SKIPPED
[INFO] Apache HBase - Shell .............................. SKIPPED
[INFO] Apache HBase - Integration Tests .................. SKIPPED
[INFO] Apache HBase - Examples ........................... SKIPPED
[INFO] Apache HBase - Rest ............................... SKIPPED
[INFO] Apache HBase - External Block Cache ............... SKIPPED
[INFO] Apache HBase - Spark .............................. SKIPPED
[INFO] Apache HBase - Assembly ........................... SKIPPED
[INFO] Apache HBase - Shaded ............................. SKIPPED
[INFO] Apache HBase - Shaded - Client .................... SKIPPED
[INFO] Apache HBase - Shaded - Server .................... SKIPPED
[INFO] Apache HBase - Archetypes ......................... SKIPPED
[INFO] Apache HBase - Exemplar for hbase-client archetype  SKIPPED
[INFO] Apache HBase - Exemplar for hbase-shaded-client archetype  SKIPPED
[INFO] Apache HBase - Archetype builder .................. SKIPPED
[INFO] ------------------------------------------------------------------------
[INFO] BUILD FAILURE
[INFO] ------------------------------------------------------------------------
[INFO] Total time: 02:32 h
[INFO] Finished at: 2016-04-01T04:55:32+00:00
[INFO] Final Memory: 482M/2313M
[INFO] ------------------------------------------------------------------------
[ERROR] Failed to execute goal org.apache.maven.plugins:maven-surefire-plugin:2.18.1:test
(secondPartTestsExecution) on project hbase-server: There was a timeout or other error in
the fork -> [Help 1]
[ERROR] 
[ERROR] To see the full stack trace of the errors, re-run Maven with the -e switch.
[ERROR] Re-run Maven using the -X switch to enable full debug logging.
[ERROR] 
[ERROR] For more information about the errors and possible solutions, please read the following
articles:
[ERROR] [Help 1] http://cwiki.apache.org/confluence/display/MAVEN/MojoFailureException
[ERROR] 
[ERROR] After correcting the problems, you can resume the build with the command
[ERROR]   mvn <goals> -rf :hbase-server
Build step 'Invoke top-level Maven targets' marked build as failure
Performing Post build task...
Match found for :.* : True
Logical operation result is TRUE
Running script  : # Run zombie detector script
./dev-support/zombie-detector.sh --jenkins ${BUILD_ID}
[yahoo-not-h2] $ /bin/bash -xe /tmp/hudson1350750026790999144.sh
+ ./dev-support/zombie-detector.sh --jenkins 819
Fri Apr  1 04:55:35 UTC 2016 Found 1 suspicious java process(es) listed below; waiting 30s
to see if just slow to stop
18567 surefirebooter6974300310825567514.jar -enableassertions -Dhbase.build.id=819 -Xmx2800m
-XX:MaxPermSize=256m -Djava.security.egd=file:/dev/./urandom -Djava.net.preferIPv4Stack=true
-Djava.awt.headless=true
tail: cannot open '+2' for reading: No such file or directory
Fri Apr  1 04:56:05 UTC 2016 We're ok: there was a zombie candidate but it went away


    {color:green}+1 zombies{color}. No zombie tests found running at the end of the build
(There were candidates but they seem to have gone away).
POST BUILD TASK : SUCCESS
END OF POST BUILD TASK : 0
Archiving artifacts
Recording test results
[FINDBUGS] Skipping publisher since build result is FAILURE
[CHECKSTYLE] Skipping publisher since build result is FAILURE

Mime
View raw message