hbase-builds mailing list archives

Site index · List index
Message view « Date » · « Thread »
Top « Date » · « Thread »
From Apache Jenkins Server <jenk...@builds.apache.org>
Subject Build failed in Jenkins: HBase-1.1-JDK8 #1780
Date Sat, 02 Apr 2016 08:31:10 GMT
See <https://builds.apache.org/job/HBase-1.1-JDK8/1780/changes>

Changes:

[matteo.bertozzi] HBASE-15582 SnapshotManifestV1 too verbose when there are no regions

------------------------------------------
[...truncated 3438 lines...]
Java HotSpot(TM) 64-Bit Server VM warning: ignoring option MaxPermSize=256m; support was removed
in 8.0
Java HotSpot(TM) 64-Bit Server VM warning: ignoring option MaxPermSize=256m; support was removed
in 8.0
Java HotSpot(TM) 64-Bit Server VM warning: ignoring option MaxPermSize=256m; support was removed
in 8.0
Java HotSpot(TM) 64-Bit Server VM warning: ignoring option MaxPermSize=256m; support was removed
in 8.0
Java HotSpot(TM) 64-Bit Server VM warning: ignoring option MaxPermSize=256m; support was removed
in 8.0
Running org.apache.hadoop.hbase.filter.TestScanRowPrefix
Java HotSpot(TM) 64-Bit Server VM warning: ignoring option MaxPermSize=256m; support was removed
in 8.0
Running org.apache.hadoop.hbase.filter.TestColumnRangeFilter
Tests run: 1, Failures: 0, Errors: 0, Skipped: 0, Time elapsed: 9.832 sec - in org.apache.hadoop.hbase.filter.TestScanRowPrefix
Java HotSpot(TM) 64-Bit Server VM warning: ignoring option MaxPermSize=256m; support was removed
in 8.0
Java HotSpot(TM) 64-Bit Server VM warning: ignoring option MaxPermSize=256m; support was removed
in 8.0
Java HotSpot(TM) 64-Bit Server VM warning: ignoring option MaxPermSize=256m; support was removed
in 8.0
Java HotSpot(TM) 64-Bit Server VM warning: ignoring option MaxPermSize=256m; support was removed
in 8.0
Java HotSpot(TM) 64-Bit Server VM warning: ignoring option MaxPermSize=256m; support was removed
in 8.0
Java HotSpot(TM) 64-Bit Server VM warning: ignoring option MaxPermSize=256m; support was removed
in 8.0
Tests run: 1, Failures: 0, Errors: 0, Skipped: 0, Time elapsed: 19.786 sec - in org.apache.hadoop.hbase.filter.TestColumnRangeFilter
Java HotSpot(TM) 64-Bit Server VM warning: ignoring option MaxPermSize=256m; support was removed
in 8.0
Running org.apache.hadoop.hbase.filter.TestFuzzyRowFilterEndToEnd
Java HotSpot(TM) 64-Bit Server VM warning: ignoring option MaxPermSize=256m; support was removed
in 8.0
Running org.apache.hadoop.hbase.filter.TestFilterWrapper
Running org.apache.hadoop.hbase.mapreduce.TestHFileOutputFormat
Tests run: 1, Failures: 0, Errors: 0, Skipped: 0, Time elapsed: 6.274 sec - in org.apache.hadoop.hbase.filter.TestFilterWrapper
Java HotSpot(TM) 64-Bit Server VM warning: ignoring option MaxPermSize=256m; support was removed
in 8.0
Running org.apache.hadoop.hbase.filter.TestMultiRowRangeFilter
Running org.apache.hadoop.hbase.mapreduce.TestLoadIncrementalHFilesUseSecurityEndPoint
Tests run: 20, Failures: 0, Errors: 0, Skipped: 0, Time elapsed: 34.306 sec - in org.apache.hadoop.hbase.filter.TestMultiRowRangeFilter
Java HotSpot(TM) 64-Bit Server VM warning: ignoring option MaxPermSize=256m; support was removed
in 8.0
Running org.apache.hadoop.hbase.mapreduce.TestHLogRecordReader
Running org.apache.hadoop.hbase.mapreduce.TestWALPlayer
Tests run: 2, Failures: 0, Errors: 0, Skipped: 0, Time elapsed: 3.305 sec - in org.apache.hadoop.hbase.mapreduce.TestHLogRecordReader
Java HotSpot(TM) 64-Bit Server VM warning: ignoring option MaxPermSize=256m; support was removed
in 8.0
Running org.apache.hadoop.hbase.mapreduce.TestMultiTableInputFormat
Tests run: 4, Failures: 0, Errors: 0, Skipped: 0, Time elapsed: 111.005 sec - in org.apache.hadoop.hbase.mapreduce.TestWALPlayer
Java HotSpot(TM) 64-Bit Server VM warning: ignoring option MaxPermSize=256m; support was removed
in 8.0
Tests run: 3, Failures: 0, Errors: 0, Skipped: 0, Time elapsed: 198.78 sec - in org.apache.hadoop.hbase.filter.TestFuzzyRowFilterEndToEnd
Java HotSpot(TM) 64-Bit Server VM warning: ignoring option MaxPermSize=256m; support was removed
in 8.0
Java HotSpot(TM) 64-Bit Server VM warning: ignoring option MaxPermSize=256m; support was removed
in 8.0
Running org.apache.hadoop.hbase.mapreduce.TestWALRecordReader
Tests run: 2, Failures: 0, Errors: 0, Skipped: 0, Time elapsed: 2.06 sec - in org.apache.hadoop.hbase.mapreduce.TestWALRecordReader
Java HotSpot(TM) 64-Bit Server VM warning: ignoring option MaxPermSize=256m; support was removed
in 8.0
Running org.apache.hadoop.hbase.mapreduce.TestImportTSVWithOperationAttributes
Running org.apache.hadoop.hbase.mapreduce.TestSecureLoadIncrementalHFilesSplitRecovery
Tests run: 5, Failures: 0, Errors: 0, Skipped: 0, Time elapsed: 54.334 sec - in org.apache.hadoop.hbase.mapreduce.TestSecureLoadIncrementalHFilesSplitRecovery
Java HotSpot(TM) 64-Bit Server VM warning: ignoring option MaxPermSize=256m; support was removed
in 8.0
Tests run: 21, Failures: 0, Errors: 0, Skipped: 0, Time elapsed: 307.258 sec - in org.apache.hadoop.hbase.mapreduce.TestLoadIncrementalHFilesUseSecurityEndPoint
Java HotSpot(TM) 64-Bit Server VM warning: ignoring option MaxPermSize=256m; support was removed
in 8.0
Running org.apache.hadoop.hbase.mapreduce.TestTableSnapshotInputFormat
Running org.apache.hadoop.hbase.mapreduce.TestTimeRangeMapRed
Tests run: 2, Failures: 0, Errors: 0, Skipped: 0, Time elapsed: 227.7 sec - in org.apache.hadoop.hbase.mapreduce.TestImportTSVWithOperationAttributes
Java HotSpot(TM) 64-Bit Server VM warning: ignoring option MaxPermSize=256m; support was removed
in 8.0
Tests run: 1, Failures: 0, Errors: 0, Skipped: 0, Time elapsed: 124.197 sec - in org.apache.hadoop.hbase.mapreduce.TestTimeRangeMapRed
Java HotSpot(TM) 64-Bit Server VM warning: ignoring option MaxPermSize=256m; support was removed
in 8.0
Running org.apache.hadoop.hbase.mapreduce.TestImportTSVWithTTLs
Running org.apache.hadoop.hbase.mapreduce.TestCellCounter
Tests run: 4, Failures: 0, Errors: 0, Skipped: 0, Time elapsed: 413.327 sec - in org.apache.hadoop.hbase.mapreduce.TestMultiTableInputFormat
Java HotSpot(TM) 64-Bit Server VM warning: ignoring option MaxPermSize=256m; support was removed
in 8.0
Java HotSpot(TM) 64-Bit Server VM warning: ignoring option MaxPermSize=256m; support was removed
in 8.0
Tests run: 1, Failures: 0, Errors: 0, Skipped: 0, Time elapsed: 110.032 sec - in org.apache.hadoop.hbase.mapreduce.TestImportTSVWithTTLs
Java HotSpot(TM) 64-Bit Server VM warning: ignoring option MaxPermSize=256m; support was removed
in 8.0
Tests run: 13, Failures: 0, Errors: 0, Skipped: 1, Time elapsed: 621.878 sec - in org.apache.hadoop.hbase.mapreduce.TestHFileOutputFormat
Java HotSpot(TM) 64-Bit Server VM warning: ignoring option MaxPermSize=256m; support was removed
in 8.0
Running org.apache.hadoop.hbase.mapreduce.TestTableInputFormatScan1
Running org.apache.hadoop.hbase.mapreduce.TestLoadIncrementalHFiles
Running org.apache.hadoop.hbase.mapreduce.TestHRegionPartitioner
Tests run: 1, Failures: 0, Errors: 0, Skipped: 0, Time elapsed: 7.956 sec - in org.apache.hadoop.hbase.mapreduce.TestHRegionPartitioner
Java HotSpot(TM) 64-Bit Server VM warning: ignoring option MaxPermSize=256m; support was removed
in 8.0
Running org.apache.hadoop.hbase.mapreduce.TestSecureLoadIncrementalHFiles
Tests run: 7, Failures: 0, Errors: 0, Skipped: 0, Time elapsed: 366.676 sec - in org.apache.hadoop.hbase.mapreduce.TestCellCounter
Java HotSpot(TM) 64-Bit Server VM warning: ignoring option MaxPermSize=256m; support was removed
in 8.0
Tests run: 8, Failures: 0, Errors: 0, Skipped: 0, Time elapsed: 596.646 sec - in org.apache.hadoop.hbase.mapreduce.TestTableSnapshotInputFormat
Java HotSpot(TM) 64-Bit Server VM warning: ignoring option MaxPermSize=256m; support was removed
in 8.0
Running org.apache.hadoop.hbase.mapreduce.TestTableInputFormat
Tests run: 21, Failures: 0, Errors: 0, Skipped: 0, Time elapsed: 313.737 sec - in org.apache.hadoop.hbase.mapreduce.TestLoadIncrementalHFiles
Java HotSpot(TM) 64-Bit Server VM warning: ignoring option MaxPermSize=256m; support was removed
in 8.0
Running org.apache.hadoop.hbase.mapreduce.TestTableInputFormatScan2
Running org.apache.hadoop.hbase.mapreduce.TestImportExport
Tests run: 7, Failures: 0, Errors: 0, Skipped: 0, Time elapsed: 374.616 sec - in org.apache.hadoop.hbase.mapreduce.TestTableInputFormatScan1
Java HotSpot(TM) 64-Bit Server VM warning: ignoring option MaxPermSize=256m; support was removed
in 8.0
Java HotSpot(TM) 64-Bit Server VM warning: ignoring option MaxPermSize=256m; support was removed
in 8.0
Tests run: 21, Failures: 0, Errors: 0, Skipped: 0, Time elapsed: 314.677 sec - in org.apache.hadoop.hbase.mapreduce.TestSecureLoadIncrementalHFiles
Java HotSpot(TM) 64-Bit Server VM warning: ignoring option MaxPermSize=256m; support was removed
in 8.0
Running org.apache.hadoop.hbase.mapreduce.TestRowCounter
Running org.apache.hadoop.hbase.mapreduce.TestCopyTable
Tests run: 8, Failures: 0, Errors: 0, Skipped: 0, Time elapsed: 137.716 sec - in org.apache.hadoop.hbase.mapreduce.TestTableInputFormat
Java HotSpot(TM) 64-Bit Server VM warning: ignoring option MaxPermSize=256m; support was removed
in 8.0
Running org.apache.hadoop.hbase.mapreduce.TestLoadIncrementalHFilesSplitRecovery
Tests run: 5, Failures: 0, Errors: 0, Skipped: 0, Time elapsed: 52.989 sec - in org.apache.hadoop.hbase.mapreduce.TestLoadIncrementalHFilesSplitRecovery
Java HotSpot(TM) 64-Bit Server VM warning: ignoring option MaxPermSize=256m; support was removed
in 8.0
Running org.apache.hadoop.hbase.mapreduce.TestHFileOutputFormat2
Tests run: 5, Failures: 0, Errors: 0, Skipped: 0, Time elapsed: 256.471 sec - in org.apache.hadoop.hbase.mapreduce.TestCopyTable
Java HotSpot(TM) 64-Bit Server VM warning: ignoring option MaxPermSize=256m; support was removed
in 8.0
Java HotSpot(TM) 64-Bit Server VM warning: ignoring option MaxPermSize=256m; support was removed
in 8.0
Running org.apache.hadoop.hbase.mapreduce.TestMultithreadedTableMapper
Tests run: 7, Failures: 0, Errors: 0, Skipped: 0, Time elapsed: 372.447 sec - in org.apache.hadoop.hbase.mapreduce.TestTableInputFormatScan2
Java HotSpot(TM) 64-Bit Server VM warning: ignoring option MaxPermSize=256m; support was removed
in 8.0
Tests run: 6, Failures: 0, Errors: 0, Skipped: 0, Time elapsed: 313.056 sec - in org.apache.hadoop.hbase.mapreduce.TestRowCounter
Java HotSpot(TM) 64-Bit Server VM warning: ignoring option MaxPermSize=256m; support was removed
in 8.0
Running org.apache.hadoop.hbase.mapreduce.TestImportTSVWithVisibilityLabels
Running org.apache.hadoop.hbase.mapreduce.TestImportTsv
Tests run: 1, Failures: 0, Errors: 0, Skipped: 0, Time elapsed: 177.612 sec - in org.apache.hadoop.hbase.mapreduce.TestMultithreadedTableMapper
Java HotSpot(TM) 64-Bit Server VM warning: ignoring option MaxPermSize=256m; support was removed
in 8.0
Running org.apache.hadoop.hbase.mapreduce.TestTableMapReduce
Tests run: 13, Failures: 0, Errors: 0, Skipped: 1, Time elapsed: 442.541 sec - in org.apache.hadoop.hbase.mapreduce.TestHFileOutputFormat2
Java HotSpot(TM) 64-Bit Server VM warning: ignoring option MaxPermSize=256m; support was removed
in 8.0
Tests run: 12, Failures: 0, Errors: 0, Skipped: 0, Time elapsed: 649.738 sec - in org.apache.hadoop.hbase.mapreduce.TestImportExport
Tests run: 2, Failures: 0, Errors: 0, Skipped: 0, Time elapsed: 264.59 sec - in org.apache.hadoop.hbase.mapreduce.TestTableMapReduce
Tests run: 7, Failures: 0, Errors: 0, Skipped: 0, Time elapsed: 463.114 sec - in org.apache.hadoop.hbase.mapreduce.TestImportTSVWithVisibilityLabels

Results :

Tests in error: 
org.apache.hadoop.hbase.procedure.TestZKProcedureControllers.testZKCoordinatorControllerMultipleCohort(org.apache.hadoop.hbase.procedure.TestZKProcedureControllers)
  Run 1: TestZKProcedureControllers.testZKCoordinatorControllerMultipleCohort:168->runMockCommitWithOrchestratedControllers:235->verifyCohort:364

procedureMember.submitSubprocedure(<any>);
Wanted 3 times:
-> at org.apache.hadoop.hbase.procedure.TestZKProcedureControllers.verifyCohort(TestZKProcedureControllers.java:364)
But was 4 times. Undesired invocation:
-> at org.apache.hadoop.hbase.procedure.ZKProcedureMemberRpcs.startNewSubprocedure(ZKProcedureMemberRpcs.java:214)

  Run 2: TestZKProcedureControllers.testZKCoordinatorControllerMultipleCohort:166->runMockCommitWithOrchestratedControllers:191
» ConnectionLoss
  Run 3: TestZKProcedureControllers.testZKCoordinatorControllerMultipleCohort:166->runMockCommitWithOrchestratedControllers:191
» ConnectionLoss

Flaked tests: 
org.apache.hadoop.hbase.client.TestReplicasClient.testSmallScanWithReplicas(org.apache.hadoop.hbase.client.TestReplicasClient)
  Run 1: TestReplicasClient.testSmallScanWithReplicas:612->runMultipleScansOfOneType:692->scanWithReplicas:789
Count of rows 40 num rows expected 100
  Run 2: PASS

org.apache.hadoop.hbase.regionserver.TestFailedAppendAndSync.testLockupAroundBadAssignSync(org.apache.hadoop.hbase.regionserver.TestFailedAppendAndSync)
  Run 1: TestFailedAppendAndSync.testLockupAroundBadAssignSync:239 » TestTimedOut test ...
  Run 2: PASS


Tests run: 2469, Failures: 0, Errors: 1, Skipped: 21, Flakes: 2

[INFO] ------------------------------------------------------------------------
[INFO] Reactor Summary:
[INFO] 
[INFO] Apache HBase ...................................... SUCCESS [5.575s]
[INFO] Apache HBase - Checkstyle ......................... SUCCESS [1.510s]
[INFO] Apache HBase - Resource Bundle .................... SUCCESS [0.466s]
[INFO] Apache HBase - Annotations ........................ SUCCESS [2.184s]
[INFO] Apache HBase - Protocol ........................... SUCCESS [17.986s]
[INFO] Apache HBase - Common ............................. SUCCESS [1:33.803s]
[INFO] Apache HBase - Procedure .......................... SUCCESS [2:46.278s]
[INFO] Apache HBase - Client ............................. SUCCESS [1:30.789s]
[INFO] Apache HBase - Hadoop Compatibility ............... SUCCESS [8.556s]
[INFO] Apache HBase - Hadoop Two Compatibility ........... SUCCESS [8.658s]
[INFO] Apache HBase - Prefix Tree ........................ SUCCESS [10.427s]
[INFO] Apache HBase - Server ............................. FAILURE [2:43:58.339s]
[INFO] Apache HBase - Testing Util ....................... SKIPPED
[INFO] Apache HBase - Thrift ............................. SKIPPED
[INFO] Apache HBase - Rest ............................... SKIPPED
[INFO] Apache HBase - Shell .............................. SKIPPED
[INFO] Apache HBase - Integration Tests .................. SKIPPED
[INFO] Apache HBase - Examples ........................... SKIPPED
[INFO] Apache HBase - Assembly ........................... SKIPPED
[INFO] Apache HBase - Shaded ............................. SKIPPED
[INFO] Apache HBase - Shaded - Client .................... SKIPPED
[INFO] Apache HBase - Shaded - Server .................... SKIPPED
[INFO] ------------------------------------------------------------------------
[INFO] BUILD FAILURE
[INFO] ------------------------------------------------------------------------
[INFO] Total time: 2:50:46.500s
[INFO] Finished at: Sat Apr 02 08:27:29 UTC 2016
[INFO] Final Memory: 440M/994M
[INFO] ------------------------------------------------------------------------
[ERROR] Failed to execute goal org.apache.maven.plugins:maven-surefire-plugin:2.18.1:test
(secondPartTestsExecution) on project hbase-server: There was a timeout or other error in
the fork -> [Help 1]
[ERROR] 
[ERROR] To see the full stack trace of the errors, re-run Maven with the -e switch.
[ERROR] Re-run Maven using the -X switch to enable full debug logging.
[ERROR] 
[ERROR] For more information about the errors and possible solutions, please read the following
articles:
[ERROR] [Help 1] http://cwiki.apache.org/confluence/display/MAVEN/MojoFailureException
[ERROR] 
[ERROR] After correcting the problems, you can resume the build with the command
[ERROR]   mvn <goals> -rf :hbase-server
Build step 'Invoke top-level Maven targets' marked build as failure
Performing Post build task...
Match found for :.* : True
Logical operation result is TRUE
Running script  : # Post-build task script. TODO: Check this in and have all builds reference
check-in.
pwd && ls
# NOTE!!!! The below code has been copied and pasted from ./dev-tools/run-test.sh
# Do not change here without syncing there and vice-versa.
ZOMBIE_TESTS_COUNT=`jps -v | grep surefirebooter | grep -e '-Dhbase.test' | wc -l`
if [[ $ZOMBIE_TESTS_COUNT != 0 ]] ; then
 echo "Suspicious java process found - waiting 30s to see if there are just slow to stop"
 sleep 30
 ZOMBIE_TESTS_COUNT=`jps -v | grep surefirebooter | grep -e '-Dhbase.test' | wc -l`
 if [[ $ZOMBIE_TESTS_COUNT != 0 ]] ; then
   echo " {color:red}There appear to be $ZOMBIE_TESTS_COUNT zombie tests{color}, they should
have been killed by surefire but survived"
   jps -v | grep surefirebooter | grep -e '-Dhbase.test'
   jps -v | grep surefirebooter | grep -e '-Dhbase.test' | cut -d ' ' -f 1 | xargs -n 1 jstack
   # Exit with error
   exit 1
 else
   echo "We're ok: there is no zombie test, but some tests took some time to stop"
 fi
else
  echo "We're ok: there is no zombie test"
fi
[HBase-1.1-JDK8] $ /bin/bash -xe /tmp/hudson4553508215991013782.sh
+ pwd
<https://builds.apache.org/job/HBase-1.1-JDK8/ws/>
+ ls
bin
CHANGES.txt
conf
dev-support
hbase-annotations
hbase-assembly
hbase-checkstyle
hbase-client
hbase-common
hbase-examples
hbase-hadoop2-compat
hbase-hadoop-compat
hbase-it
hbase-native-client
hbase-prefix-tree
hbase-procedure
hbase-protocol
hbase-resource-bundle
hbase-rest
hbase-server
hbase-shaded
hbase-shell
hbase-testing-util
hbase-thrift
LICENSE.txt
NOTICE.txt
pom.xml
README.txt
src
target
++ jps -v
++ grep surefirebooter
++ grep -e -Dhbase.test
++ wc -l
+ ZOMBIE_TESTS_COUNT=0
+ [[ 0 != 0 ]]
+ echo 'We'\''re ok: there is no zombie test'
We're ok: there is no zombie test
POST BUILD TASK : SUCCESS
END OF POST BUILD TASK : 0
Archiving artifacts
Recording test results
Error updating JIRA issues. Saving issues for next build.
java.lang.NullPointerException

Mime
View raw message