hbase-builds mailing list archives

Site index · List index
Message view « Date » · « Thread »
Top « Date » · « Thread »
From Apache Jenkins Server <jenk...@builds.apache.org>
Subject Build failed in Jenkins: HBase-Trunk_matrix » latest1.7,yahoo-not-h2 #910
Date Tue, 10 May 2016 05:50:51 GMT
See <https://builds.apache.org/job/HBase-Trunk_matrix/jdk=latest1.7,label=yahoo-not-h2/910/changes>

Changes:

[stack] HBASE-15236 Inconsistent cell reads over multiple bulk-loaded HFiles. In

[stack] HBASE-15797 TestIPCUtil fails after HBASE-15795

[zhangduo] HBASE-15801 Upgrade checkstyle for all branches

------------------------------------------
[...truncated 6011 lines...]
Running org.apache.hadoop.hbase.client.TestRestoreSnapshotFromClient
Running org.apache.hadoop.hbase.mob.compactions.TestMobCompactor
Tests run: 1, Failures: 0, Errors: 0, Skipped: 0, Time elapsed: 14.371 sec - in org.apache.hadoop.hbase.mob.TestMobDataBlockEncoding
Running org.apache.hadoop.hbase.mob.compactions.TestPartitionedMobCompactor
Tests run: 1, Failures: 0, Errors: 0, Skipped: 0, Time elapsed: 54.204 sec - in org.apache.hadoop.hbase.client.TestClientOperationInterrupt
Tests run: 6, Failures: 0, Errors: 0, Skipped: 0, Time elapsed: 15.657 sec - in org.apache.hadoop.hbase.mob.compactions.TestPartitionedMobCompactor
Running org.apache.hadoop.hbase.mob.mapreduce.TestMobSweepReducer
Running org.apache.hadoop.hbase.mob.mapreduce.TestMobSweepJob
Tests run: 3, Failures: 0, Errors: 0, Skipped: 0, Time elapsed: 2.279 sec - in org.apache.hadoop.hbase.mob.mapreduce.TestMobSweepJob
Running org.apache.hadoop.hbase.mob.TestExpiredMobFileCleaner
Tests run: 5, Failures: 0, Errors: 0, Skipped: 0, Time elapsed: 72.838 sec - in org.apache.hadoop.hbase.mob.compactions.TestMobCompactor
Tests run: 1, Failures: 0, Errors: 0, Skipped: 0, Time elapsed: 9.19 sec - in org.apache.hadoop.hbase.mob.mapreduce.TestMobSweepReducer
Running org.apache.hadoop.hbase.mob.TestDefaultMobStoreFlusher
Running org.apache.hadoop.hbase.master.TestWarmupRegion
Tests run: 1, Failures: 0, Errors: 0, Skipped: 0, Time elapsed: 25.789 sec - in org.apache.hadoop.hbase.mob.TestExpiredMobFileCleaner
Tests run: 2, Failures: 0, Errors: 0, Skipped: 0, Time elapsed: 6.474 sec - in org.apache.hadoop.hbase.mob.TestDefaultMobStoreFlusher
Running org.apache.hadoop.hbase.master.procedure.TestDisableTableProcedure
Running org.apache.hadoop.hbase.master.procedure.TestAddColumnFamilyProcedure
Tests run: 4, Failures: 0, Errors: 0, Skipped: 0, Time elapsed: 10.144 sec - in org.apache.hadoop.hbase.master.procedure.TestDisableTableProcedure
Tests run: 6, Failures: 0, Errors: 0, Skipped: 0, Time elapsed: 21.601 sec - in org.apache.hadoop.hbase.master.procedure.TestAddColumnFamilyProcedure
Running org.apache.hadoop.hbase.master.procedure.TestCreateNamespaceProcedure
Running org.apache.hadoop.hbase.master.procedure.TestServerCrashProcedure
Tests run: 1, Failures: 0, Errors: 0, Skipped: 0, Time elapsed: 51.983 sec - in org.apache.hadoop.hbase.master.TestWarmupRegion
Tests run: 8, Failures: 0, Errors: 0, Skipped: 0, Time elapsed: 12.288 sec - in org.apache.hadoop.hbase.master.procedure.TestCreateNamespaceProcedure
Running org.apache.hadoop.hbase.master.procedure.TestDeleteTableProcedure
Tests run: 5, Failures: 0, Errors: 0, Skipped: 0, Time elapsed: 177.114 sec - in org.apache.hadoop.hbase.client.TestRestoreSnapshotFromClient
Running org.apache.hadoop.hbase.master.procedure.TestProcedureAdmin
Tests run: 7, Failures: 0, Errors: 0, Skipped: 0, Time elapsed: 14.06 sec - in org.apache.hadoop.hbase.master.procedure.TestDeleteTableProcedure
Tests run: 76, Failures: 0, Errors: 0, Skipped: 4, Time elapsed: 241.943 sec - in org.apache.hadoop.hbase.client.TestFromClientSideWithCoprocessor
Tests run: 1, Failures: 0, Errors: 0, Skipped: 0, Time elapsed: 39.293 sec - in org.apache.hadoop.hbase.master.procedure.TestServerCrashProcedure
Tests run: 5, Failures: 0, Errors: 0, Skipped: 0, Time elapsed: 10.684 sec - in org.apache.hadoop.hbase.master.procedure.TestProcedureAdmin
Running org.apache.hadoop.hbase.master.procedure.TestDeleteNamespaceProcedure
Running org.apache.hadoop.hbase.master.procedure.TestDeleteColumnFamilyProcedure
Running org.apache.hadoop.hbase.master.procedure.TestCloneSnapshotProcedure
Tests run: 7, Failures: 0, Errors: 0, Skipped: 0, Time elapsed: 12.871 sec - in org.apache.hadoop.hbase.master.procedure.TestDeleteNamespaceProcedure
Running org.apache.hadoop.hbase.master.procedure.TestModifyNamespaceProcedure
Running org.apache.hadoop.hbase.master.procedure.TestEnableTableProcedure
Tests run: 6, Failures: 0, Errors: 0, Skipped: 0, Time elapsed: 8.758 sec - in org.apache.hadoop.hbase.master.procedure.TestModifyNamespaceProcedure
Running org.apache.hadoop.hbase.master.procedure.TestModifyTableProcedure
Tests run: 5, Failures: 0, Errors: 0, Skipped: 0, Time elapsed: 25.649 sec - in org.apache.hadoop.hbase.master.procedure.TestCloneSnapshotProcedure
Tests run: 8, Failures: 0, Errors: 0, Skipped: 0, Time elapsed: 26.798 sec - in org.apache.hadoop.hbase.master.procedure.TestDeleteColumnFamilyProcedure
Tests run: 5, Failures: 0, Errors: 0, Skipped: 0, Time elapsed: 20.786 sec - in org.apache.hadoop.hbase.master.procedure.TestEnableTableProcedure
Running org.apache.hadoop.hbase.master.procedure.TestMasterProcedureEvents
Running org.apache.hadoop.hbase.master.procedure.TestModifyColumnFamilyProcedure
Running org.apache.hadoop.hbase.master.procedure.TestCreateTableProcedure
Running org.apache.hadoop.hbase.master.procedure.TestRestoreSnapshotProcedure
Tests run: 2, Failures: 0, Errors: 0, Skipped: 0, Time elapsed: 17.615 sec - in org.apache.hadoop.hbase.master.procedure.TestMasterProcedureEvents
Running org.apache.hadoop.hbase.master.procedure.TestWALProcedureStoreOnHDFS
Tests run: 8, Failures: 0, Errors: 0, Skipped: 0, Time elapsed: 41.108 sec - in org.apache.hadoop.hbase.master.procedure.TestModifyTableProcedure
Tests run: 5, Failures: 0, Errors: 0, Skipped: 0, Time elapsed: 22.286 sec - in org.apache.hadoop.hbase.master.procedure.TestModifyColumnFamilyProcedure
Running org.apache.hadoop.hbase.master.TestMasterFailoverBalancerPersistence
Running org.apache.hadoop.hbase.master.procedure.TestTruncateTableProcedure
Tests run: 9, Failures: 0, Errors: 0, Skipped: 0, Time elapsed: 48.184 sec - in org.apache.hadoop.hbase.master.procedure.TestCreateTableProcedure
Running org.apache.hadoop.hbase.master.TestMasterFailover
Tests run: 3, Failures: 0, Errors: 0, Skipped: 0, Time elapsed: 50.371 sec - in org.apache.hadoop.hbase.master.procedure.TestWALProcedureStoreOnHDFS
Tests run: 1, Failures: 0, Errors: 0, Skipped: 0, Time elapsed: 41.051 sec - in org.apache.hadoop.hbase.master.TestMasterFailoverBalancerPersistence
Tests run: 6, Failures: 0, Errors: 0, Skipped: 0, Time elapsed: 51.457 sec - in org.apache.hadoop.hbase.master.procedure.TestTruncateTableProcedure
Running org.apache.hadoop.hbase.master.TestTableStateManager
Running org.apache.hadoop.hbase.master.TestMetaShutdownHandler
Running org.apache.hadoop.hbase.master.TestAssignmentManagerOnCluster
Tests run: 5, Failures: 0, Errors: 0, Skipped: 0, Time elapsed: 109.383 sec - in org.apache.hadoop.hbase.master.procedure.TestRestoreSnapshotProcedure
Running org.apache.hadoop.hbase.master.TestMasterShutdown
Tests run: 3, Failures: 0, Errors: 0, Skipped: 0, Time elapsed: 82.628 sec - in org.apache.hadoop.hbase.master.TestMasterFailover
Tests run: 1, Failures: 0, Errors: 0, Skipped: 0, Time elapsed: 34.911 sec - in org.apache.hadoop.hbase.master.TestMetaShutdownHandler
Tests run: 1, Failures: 0, Errors: 0, Skipped: 0, Time elapsed: 37.077 sec - in org.apache.hadoop.hbase.master.TestTableStateManager
Running org.apache.hadoop.hbase.master.TestMasterNoCluster
Running org.apache.hadoop.hbase.master.balancer.TestStochasticLoadBalancer
Tests run: 2, Failures: 0, Errors: 0, Skipped: 0, Time elapsed: 40.043 sec - in org.apache.hadoop.hbase.master.TestMasterShutdown
Running org.apache.hadoop.hbase.master.balancer.TestDefaultLoadBalancer
Running org.apache.hadoop.hbase.master.TestMasterFileSystem
Tests run: 3, Failures: 0, Errors: 0, Skipped: 0, Time elapsed: 22.698 sec - in org.apache.hadoop.hbase.master.TestMasterNoCluster
Tests run: 1, Failures: 0, Errors: 0, Skipped: 0, Time elapsed: 7.536 sec - in org.apache.hadoop.hbase.master.balancer.TestDefaultLoadBalancer
Tests run: 1, Failures: 0, Errors: 0, Skipped: 0, Time elapsed: 2.463 sec - in org.apache.hadoop.hbase.master.TestMasterFileSystem
Running org.apache.hadoop.hbase.master.balancer.TestStochasticLoadBalancer2
Running org.apache.hadoop.hbase.master.balancer.TestBaseLoadBalancer
Tests run: 6, Failures: 0, Errors: 0, Skipped: 0, Time elapsed: 1.534 sec - in org.apache.hadoop.hbase.master.balancer.TestBaseLoadBalancer
Running org.apache.hadoop.hbase.master.TestActiveMasterManager
Tests run: 2, Failures: 0, Errors: 0, Skipped: 0, Time elapsed: 3.693 sec - in org.apache.hadoop.hbase.master.TestActiveMasterManager
Running org.apache.hadoop.hbase.master.TestRegionPlacement2
Tests run: 2, Failures: 0, Errors: 0, Skipped: 0, Time elapsed: 6.502 sec - in org.apache.hadoop.hbase.master.TestRegionPlacement2
Running org.apache.hadoop.hbase.master.TestMasterWalManager
Running org.apache.hadoop.hbase.master.TestRestartCluster
Tests run: 1, Failures: 0, Errors: 0, Skipped: 0, Time elapsed: 2.052 sec - in org.apache.hadoop.hbase.master.TestMasterWalManager
Running org.apache.hadoop.hbase.master.TestMasterTransitions
Tests run: 3, Failures: 0, Errors: 0, Skipped: 3, Time elapsed: 0.004 sec - in org.apache.hadoop.hbase.master.TestMasterTransitions
Running org.apache.hadoop.hbase.master.TestTableLockManager
Tests run: 22, Failures: 0, Errors: 0, Skipped: 0, Time elapsed: 139.914 sec - in org.apache.hadoop.hbase.master.TestAssignmentManagerOnCluster
Running org.apache.hadoop.hbase.master.handler.TestTableDescriptorModification
Tests run: 2, Failures: 0, Errors: 0, Skipped: 0, Time elapsed: 75.075 sec - in org.apache.hadoop.hbase.master.TestRestartCluster
Tests run: 7, Failures: 0, Errors: 0, Skipped: 0, Time elapsed: 39.38 sec - in org.apache.hadoop.hbase.master.handler.TestTableDescriptorModification
Running org.apache.hadoop.hbase.master.handler.TestTableDeleteFamilyHandler
Running org.apache.hadoop.hbase.master.handler.TestEnableTableHandler
Tests run: 2, Failures: 0, Errors: 0, Skipped: 0, Time elapsed: 31.226 sec - in org.apache.hadoop.hbase.master.handler.TestTableDeleteFamilyHandler
Running org.apache.hadoop.hbase.master.TestGetLastFlushedSequenceId
Tests run: 4, Failures: 0, Errors: 0, Skipped: 0, Time elapsed: 160.904 sec - in org.apache.hadoop.hbase.master.TestTableLockManager
Running org.apache.hadoop.hbase.master.TestRollingRestart
Tests run: 2, Failures: 0, Errors: 0, Skipped: 0, Time elapsed: 66.953 sec - in org.apache.hadoop.hbase.master.handler.TestEnableTableHandler
Tests run: 1, Failures: 0, Errors: 0, Skipped: 0, Time elapsed: 35.109 sec - in org.apache.hadoop.hbase.master.TestGetLastFlushedSequenceId
Running org.apache.hadoop.hbase.master.TestSplitLogManager
Running org.apache.hadoop.hbase.master.TestHMasterRPCException
Tests run: 1, Failures: 0, Errors: 0, Skipped: 0, Time elapsed: 9.358 sec - in org.apache.hadoop.hbase.master.TestHMasterRPCException
Running org.apache.hadoop.hbase.master.TestMaster
Tests run: 1, Failures: 0, Errors: 0, Skipped: 0, Time elapsed: 59.81 sec - in org.apache.hadoop.hbase.master.TestRollingRestart
Running org.apache.hadoop.hbase.master.TestClusterStatusPublisher
Tests run: 3, Failures: 0, Errors: 0, Skipped: 0, Time elapsed: 1.024 sec - in org.apache.hadoop.hbase.master.TestClusterStatusPublisher
Running org.apache.hadoop.hbase.master.TestGetInfoPort
Tests run: 4, Failures: 0, Errors: 0, Skipped: 0, Time elapsed: 25.144 sec - in org.apache.hadoop.hbase.master.TestMaster
Tests run: 1, Failures: 0, Errors: 0, Skipped: 0, Time elapsed: 23.916 sec - in org.apache.hadoop.hbase.master.TestGetInfoPort
Running org.apache.hadoop.hbase.master.TestDeadServer
Tests run: 4, Failures: 0, Errors: 0, Skipped: 0, Time elapsed: 3.895 sec - in org.apache.hadoop.hbase.master.TestDeadServer
Tests run: 20, Failures: 0, Errors: 0, Skipped: 1, Time elapsed: 345.928 sec - in org.apache.hadoop.hbase.master.balancer.TestStochasticLoadBalancer
Running org.apache.hadoop.hbase.master.TestMasterStatusServlet
Running org.apache.hadoop.hbase.master.cleaner.TestHFileLinkCleaner
Tests run: 4, Failures: 0, Errors: 0, Skipped: 0, Time elapsed: 4.831 sec - in org.apache.hadoop.hbase.master.TestMasterStatusServlet
Running org.apache.hadoop.hbase.master.normalizer.TestSimpleRegionNormalizerOnCluster
Tests run: 1, Failures: 0, Errors: 0, Skipped: 0, Time elapsed: 12.897 sec - in org.apache.hadoop.hbase.master.cleaner.TestHFileLinkCleaner
Running org.apache.hadoop.hbase.master.cleaner.TestHFileCleaner
Tests run: 3, Failures: 0, Errors: 0, Skipped: 0, Time elapsed: 2.532 sec - in org.apache.hadoop.hbase.master.cleaner.TestHFileCleaner
Running org.apache.hadoop.hbase.master.cleaner.TestSnapshotFromMaster
Running org.apache.hadoop.hbase.master.cleaner.TestLogsCleaner
Tests run: 15, Failures: 0, Errors: 0, Skipped: 1, Time elapsed: 149.131 sec - in org.apache.hadoop.hbase.master.TestSplitLogManager
Tests run: 3, Failures: 0, Errors: 0, Skipped: 0, Time elapsed: 13.913 sec - in org.apache.hadoop.hbase.master.cleaner.TestLogsCleaner
Tests run: 2, Failures: 0, Errors: 0, Skipped: 0, Time elapsed: 47.414 sec - in org.apache.hadoop.hbase.master.normalizer.TestSimpleRegionNormalizerOnCluster
Running org.apache.hadoop.hbase.master.TestDistributedLogSplitting
Running org.apache.hadoop.hbase.master.TestMasterMetrics
Tests run: 3, Failures: 0, Errors: 0, Skipped: 0, Time elapsed: 2.572 sec - in org.apache.hadoop.hbase.master.TestMasterMetrics
Tests run: 4, Failures: 0, Errors: 0, Skipped: 0, Time elapsed: 50.843 sec - in org.apache.hadoop.hbase.master.cleaner.TestSnapshotFromMaster
Running org.apache.hadoop.hbase.master.TestMasterRestartAfterDisablingTable
Running org.apache.hadoop.hbase.master.TestRegionPlacement
Tests run: 2, Failures: 0, Errors: 0, Skipped: 2, Time elapsed: 0.007 sec - in org.apache.hadoop.hbase.master.TestRegionPlacement
Running org.apache.hadoop.hbase.master.TestMasterOperationsForRegionReplicas
Running org.apache.hadoop.hbase.master.TestAssignmentListener
Tests run: 1, Failures: 0, Errors: 0, Skipped: 0, Time elapsed: 36.752 sec - in org.apache.hadoop.hbase.master.TestMasterRestartAfterDisablingTable
Tests run: 2, Failures: 0, Errors: 0, Skipped: 0, Time elapsed: 33.656 sec - in org.apache.hadoop.hbase.master.TestMasterOperationsForRegionReplicas
Tests run: 2, Failures: 0, Errors: 0, Skipped: 0, Time elapsed: 12.164 sec - in org.apache.hadoop.hbase.master.TestAssignmentListener
Tests run: 18, Failures: 0, Errors: 0, Skipped: 15, Time elapsed: 68.669 sec - in org.apache.hadoop.hbase.master.TestDistributedLogSplitting
Running org.apache.hadoop.hbase.snapshot.TestSnapshotClientRetries
Running org.apache.hadoop.hbase.master.snapshot.TestSnapshotFileCache
Running org.apache.hadoop.hbase.master.TestMasterMetricsWrapper
Tests run: 1, Failures: 0, Errors: 0, Skipped: 0, Time elapsed: 4.393 sec - in org.apache.hadoop.hbase.master.TestMasterMetricsWrapper
Running org.apache.hadoop.hbase.snapshot.TestExportSnapshot
Tests run: 2, Failures: 0, Errors: 0, Skipped: 0, Time elapsed: 41.735 sec - in org.apache.hadoop.hbase.snapshot.TestSnapshotClientRetries
Running org.apache.hadoop.hbase.snapshot.TestFlushSnapshotFromClient
Running org.apache.hadoop.hbase.snapshot.TestMobFlushSnapshotFromClient
Tests run: 4, Failures: 0, Errors: 0, Skipped: 0, Time elapsed: 79.627 sec - in org.apache.hadoop.hbase.master.snapshot.TestSnapshotFileCache
Tests run: 4, Failures: 1, Errors: 0, Skipped: 0, Time elapsed: 550.478 sec <<< FAILURE!
- in org.apache.hadoop.hbase.master.balancer.TestStochasticLoadBalancer2
testRegionReplicasOnMidClusterHighReplication(org.apache.hadoop.hbase.master.balancer.TestStochasticLoadBalancer2)
 Time elapsed: 121.387 sec  <<< FAILURE!
java.lang.AssertionError: Two or more region replicas are hosted on the same host after balance
	at org.junit.Assert.fail(Assert.java:88)
	at org.apache.hadoop.hbase.master.balancer.BalancerTestBase.assertRegionReplicaPlacement(BalancerTestBase.java:225)
	at org.apache.hadoop.hbase.master.balancer.BalancerTestBase.testWithCluster(BalancerTestBase.java:450)
	at org.apache.hadoop.hbase.master.balancer.BalancerTestBase.testWithCluster(BalancerTestBase.java:422)
	at org.apache.hadoop.hbase.master.balancer.TestStochasticLoadBalancer2.testRegionReplicasOnMidClusterHighReplication(TestStochasticLoadBalancer2.java:73)

Running org.apache.hadoop.hbase.snapshot.TestSnapshotDescriptionUtils
Tests run: 2, Failures: 0, Errors: 0, Skipped: 0, Time elapsed: 0.459 sec - in org.apache.hadoop.hbase.snapshot.TestSnapshotDescriptionUtils
Running org.apache.hadoop.hbase.snapshot.TestMobRestoreFlushSnapshotFromClient
Running org.apache.hadoop.hbase.snapshot.TestMobSecureExportSnapshot
Tests run: 9, Failures: 0, Errors: 0, Skipped: 0, Time elapsed: 148.863 sec - in org.apache.hadoop.hbase.snapshot.TestFlushSnapshotFromClient
Tests run: 9, Failures: 0, Errors: 0, Skipped: 0, Time elapsed: 174.925 sec - in org.apache.hadoop.hbase.snapshot.TestMobFlushSnapshotFromClient
Running org.apache.hadoop.hbase.snapshot.TestMobExportSnapshot
Running org.apache.hadoop.hbase.snapshot.TestRestoreFlushSnapshotFromClient
Tests run: 5, Failures: 0, Errors: 0, Skipped: 0, Time elapsed: 283.863 sec - in org.apache.hadoop.hbase.snapshot.TestMobRestoreFlushSnapshotFromClient
Tests run: 5, Failures: 0, Errors: 0, Skipped: 0, Time elapsed: 144.64 sec - in org.apache.hadoop.hbase.snapshot.TestRestoreFlushSnapshotFromClient
Running org.apache.hadoop.hbase.snapshot.TestSecureExportSnapshot
Tests run: 9, Failures: 0, Errors: 0, Skipped: 0, Time elapsed: 717.731 sec - in org.apache.hadoop.hbase.snapshot.TestExportSnapshot
Tests run: 9, Failures: 0, Errors: 0, Skipped: 0, Time elapsed: 761.514 sec - in org.apache.hadoop.hbase.snapshot.TestMobSecureExportSnapshot
Tests run: 9, Failures: 0, Errors: 0, Skipped: 0, Time elapsed: 718.408 sec - in org.apache.hadoop.hbase.snapshot.TestMobExportSnapshot
Tests run: 9, Failures: 0, Errors: 0, Skipped: 0, Time elapsed: 608.738 sec - in org.apache.hadoop.hbase.snapshot.TestSecureExportSnapshot

Results :

Failed tests: 
  TestFastFail.testCallQueueTooBigException:327 There should have been 1 hit expected:<1>
but was:<0>
  TestStochasticLoadBalancer2.testRegionReplicasOnMidClusterHighReplication:73->BalancerTestBase.testWithCluster:422->BalancerTestBase.testWithCluster:450->BalancerTestBase.assertRegionReplicaPlacement:225
Two or more region replicas are hosted on the same host after balance
  TestRegionServerMetrics.testMobMetrics:605 Metrics Counters should be equal expected:<3>
but was:<1>

Tests run: 2627, Failures: 3, Errors: 0, Skipped: 65

[INFO] ------------------------------------------------------------------------
[INFO] Reactor Summary:
[INFO] 
[INFO] Apache HBase ...................................... SUCCESS [  3.609 s]
[INFO] Apache HBase - Checkstyle ......................... SUCCESS [  0.902 s]
[INFO] Apache HBase - Resource Bundle .................... SUCCESS [  0.300 s]
[INFO] Apache HBase - Annotations ........................ SUCCESS [  0.331 s]
[INFO] Apache HBase - Protocol ........................... SUCCESS [  4.031 s]
[INFO] Apache HBase - Common ............................. SUCCESS [01:40 min]
[INFO] Apache HBase - Procedure .......................... SUCCESS [02:41 min]
[INFO] Apache HBase - Client ............................. SUCCESS [ 54.811 s]
[INFO] Apache HBase - Hadoop Compatibility ............... SUCCESS [  8.637 s]
[INFO] Apache HBase - Hadoop Two Compatibility ........... SUCCESS [ 12.498 s]
[INFO] Apache HBase - Prefix Tree ........................ SUCCESS [ 15.819 s]
[INFO] Apache HBase - Server ............................. FAILURE [  02:06 h]
[INFO] Apache HBase - Testing Util ....................... SKIPPED
[INFO] Apache HBase - Thrift ............................. SKIPPED
[INFO] Apache HBase - RSGroup ............................ SKIPPED
[INFO] Apache HBase - Shell .............................. SKIPPED
[INFO] Apache HBase - Integration Tests .................. SKIPPED
[INFO] Apache HBase - Examples ........................... SKIPPED
[INFO] Apache HBase - Rest ............................... SKIPPED
[INFO] Apache HBase - External Block Cache ............... SKIPPED
[INFO] Apache HBase - Spark .............................. SKIPPED
[INFO] Apache HBase - Assembly ........................... SKIPPED
[INFO] Apache HBase - Shaded ............................. SKIPPED
[INFO] Apache HBase - Shaded - Client .................... SKIPPED
[INFO] Apache HBase - Shaded - Server .................... SKIPPED
[INFO] Apache HBase - Archetypes ......................... SKIPPED
[INFO] Apache HBase - Exemplar for hbase-client archetype  SKIPPED
[INFO] Apache HBase - Exemplar for hbase-shaded-client archetype  SKIPPED
[INFO] Apache HBase - Archetype builder .................. SKIPPED
[INFO] ------------------------------------------------------------------------
[INFO] BUILD FAILURE
[INFO] ------------------------------------------------------------------------
[INFO] Total time: 02:12 h
[INFO] Finished at: 2016-05-10T05:45:44+00:00
[INFO] Final Memory: 69M/737M
[INFO] ------------------------------------------------------------------------
[ERROR] Failed to execute goal org.apache.maven.plugins:maven-surefire-plugin:2.18.1:test
(secondPartTestsExecution) on project hbase-server: There are test failures.
[ERROR] 
[ERROR] Please refer to <https://builds.apache.org/job/HBase-Trunk_matrix/jdk=latest1.7,label=yahoo-not-h2/ws/hbase-server/target/surefire-reports>
for the individual test results.
[ERROR] -> [Help 1]
[ERROR] 
[ERROR] To see the full stack trace of the errors, re-run Maven with the -e switch.
[ERROR] Re-run Maven using the -X switch to enable full debug logging.
[ERROR] 
[ERROR] For more information about the errors and possible solutions, please read the following
articles:
[ERROR] [Help 1] http://cwiki.apache.org/confluence/display/MAVEN/MojoFailureException
[ERROR] 
[ERROR] After correcting the problems, you can resume the build with the command
[ERROR]   mvn <goals> -rf :hbase-server
Build step 'Invoke top-level Maven targets' marked build as failure
Performing Post build task...
Match found for :.* : True
Logical operation result is TRUE
Running script  : # Run zombie detector script
./dev-support/zombie-detector.sh --jenkins ${BUILD_ID}
[yahoo-not-h2] $ /bin/bash -xe /tmp/hudson3044399996784932755.sh
+ ./dev-support/zombie-detector.sh --jenkins 910
Tue May 10 05:45:46 UTC 2016 We're ok: there is no zombie test


    {color:green}+1 zombies{color}. No zombie tests found running at the end of the build.
POST BUILD TASK : SUCCESS
END OF POST BUILD TASK : 0
Archiving artifacts
Recording test results
[FINDBUGS] Skipping publisher since build result is FAILURE
[CHECKSTYLE] Skipping publisher since build result is FAILURE

Mime
View raw message