hbase-builds mailing list archives

Site index · List index
Message view « Date » · « Thread »
Top « Date » · « Thread »
From Apache Jenkins Server <jenk...@builds.apache.org>
Subject Build failed in Jenkins: HBase-Trunk_matrix » latest1.8,yahoo-not-h2 #886
Date Tue, 03 May 2016 04:50:19 GMT
See <https://builds.apache.org/job/HBase-Trunk_matrix/jdk=latest1.8,label=yahoo-not-h2/886/changes>

Changes:

[antonov] HBASE-15281 Allow the FileSystem inside HFileSystem to be wrapped

[antonov] HBASE-15703 Deadline scheduler needs to return to the client info about

------------------------------------------
[...truncated 7187 lines...]
Running org.apache.hadoop.hbase.master.TestAssignmentManagerOnCluster
Tests run: 3, Failures: 0, Errors: 0, Skipped: 0, Time elapsed: 63.388 sec - in org.apache.hadoop.hbase.master.TestMasterFailover
Java HotSpot(TM) 64-Bit Server VM warning: ignoring option MaxPermSize=256m; support was removed
in 8.0
Running org.apache.hadoop.hbase.master.TestMasterShutdown
Tests run: 1, Failures: 0, Errors: 0, Skipped: 0, Time elapsed: 27.711 sec - in org.apache.hadoop.hbase.master.TestTableStateManager
Tests run: 1, Failures: 0, Errors: 0, Skipped: 0, Time elapsed: 33.265 sec - in org.apache.hadoop.hbase.master.TestMetaShutdownHandler
Java HotSpot(TM) 64-Bit Server VM warning: ignoring option MaxPermSize=256m; support was removed
in 8.0
Java HotSpot(TM) 64-Bit Server VM warning: ignoring option MaxPermSize=256m; support was removed
in 8.0
Running org.apache.hadoop.hbase.master.TestMasterNoCluster
Tests run: 8, Failures: 0, Errors: 0, Skipped: 0, Time elapsed: 141.026 sec - in org.apache.hadoop.hbase.master.procedure.TestMasterFailoverWithProcedures
Java HotSpot(TM) 64-Bit Server VM warning: ignoring option MaxPermSize=256m; support was removed
in 8.0
Java HotSpot(TM) 64-Bit Server VM warning: ignoring option MaxPermSize=256m; support was removed
in 8.0
Running org.apache.hadoop.hbase.master.TestMasterFileSystem
Tests run: 3, Failures: 0, Errors: 0, Skipped: 0, Time elapsed: 19.507 sec - in org.apache.hadoop.hbase.master.TestMasterNoCluster
Running org.apache.hadoop.hbase.master.balancer.TestStochasticLoadBalancer
Java HotSpot(TM) 64-Bit Server VM warning: ignoring option MaxPermSize=256m; support was removed
in 8.0
Tests run: 2, Failures: 0, Errors: 0, Skipped: 0, Time elapsed: 1.786 sec - in org.apache.hadoop.hbase.master.TestMasterFileSystem
Java HotSpot(TM) 64-Bit Server VM warning: ignoring option MaxPermSize=256m; support was removed
in 8.0
Java HotSpot(TM) 64-Bit Server VM warning: ignoring option MaxPermSize=256m; support was removed
in 8.0
Running org.apache.hadoop.hbase.master.balancer.TestStochasticLoadBalancer2
Running org.apache.hadoop.hbase.master.balancer.TestDefaultLoadBalancer
Tests run: 2, Failures: 0, Errors: 0, Skipped: 0, Time elapsed: 31.426 sec - in org.apache.hadoop.hbase.master.TestMasterShutdown
Java HotSpot(TM) 64-Bit Server VM warning: ignoring option MaxPermSize=256m; support was removed
in 8.0
Java HotSpot(TM) 64-Bit Server VM warning: ignoring option MaxPermSize=256m; support was removed
in 8.0
Tests run: 1, Failures: 0, Errors: 0, Skipped: 0, Time elapsed: 5.633 sec - in org.apache.hadoop.hbase.master.balancer.TestDefaultLoadBalancer
Java HotSpot(TM) 64-Bit Server VM warning: ignoring option MaxPermSize=256m; support was removed
in 8.0
Running org.apache.hadoop.hbase.master.balancer.TestBaseLoadBalancer
Java HotSpot(TM) 64-Bit Server VM warning: ignoring option MaxPermSize=256m; support was removed
in 8.0
Tests run: 6, Failures: 0, Errors: 0, Skipped: 0, Time elapsed: 1.069 sec - in org.apache.hadoop.hbase.master.balancer.TestBaseLoadBalancer
Java HotSpot(TM) 64-Bit Server VM warning: ignoring option MaxPermSize=256m; support was removed
in 8.0
Running org.apache.hadoop.hbase.master.TestActiveMasterManager
Tests run: 2, Failures: 0, Errors: 0, Skipped: 0, Time elapsed: 2.569 sec - in org.apache.hadoop.hbase.master.TestActiveMasterManager
Java HotSpot(TM) 64-Bit Server VM warning: ignoring option MaxPermSize=256m; support was removed
in 8.0
Running org.apache.hadoop.hbase.master.TestRestartCluster
Running org.apache.hadoop.hbase.master.TestRegionPlacement2
Tests run: 2, Failures: 0, Errors: 0, Skipped: 0, Time elapsed: 3.693 sec - in org.apache.hadoop.hbase.master.TestRegionPlacement2
Java HotSpot(TM) 64-Bit Server VM warning: ignoring option MaxPermSize=256m; support was removed
in 8.0
Running org.apache.hadoop.hbase.master.TestMasterTransitions
Tests run: 3, Failures: 0, Errors: 0, Skipped: 3, Time elapsed: 0.002 sec - in org.apache.hadoop.hbase.master.TestMasterTransitions
Java HotSpot(TM) 64-Bit Server VM warning: ignoring option MaxPermSize=256m; support was removed
in 8.0
Running org.apache.hadoop.hbase.master.TestTableLockManager
Tests run: 22, Failures: 0, Errors: 0, Skipped: 0, Time elapsed: 117.81 sec - in org.apache.hadoop.hbase.master.TestAssignmentManagerOnCluster
Java HotSpot(TM) 64-Bit Server VM warning: ignoring option MaxPermSize=256m; support was removed
in 8.0
Tests run: 2, Failures: 0, Errors: 0, Skipped: 0, Time elapsed: 66.546 sec - in org.apache.hadoop.hbase.master.TestRestartCluster
Java HotSpot(TM) 64-Bit Server VM warning: ignoring option MaxPermSize=256m; support was removed
in 8.0
Running org.apache.hadoop.hbase.master.handler.TestTableDescriptorModification
Running org.apache.hadoop.hbase.master.handler.TestTableDeleteFamilyHandler
Tests run: 7, Failures: 0, Errors: 0, Skipped: 0, Time elapsed: 36.029 sec - in org.apache.hadoop.hbase.master.handler.TestTableDescriptorModification
Java HotSpot(TM) 64-Bit Server VM warning: ignoring option MaxPermSize=256m; support was removed
in 8.0
Tests run: 2, Failures: 0, Errors: 0, Skipped: 0, Time elapsed: 19.516 sec - in org.apache.hadoop.hbase.master.handler.TestTableDeleteFamilyHandler
Java HotSpot(TM) 64-Bit Server VM warning: ignoring option MaxPermSize=256m; support was removed
in 8.0
Running org.apache.hadoop.hbase.master.handler.TestEnableTableHandler
Running org.apache.hadoop.hbase.master.TestGetLastFlushedSequenceId
Tests run: 1, Failures: 0, Errors: 0, Skipped: 0, Time elapsed: 29.519 sec - in org.apache.hadoop.hbase.master.TestGetLastFlushedSequenceId
Java HotSpot(TM) 64-Bit Server VM warning: ignoring option MaxPermSize=256m; support was removed
in 8.0
Running org.apache.hadoop.hbase.master.TestRollingRestart
Tests run: 4, Failures: 0, Errors: 0, Skipped: 0, Time elapsed: 129.41 sec - in org.apache.hadoop.hbase.master.TestTableLockManager
Java HotSpot(TM) 64-Bit Server VM warning: ignoring option MaxPermSize=256m; support was removed
in 8.0
Java HotSpot(TM) 64-Bit Server VM warning: ignoring option MaxPermSize=256m; support was removed
in 8.0
Running org.apache.hadoop.hbase.master.TestHMasterRPCException
Tests run: 2, Failures: 0, Errors: 0, Skipped: 0, Time elapsed: 47.843 sec - in org.apache.hadoop.hbase.master.handler.TestEnableTableHandler
Java HotSpot(TM) 64-Bit Server VM warning: ignoring option MaxPermSize=256m; support was removed
in 8.0
Running org.apache.hadoop.hbase.master.TestSplitLogManager
Tests run: 1, Failures: 0, Errors: 0, Skipped: 0, Time elapsed: 7.121 sec - in org.apache.hadoop.hbase.master.TestHMasterRPCException
Java HotSpot(TM) 64-Bit Server VM warning: ignoring option MaxPermSize=256m; support was removed
in 8.0
Running org.apache.hadoop.hbase.master.TestMaster
Tests run: 1, Failures: 0, Errors: 0, Skipped: 0, Time elapsed: 47.408 sec - in org.apache.hadoop.hbase.master.TestRollingRestart
Java HotSpot(TM) 64-Bit Server VM warning: ignoring option MaxPermSize=256m; support was removed
in 8.0
Running org.apache.hadoop.hbase.master.TestClusterStatusPublisher
Tests run: 3, Failures: 0, Errors: 0, Skipped: 0, Time elapsed: 0.55 sec - in org.apache.hadoop.hbase.master.TestClusterStatusPublisher
Java HotSpot(TM) 64-Bit Server VM warning: ignoring option MaxPermSize=256m; support was removed
in 8.0
Running org.apache.hadoop.hbase.master.TestGetInfoPort
Tests run: 4, Failures: 0, Errors: 0, Skipped: 0, Time elapsed: 15.276 sec - in org.apache.hadoop.hbase.master.TestMaster
Java HotSpot(TM) 64-Bit Server VM warning: ignoring option MaxPermSize=256m; support was removed
in 8.0
Tests run: 1, Failures: 0, Errors: 0, Skipped: 0, Time elapsed: 20.718 sec - in org.apache.hadoop.hbase.master.TestGetInfoPort
Java HotSpot(TM) 64-Bit Server VM warning: ignoring option MaxPermSize=256m; support was removed
in 8.0
Java HotSpot(TM) 64-Bit Server VM warning: ignoring option MaxPermSize=256m; support was removed
in 8.0
Running org.apache.hadoop.hbase.master.TestDeadServer
Tests run: 4, Failures: 0, Errors: 0, Skipped: 0, Time elapsed: 2.947 sec - in org.apache.hadoop.hbase.master.TestDeadServer
Java HotSpot(TM) 64-Bit Server VM warning: ignoring option MaxPermSize=256m; support was removed
in 8.0
Running org.apache.hadoop.hbase.master.TestMasterStatusServlet
Tests run: 4, Failures: 0, Errors: 0, Skipped: 0, Time elapsed: 2.661 sec - in org.apache.hadoop.hbase.master.TestMasterStatusServlet
Java HotSpot(TM) 64-Bit Server VM warning: ignoring option MaxPermSize=256m; support was removed
in 8.0
Running org.apache.hadoop.hbase.master.cleaner.TestHFileLinkCleaner
Running org.apache.hadoop.hbase.master.normalizer.TestSimpleRegionNormalizerOnCluster
Tests run: 1, Failures: 0, Errors: 0, Skipped: 0, Time elapsed: 11.284 sec - in org.apache.hadoop.hbase.master.cleaner.TestHFileLinkCleaner
Java HotSpot(TM) 64-Bit Server VM warning: ignoring option MaxPermSize=256m; support was removed
in 8.0
Running org.apache.hadoop.hbase.master.cleaner.TestSnapshotFromMaster
Tests run: 2, Failures: 0, Errors: 0, Skipped: 0, Time elapsed: 48.023 sec - in org.apache.hadoop.hbase.master.normalizer.TestSimpleRegionNormalizerOnCluster
Java HotSpot(TM) 64-Bit Server VM warning: ignoring option MaxPermSize=256m; support was removed
in 8.0
Tests run: 20, Failures: 0, Errors: 0, Skipped: 1, Time elapsed: 314.575 sec - in org.apache.hadoop.hbase.master.balancer.TestStochasticLoadBalancer
Java HotSpot(TM) 64-Bit Server VM warning: ignoring option MaxPermSize=256m; support was removed
in 8.0
Java HotSpot(TM) 64-Bit Server VM warning: ignoring option MaxPermSize=256m; support was removed
in 8.0
Java HotSpot(TM) 64-Bit Server VM warning: ignoring option MaxPermSize=256m; support was removed
in 8.0
Running org.apache.hadoop.hbase.master.cleaner.TestLogsCleaner
Tests run: 15, Failures: 0, Errors: 0, Skipped: 1, Time elapsed: 145.004 sec - in org.apache.hadoop.hbase.master.TestSplitLogManager
Java HotSpot(TM) 64-Bit Server VM warning: ignoring option MaxPermSize=256m; support was removed
in 8.0
Running org.apache.hadoop.hbase.master.cleaner.TestHFileCleaner
Tests run: 3, Failures: 0, Errors: 0, Skipped: 0, Time elapsed: 2.719 sec - in org.apache.hadoop.hbase.master.cleaner.TestHFileCleaner
Java HotSpot(TM) 64-Bit Server VM warning: ignoring option MaxPermSize=256m; support was removed
in 8.0
Tests run: 4, Failures: 0, Errors: 0, Skipped: 0, Time elapsed: 50.168 sec - in org.apache.hadoop.hbase.master.cleaner.TestSnapshotFromMaster
Java HotSpot(TM) 64-Bit Server VM warning: ignoring option MaxPermSize=256m; support was removed
in 8.0
Tests run: 3, Failures: 0, Errors: 0, Skipped: 0, Time elapsed: 18.095 sec - in org.apache.hadoop.hbase.master.cleaner.TestLogsCleaner
Java HotSpot(TM) 64-Bit Server VM warning: ignoring option MaxPermSize=256m; support was removed
in 8.0
Java HotSpot(TM) 64-Bit Server VM warning: ignoring option MaxPermSize=256m; support was removed
in 8.0
Running org.apache.hadoop.hbase.master.TestMasterRestartAfterDisablingTable
Running org.apache.hadoop.hbase.master.TestDistributedLogSplitting
Running org.apache.hadoop.hbase.master.TestMasterMetrics
Tests run: 3, Failures: 0, Errors: 0, Skipped: 0, Time elapsed: 2.063 sec - in org.apache.hadoop.hbase.master.TestMasterMetrics
Java HotSpot(TM) 64-Bit Server VM warning: ignoring option MaxPermSize=256m; support was removed
in 8.0
Running org.apache.hadoop.hbase.master.TestRegionPlacement
Tests run: 2, Failures: 0, Errors: 0, Skipped: 2, Time elapsed: 0.005 sec - in org.apache.hadoop.hbase.master.TestRegionPlacement
Java HotSpot(TM) 64-Bit Server VM warning: ignoring option MaxPermSize=256m; support was removed
in 8.0
Java HotSpot(TM) 64-Bit Server VM warning: ignoring option MaxPermSize=256m; support was removed
in 8.0
Java HotSpot(TM) 64-Bit Server VM warning: ignoring option MaxPermSize=256m; support was removed
in 8.0
Running org.apache.hadoop.hbase.master.TestMasterOperationsForRegionReplicas
Tests run: 1, Failures: 0, Errors: 0, Skipped: 0, Time elapsed: 38.307 sec - in org.apache.hadoop.hbase.master.TestMasterRestartAfterDisablingTable
Java HotSpot(TM) 64-Bit Server VM warning: ignoring option MaxPermSize=256m; support was removed
in 8.0
Running org.apache.hadoop.hbase.master.TestAssignmentListener
Tests run: 2, Failures: 0, Errors: 0, Skipped: 0, Time elapsed: 35.948 sec - in org.apache.hadoop.hbase.master.TestMasterOperationsForRegionReplicas
Java HotSpot(TM) 64-Bit Server VM warning: ignoring option MaxPermSize=256m; support was removed
in 8.0
Tests run: 2, Failures: 0, Errors: 0, Skipped: 0, Time elapsed: 14.008 sec - in org.apache.hadoop.hbase.master.TestAssignmentListener
Java HotSpot(TM) 64-Bit Server VM warning: ignoring option MaxPermSize=256m; support was removed
in 8.0
Java HotSpot(TM) 64-Bit Server VM warning: ignoring option MaxPermSize=256m; support was removed
in 8.0
Java HotSpot(TM) 64-Bit Server VM warning: ignoring option MaxPermSize=256m; support was removed
in 8.0
Java HotSpot(TM) 64-Bit Server VM warning: ignoring option MaxPermSize=256m; support was removed
in 8.0
Java HotSpot(TM) 64-Bit Server VM warning: ignoring option MaxPermSize=256m; support was removed
in 8.0
Running org.apache.hadoop.hbase.master.TestMasterMetricsWrapper
Tests run: 18, Failures: 0, Errors: 0, Skipped: 15, Time elapsed: 62.104 sec - in org.apache.hadoop.hbase.master.TestDistributedLogSplitting
Tests run: 1, Failures: 0, Errors: 0, Skipped: 0, Time elapsed: 2.968 sec - in org.apache.hadoop.hbase.master.TestMasterMetricsWrapper
Java HotSpot(TM) 64-Bit Server VM warning: ignoring option MaxPermSize=256m; support was removed
in 8.0
Java HotSpot(TM) 64-Bit Server VM warning: ignoring option MaxPermSize=256m; support was removed
in 8.0
Running org.apache.hadoop.hbase.snapshot.TestSnapshotClientRetries
Running org.apache.hadoop.hbase.master.snapshot.TestSnapshotFileCache
Running org.apache.hadoop.hbase.snapshot.TestFlushSnapshotFromClient
Tests run: 2, Failures: 0, Errors: 0, Skipped: 0, Time elapsed: 36.53 sec - in org.apache.hadoop.hbase.snapshot.TestSnapshotClientRetries
Java HotSpot(TM) 64-Bit Server VM warning: ignoring option MaxPermSize=256m; support was removed
in 8.0
Running org.apache.hadoop.hbase.snapshot.TestExportSnapshot
Running org.apache.hadoop.hbase.snapshot.TestMobFlushSnapshotFromClient
Tests run: 4, Failures: 0, Errors: 0, Skipped: 0, Time elapsed: 70.712 sec - in org.apache.hadoop.hbase.master.snapshot.TestSnapshotFileCache
Java HotSpot(TM) 64-Bit Server VM warning: ignoring option MaxPermSize=256m; support was removed
in 8.0
Running org.apache.hadoop.hbase.snapshot.TestSnapshotDescriptionUtils
Tests run: 2, Failures: 0, Errors: 0, Skipped: 0, Time elapsed: 0.315 sec - in org.apache.hadoop.hbase.snapshot.TestSnapshotDescriptionUtils
Java HotSpot(TM) 64-Bit Server VM warning: ignoring option MaxPermSize=256m; support was removed
in 8.0
Tests run: 9, Failures: 0, Errors: 0, Skipped: 0, Time elapsed: 98.243 sec - in org.apache.hadoop.hbase.snapshot.TestFlushSnapshotFromClient
Java HotSpot(TM) 64-Bit Server VM warning: ignoring option MaxPermSize=256m; support was removed
in 8.0
Running org.apache.hadoop.hbase.snapshot.TestMobSecureExportSnapshot
Tests run: 4, Failures: 0, Errors: 0, Skipped: 0, Time elapsed: 547.731 sec - in org.apache.hadoop.hbase.master.balancer.TestStochasticLoadBalancer2
Java HotSpot(TM) 64-Bit Server VM warning: ignoring option MaxPermSize=256m; support was removed
in 8.0
Java HotSpot(TM) 64-Bit Server VM warning: ignoring option MaxPermSize=256m; support was removed
in 8.0
Java HotSpot(TM) 64-Bit Server VM warning: ignoring option MaxPermSize=256m; support was removed
in 8.0
Running org.apache.hadoop.hbase.snapshot.TestMobRestoreFlushSnapshotFromClient
Running org.apache.hadoop.hbase.snapshot.TestMobExportSnapshot
Tests run: 5, Failures: 0, Errors: 0, Skipped: 0, Time elapsed: 158.967 sec - in org.apache.hadoop.hbase.snapshot.TestMobRestoreFlushSnapshotFromClient
Java HotSpot(TM) 64-Bit Server VM warning: ignoring option MaxPermSize=256m; support was removed
in 8.0
Running org.apache.hadoop.hbase.snapshot.TestRestoreFlushSnapshotFromClient
Tests run: 5, Failures: 0, Errors: 0, Skipped: 0, Time elapsed: 109.195 sec - in org.apache.hadoop.hbase.snapshot.TestRestoreFlushSnapshotFromClient
Java HotSpot(TM) 64-Bit Server VM warning: ignoring option MaxPermSize=256m; support was removed
in 8.0
Running org.apache.hadoop.hbase.snapshot.TestSecureExportSnapshot
Tests run: 9, Failures: 0, Errors: 0, Skipped: 0, Time elapsed: 629.167 sec - in org.apache.hadoop.hbase.snapshot.TestExportSnapshot
Tests run: 9, Failures: 0, Errors: 0, Skipped: 0, Time elapsed: 732.367 sec - in org.apache.hadoop.hbase.snapshot.TestMobSecureExportSnapshot
Tests run: 9, Failures: 0, Errors: 0, Skipped: 0, Time elapsed: 721.886 sec - in org.apache.hadoop.hbase.snapshot.TestMobExportSnapshot
Tests run: 9, Failures: 0, Errors: 0, Skipped: 0, Time elapsed: 621.388 sec - in org.apache.hadoop.hbase.snapshot.TestSecureExportSnapshot

Results :

Failed tests: 
  TestBlockEvictionFromClient.testParallelGetsAndScanWithWrappedRegionScanner:833->checkForBlockEviction:1329
expected:<6> but was:<3>
Tests in error: 
  TestAccessController3.setupBeforeClass:188->setUpTableAndUserPermissions:224->SecureTestUtil.grantOnTable:502->SecureTestUtil.updateACLs:332
» Service
org.apache.hadoop.hbase.security.access.TestNamespaceCommands.org.apache.hadoop.hbase.security.access.TestNamespaceCommands
  Run 1: TestNamespaceCommands.beforeClass:179->SecureTestUtil.grantGlobal:367->SecureTestUtil.updateACLs:332
» Service
  Run 2: TestNamespaceCommands.afterClass:185 » NamespaceNotFound ns1

  TestVisibilityLabelsWithACL.testLabelsTableOpsWithDifferentUsers:235 NullPointer
  TestVisibilityLabelsWithACL.testVisibilityLabelsForUserWithNoAuths:204 » Service

Tests run: 2766, Failures: 1, Errors: 4, Skipped: 65

[INFO] ------------------------------------------------------------------------
[INFO] Reactor Summary:
[INFO] 
[INFO] Apache HBase ...................................... SUCCESS [  5.875 s]
[INFO] Apache HBase - Checkstyle ......................... SUCCESS [  0.774 s]
[INFO] Apache HBase - Resource Bundle .................... SUCCESS [  0.385 s]
[INFO] Apache HBase - Annotations ........................ SUCCESS [  0.414 s]
[INFO] Apache HBase - Protocol ........................... SUCCESS [  3.509 s]
[INFO] Apache HBase - Common ............................. SUCCESS [02:02 min]
[INFO] Apache HBase - Procedure .......................... SUCCESS [03:02 min]
[INFO] Apache HBase - Client ............................. SUCCESS [01:00 min]
[INFO] Apache HBase - Hadoop Compatibility ............... SUCCESS [  9.182 s]
[INFO] Apache HBase - Hadoop Two Compatibility ........... SUCCESS [ 13.896 s]
[INFO] Apache HBase - Prefix Tree ........................ SUCCESS [ 13.154 s]
[INFO] Apache HBase - Server ............................. FAILURE [  02:37 h]
[INFO] Apache HBase - Testing Util ....................... SKIPPED
[INFO] Apache HBase - Thrift ............................. SKIPPED
[INFO] Apache HBase - RSGroup ............................ SKIPPED
[INFO] Apache HBase - Shell .............................. SKIPPED
[INFO] Apache HBase - Integration Tests .................. SKIPPED
[INFO] Apache HBase - Examples ........................... SKIPPED
[INFO] Apache HBase - Rest ............................... SKIPPED
[INFO] Apache HBase - External Block Cache ............... SKIPPED
[INFO] Apache HBase - Spark .............................. SKIPPED
[INFO] Apache HBase - Assembly ........................... SKIPPED
[INFO] Apache HBase - Shaded ............................. SKIPPED
[INFO] Apache HBase - Shaded - Client .................... SKIPPED
[INFO] Apache HBase - Shaded - Server .................... SKIPPED
[INFO] Apache HBase - Archetypes ......................... SKIPPED
[INFO] Apache HBase - Exemplar for hbase-client archetype  SKIPPED
[INFO] Apache HBase - Exemplar for hbase-shaded-client archetype  SKIPPED
[INFO] Apache HBase - Archetype builder .................. SKIPPED
[INFO] ------------------------------------------------------------------------
[INFO] BUILD FAILURE
[INFO] ------------------------------------------------------------------------
[INFO] Total time: 02:44 h
[INFO] Finished at: 2016-05-03T04:43:41+00:00
[INFO] Final Memory: 494M/3450M
[INFO] ------------------------------------------------------------------------
[ERROR] Failed to execute goal org.apache.maven.plugins:maven-surefire-plugin:2.18.1:test
(secondPartTestsExecution) on project hbase-server: There was a timeout or other error in
the fork -> [Help 1]
[ERROR] 
[ERROR] To see the full stack trace of the errors, re-run Maven with the -e switch.
[ERROR] Re-run Maven using the -X switch to enable full debug logging.
[ERROR] 
[ERROR] For more information about the errors and possible solutions, please read the following
articles:
[ERROR] [Help 1] http://cwiki.apache.org/confluence/display/MAVEN/MojoFailureException
[ERROR] 
[ERROR] After correcting the problems, you can resume the build with the command
[ERROR]   mvn <goals> -rf :hbase-server
Build step 'Invoke top-level Maven targets' marked build as failure
Performing Post build task...
Match found for :.* : True
Logical operation result is TRUE
Running script  : # Run zombie detector script
./dev-support/zombie-detector.sh --jenkins ${BUILD_ID}
[yahoo-not-h2] $ /bin/bash -xe /tmp/hudson4699391896098601539.sh
+ ./dev-support/zombie-detector.sh --jenkins 886
Tue May  3 04:43:45 UTC 2016 Found 1 suspicious java process(es) listed below; waiting 30s
to see if just slow to stop
4636 surefirebooter8130316282311009018.jar -enableassertions -Dhbase.build.id=886 -Xmx2800m
-XX:MaxPermSize=256m -Djava.security.egd=file:/dev/./urandom -Djava.net.preferIPv4Stack=true
-Djava.awt.headless=true
tail: cannot open '+2' for reading: No such file or directory
Tue May  3 04:44:15 UTC 2016 We're ok: there was a zombie candidate but it went away


    {color:green}+1 zombies{color}. No zombie tests found running at the end of the build
(There were candidates but they seem to have gone away).
POST BUILD TASK : SUCCESS
END OF POST BUILD TASK : 0
Archiving artifacts
Recording test results
[FINDBUGS] Skipping publisher since build result is FAILURE
[CHECKSTYLE] Skipping publisher since build result is FAILURE

Mime
View raw message