hbase-builds mailing list archives

Site index · List index
Message view « Date » · « Thread »
Top « Date » · « Thread »
From Apache Jenkins Server <jenk...@builds.apache.org>
Subject Build failed in Jenkins: HBase-1.3-IT » IntegrationTestAcidGuarantees,latest1.7,yahoo-not-h2 #648
Date Wed, 04 May 2016 23:33:10 GMT
See <https://builds.apache.org/job/HBase-1.3-IT/it.test=IntegrationTestAcidGuarantees,jdk=latest1.7,label=yahoo-not-h2/648/changes>

Changes:

[enis] HBASE-15613 TestNamespaceCommand times out

[Gary Helmling] HBASE-15741 Provide backward compatibility for HBase coprocessor service

------------------------------------------
[...truncated 52483 lines...]
     bool UseNewLongLShift                          = false           {ARCH product}     

     bool UseOSErrorReporting                       = false           {pd product}       

     bool UseOldInlining                            = true            {C2 product}       

     bool UseOnStackReplacement                     = true            {pd product}       

     bool UseOnlyInlinedBimorphic                   = true            {C2 product}       

     bool UseOprofile                               = false           {product}          

     bool UseOptoBiasInlining                       = true            {C2 product}       

     bool UsePPCLWSYNC                              = true            {product}          

     bool UsePSAdaptiveSurvivorSizePolicy           = true            {product}          

     bool UseParNewGC                               = false           {product}          

     bool UseParallelGC                            := true            {product}          

     bool UseParallelOldGC                          = true            {product}          

     bool UsePerfData                               = true            {product}          

     bool UsePopCountInstruction                    = true            {product}          

     bool UseRDPCForConstantTableBase               = false           {C2 product}       

     bool UseSHM                                    = false           {product}          

     intx UseSSE                                    = 4               {product}          

     bool UseSSE42Intrinsics                        = true            {product}          

     bool UseSerialGC                               = false           {product}          

     bool UseSharedSpaces                           = false           {product}          

     bool UseSignalChaining                         = true            {product}          

     bool UseSplitVerifier                          = true            {product}          

     bool UseStoreImmI16                            = false           {ARCH product}     

     bool UseStringCache                            = false           {product}          

     bool UseSuperWord                              = true            {C2 product}       

     bool UseTLAB                                   = true            {pd product}       

     bool UseThreadPriorities                       = true            {pd product}       

     bool UseTransparentHugePages                   = false           {product}          

     bool UseTypeProfile                            = true            {product}          

     bool UseUnalignedLoadStores                    = true            {ARCH product}     

     bool UseVMInterruptibleIO                      = false           {product}          

     bool UseVectoredExceptions                     = false           {pd product}       

     bool UseXMMForArrayCopy                        = true            {product}          

     bool UseXmmI2D                                 = false           {ARCH product}     

     bool UseXmmI2F                                 = false           {ARCH product}     

     bool UseXmmLoadAndClearUpper                   = true            {ARCH product}     

     bool UseXmmRegToRegMoveAll                     = true            {ARCH product}     

     bool VMThreadHintNoPreempt                     = false           {product}          

     intx VMThreadPriority                          = -1              {product}          

     intx VMThreadStackSize                         = 1024            {pd product}       

     intx ValueMapInitialSize                       = 11              {C1 product}       

     intx ValueMapMaxLoopSize                       = 8               {C1 product}       

     intx ValueSearchLimit                          = 1000            {C2 product}       

     bool VerifyMergedCPBytecodes                   = true            {product}          

     intx WorkAroundNPTLTimedWaitHang               = 1               {product}          

    uintx YoungGenerationSizeIncrement              = 20              {product}          

    uintx YoungGenerationSizeSupplement             = 80              {product}          

    uintx YoungGenerationSizeSupplementDecay        = 8               {product}          

    uintx YoungPLABSize                             = 4096            {product}          

     bool ZeroTLAB                                  = false           {product}          

     intx hashCode                                  = 0               {product}          

Running org.apache.hadoop.hbase.IntegrationTestAcidGuarantees
SUREFIRE-859: [GC 194048K->14564K(740864K), 0.1385520 secs]
SUREFIRE-859: [GC 208612K->67812K(934912K), 1.1487220 secs]
SUREFIRE-859: [GC 455908K->111205K(934912K), 0.2080140 secs]
SUREFIRE-859: [GC 499301K->175582K(1323008K), 0.5753850 secs]
Tests run: 3, Failures: 0, Errors: 3, Skipped: 0, Time elapsed: 542.324 sec <<< FAILURE!
- in org.apache.hadoop.hbase.IntegrationTestAcidGuarantees
testMixedAtomicity(org.apache.hadoop.hbase.IntegrationTestAcidGuarantees)  Time elapsed: 163.544
sec  <<< ERROR!
java.lang.OutOfMemoryError: unable to create new native thread
	at java.lang.Thread.start0(Native Method)
	at java.lang.Thread.start(Thread.java:714)
	at org.apache.hadoop.hbase.MultithreadedTestUtil$TestContext.startThreads(MultithreadedTestUtil.java:61)
	at org.apache.hadoop.hbase.TestAcidGuarantees.runTestAtomicity(TestAcidGuarantees.java:314)
	at org.apache.hadoop.hbase.TestAcidGuarantees.runTestAtomicity(TestAcidGuarantees.java:254)
	at org.apache.hadoop.hbase.IntegrationTestAcidGuarantees.testMixedAtomicity(IntegrationTestAcidGuarantees.java:106)

testGetAtomicity(org.apache.hadoop.hbase.IntegrationTestAcidGuarantees)  Time elapsed: 174.598
sec  <<< ERROR!
java.io.IOException: java.lang.reflect.InvocationTargetException
	at java.lang.Thread.start0(Native Method)
	at java.lang.Thread.start(Thread.java:714)
	at org.apache.zookeeper.ClientCnxn.start(ClientCnxn.java:406)
	at org.apache.zookeeper.ZooKeeper.<init>(ZooKeeper.java:450)
	at org.apache.zookeeper.ZooKeeper.<init>(ZooKeeper.java:380)
	at org.apache.hadoop.hbase.zookeeper.RecoverableZooKeeper.checkZk(RecoverableZooKeeper.java:141)
	at org.apache.hadoop.hbase.zookeeper.RecoverableZooKeeper.<init>(RecoverableZooKeeper.java:128)
	at org.apache.hadoop.hbase.zookeeper.ZKUtil.connect(ZKUtil.java:138)
	at org.apache.hadoop.hbase.zookeeper.ZooKeeperWatcher.<init>(ZooKeeperWatcher.java:189)
	at org.apache.hadoop.hbase.zookeeper.ZooKeeperWatcher.<init>(ZooKeeperWatcher.java:157)
	at org.apache.hadoop.hbase.client.ZooKeeperKeepAliveConnection.<init>(ZooKeeperKeepAliveConnection.java:43)
	at org.apache.hadoop.hbase.client.ConnectionManager$HConnectionImplementation.getKeepAliveZooKeeperWatcher(ConnectionManager.java:1692)
	at org.apache.hadoop.hbase.client.ZooKeeperRegistry.getClusterId(ZooKeeperRegistry.java:104)
	at org.apache.hadoop.hbase.client.ConnectionManager$HConnectionImplementation.retrieveClusterId(ConnectionManager.java:907)
	at org.apache.hadoop.hbase.client.ConnectionManager$HConnectionImplementation.<init>(ConnectionManager.java:691)
	at sun.reflect.NativeConstructorAccessorImpl.newInstance0(Native Method)
	at sun.reflect.NativeConstructorAccessorImpl.newInstance(NativeConstructorAccessorImpl.java:57)
	at sun.reflect.DelegatingConstructorAccessorImpl.newInstance(DelegatingConstructorAccessorImpl.java:45)
	at java.lang.reflect.Constructor.newInstance(Constructor.java:526)
	at org.apache.hadoop.hbase.client.ConnectionFactory.createConnection(ConnectionFactory.java:238)
	at org.apache.hadoop.hbase.client.ConnectionManager.createConnection(ConnectionManager.java:431)
	at org.apache.hadoop.hbase.client.ConnectionManager.createConnection(ConnectionManager.java:424)
	at org.apache.hadoop.hbase.client.ConnectionManager.getConnectionInternal(ConnectionManager.java:302)
	at org.apache.hadoop.hbase.client.HTable.<init>(HTable.java:184)
	at org.apache.hadoop.hbase.HBaseTestingUtility.waitUntilAllRegionsAssigned(HBaseTestingUtility.java:3416)
	at org.apache.hadoop.hbase.HBaseTestingUtility.waitUntilAllRegionsAssigned(HBaseTestingUtility.java:3400)
	at org.apache.hadoop.hbase.HBaseTestingUtility.createTable(HBaseTestingUtility.java:1464)
	at org.apache.hadoop.hbase.HBaseTestingUtility.createTable(HBaseTestingUtility.java:1508)
	at org.apache.hadoop.hbase.HBaseTestingUtility.createTable(HBaseTestingUtility.java:1399)
	at org.apache.hadoop.hbase.HBaseTestingUtility.createTable(HBaseTestingUtility.java:1375)
	at org.apache.hadoop.hbase.TestAcidGuarantees.createTableIfMissing(TestAcidGuarantees.java:79)
	at org.apache.hadoop.hbase.TestAcidGuarantees.runTestAtomicity(TestAcidGuarantees.java:263)
	at org.apache.hadoop.hbase.TestAcidGuarantees.runTestAtomicity(TestAcidGuarantees.java:254)
	at org.apache.hadoop.hbase.IntegrationTestAcidGuarantees.testGetAtomicity(IntegrationTestAcidGuarantees.java:96)

testScanAtomicity(org.apache.hadoop.hbase.IntegrationTestAcidGuarantees)  Time elapsed: 203.97
sec  <<< ERROR!
java.io.IOException: Shutting down
	at org.apache.hadoop.hbase.util.JVMClusterUtil.startup(JVMClusterUtil.java:225)
	at org.apache.hadoop.hbase.LocalHBaseCluster.startup(LocalHBaseCluster.java:407)
	at org.apache.hadoop.hbase.MiniHBaseCluster.init(MiniHBaseCluster.java:224)
	at org.apache.hadoop.hbase.MiniHBaseCluster.<init>(MiniHBaseCluster.java:93)
	at org.apache.hadoop.hbase.HBaseTestingUtility.startMiniHBaseCluster(HBaseTestingUtility.java:1066)
	at org.apache.hadoop.hbase.HBaseTestingUtility.startMiniCluster(HBaseTestingUtility.java:1026)
	at org.apache.hadoop.hbase.HBaseTestingUtility.startMiniCluster(HBaseTestingUtility.java:898)
	at org.apache.hadoop.hbase.HBaseTestingUtility.startMiniCluster(HBaseTestingUtility.java:880)
	at org.apache.hadoop.hbase.HBaseTestingUtility.startMiniCluster(HBaseTestingUtility.java:867)
	at org.apache.hadoop.hbase.IntegrationTestingUtility.initializeCluster(IntegrationTestingUtility.java:78)
	at org.apache.hadoop.hbase.IntegrationTestAcidGuarantees.setUpCluster(IntegrationTestAcidGuarantees.java:66)


Results :

Tests in error: 
  IntegrationTestAcidGuarantees.testGetAtomicity:96 » IO java.lang.reflect.Invoc...
  IntegrationTestAcidGuarantees.testMixedAtomicity:106 » OutOfMemory unable to c...
  IntegrationTestAcidGuarantees>IntegrationTestBase.setUp:133->setUpCluster:66 » IO

Tests run: 3, Failures: 0, Errors: 3, Skipped: 0

[WARNING] File encoding has not been set, using platform encoding ISO-8859-1, i.e. build is
platform dependent! The file encoding for reports output files should be provided by the POM
property ${project.reporting.outputEncoding}.
[INFO] 
[INFO] --- maven-failsafe-plugin:2.18.1:verify (verify) @ hbase-it ---
[INFO] Failsafe report directory: <https://builds.apache.org/job/HBase-1.3-IT/it.test=IntegrationTestAcidGuarantees,jdk=latest1.7,label=yahoo-not-h2/ws/hbase-it/target/failsafe-reports>
[WARNING] File encoding has not been set, using platform encoding ISO-8859-1, i.e. build is
platform dependent! The file encoding for reports output files should be provided by the POM
property ${project.reporting.outputEncoding}.
[INFO] ------------------------------------------------------------------------
[INFO] Reactor Summary:
[INFO] 
[INFO] Apache HBase ...................................... SUCCESS [2:00.476s]
[INFO] Apache HBase - Checkstyle ......................... SUCCESS [8.901s]
[INFO] Apache HBase - Resource Bundle .................... SUCCESS [0.607s]
[INFO] Apache HBase - Annotations ........................ SUCCESS [1.857s]
[INFO] Apache HBase - Protocol ........................... SUCCESS [28.893s]
[INFO] Apache HBase - Common ............................. SUCCESS [1:02.206s]
[INFO] Apache HBase - Procedure .......................... SUCCESS [3.448s]
[INFO] Apache HBase - Client ............................. SUCCESS [16.079s]
[INFO] Apache HBase - Hadoop Compatibility ............... SUCCESS [1.417s]
[INFO] Apache HBase - Hadoop Two Compatibility ........... SUCCESS [4.790s]
[INFO] Apache HBase - Prefix Tree ........................ SUCCESS [2.578s]
[INFO] Apache HBase - Server ............................. SUCCESS [1:25.291s]
[INFO] Apache HBase - Testing Util ....................... SUCCESS [3.495s]
[INFO] Apache HBase - Thrift ............................. SUCCESS [11.677s]
[INFO] Apache HBase - Rest ............................... SUCCESS [4.872s]
[INFO] Apache HBase - Shell .............................. SUCCESS [11.785s]
[INFO] Apache HBase - Integration Tests .................. FAILURE [9:10.181s]
[INFO] Apache HBase - Examples ........................... SKIPPED
[INFO] Apache HBase - External Block Cache ............... SKIPPED
[INFO] Apache HBase - Assembly ........................... SKIPPED
[INFO] Apache HBase - Shaded ............................. SKIPPED
[INFO] Apache HBase - Shaded - Client .................... SKIPPED
[INFO] Apache HBase - Shaded - Server .................... SKIPPED
[INFO] ------------------------------------------------------------------------
[INFO] BUILD FAILURE
[INFO] ------------------------------------------------------------------------
[INFO] Total time: 15:56.712s
[INFO] Finished at: Wed May 04 23:33:09 UTC 2016
[INFO] Final Memory: 173M/2999M
[INFO] ------------------------------------------------------------------------
[ERROR] Failed to execute goal org.apache.maven.plugins:maven-failsafe-plugin:2.18.1:verify
(verify) on project hbase-it: There are test failures.
[ERROR] 
[ERROR] Please refer to <https://builds.apache.org/job/HBase-1.3-IT/it.test=IntegrationTestAcidGuarantees,jdk=latest1.7,label=yahoo-not-h2/ws/hbase-it/target/failsafe-reports>
for the individual test results.
[ERROR] -> [Help 1]
[ERROR] 
[ERROR] To see the full stack trace of the errors, re-run Maven with the -e switch.
[ERROR] Re-run Maven using the -X switch to enable full debug logging.
[ERROR] 
[ERROR] For more information about the errors and possible solutions, please read the following
articles:
[ERROR] [Help 1] http://cwiki.apache.org/confluence/display/MAVEN/MojoFailureException
[ERROR] 
[ERROR] After correcting the problems, you can resume the build with the command
[ERROR]   mvn <goals> -rf :hbase-it
Build step 'Invoke top-level Maven targets' marked build as failure
Performing Post build task...
Match found for :.* : True
Logical operation result is TRUE
Running script  : # Post-build task script. TODO: Check this in and have all builds reference
check-in.
pwd && ls
# NOTE!!!! The below code has been copied and pasted from ./dev-tools/run-test.sh
# Do not change here without syncing there and vice-versa.
ZOMBIE_TESTS_COUNT=`jps -v | grep surefirebooter | grep -e '-Dhbase.test' | wc -l`
if [[ $ZOMBIE_TESTS_COUNT != 0 ]] ; then
 echo "Suspicious java process found - waiting 30s to see if there are just slow to stop"
 sleep 30
 ZOMBIE_TESTS_COUNT=`jps -v | grep surefirebooter | grep -e '-Dhbase.test' | wc -l`
 if [[ $ZOMBIE_TESTS_COUNT != 0 ]] ; then
   echo " {color:red}There appear to be $ZOMBIE_TESTS_COUNT zombie tests{color}, they should
have been killed by surefire but survived"
   jps -v | grep surefirebooter | grep -e '-Dhbase.test'
   jps -v | grep surefirebooter | grep -e '-Dhbase.test' | cut -d ' ' -f 1 | xargs -n 1 jstack
   # Exit with error
   exit 1
 else
   echo "We're ok: there is no zombie test, but some tests took some time to stop"
 fi
else
  echo "We're ok: there is no zombie test"
fi
[yahoo-not-h2] $ /bin/bash -xe /tmp/hudson7458748559998630420.sh
+ pwd
<https://builds.apache.org/job/HBase-1.3-IT/it.test=IntegrationTestAcidGuarantees,jdk=latest1.7,label=yahoo-not-h2/ws/>
+ ls
bin
CHANGES.txt
conf
dev-support
hbase-annotations
hbase-assembly
hbase-checkstyle
hbase-client
hbase-common
hbase-examples
hbase-external-blockcache
hbase-hadoop2-compat
hbase-hadoop-compat
hbase-it
hbase-native-client
hbase-prefix-tree
hbase-procedure
hbase-protocol
hbase-resource-bundle
hbase-rest
hbase-server
hbase-shaded
hbase-shell
hbase-testing-util
hbase-thrift
LICENSE.txt
NOTICE.txt
pom.xml
README.txt
src
target
++ wc -l
++ grep -e -Dhbase.test
++ grep surefirebooter
++ jps -v
+ ZOMBIE_TESTS_COUNT=0
+ [[ 0 != 0 ]]
+ echo 'We'\''re ok: there is no zombie test'
We're ok: there is no zombie test
POST BUILD TASK : SUCCESS
END OF POST BUILD TASK : 0
Archiving artifacts

Mime
View raw message