hbase-builds mailing list archives

Site index · List index
Message view « Date » · « Thread »
Top « Date » · « Thread »
From Apache Jenkins Server <jenk...@builds.apache.org>
Subject Build failed in Jenkins: HBase-1.3-IT » IntegrationTestBigLinkedList,latest1.8,yahoo-not-h2 #650
Date Fri, 06 May 2016 02:42:09 GMT
See <https://builds.apache.org/job/HBase-1.3-IT/it.test=IntegrationTestBigLinkedList,jdk=latest1.8,label=yahoo-not-h2/650/changes>

Changes:

[tedyu] HBASE-15292 Refined ZooKeeperWatcher to prevent ZooKeeper's callback

------------------------------------------
Started by upstream project "HBase-1.3-IT" build number 650
originally caused by:
 Started by an SCM change
[EnvInject] - Loading node environment variables.
Building remotely on ubuntu-6 (docker Ubuntu ubuntu yahoo-not-h2) in workspace <https://builds.apache.org/job/HBase-1.3-IT/it.test=IntegrationTestBigLinkedList,jdk=latest1.8,label=yahoo-not-h2/ws/>
Cloning the remote Git repository
Cloning repository https://git-wip-us.apache.org/repos/asf/hbase.git
 > git init <https://builds.apache.org/job/HBase-1.3-IT/it.test=IntegrationTestBigLinkedList,jdk=latest1.8,label=yahoo-not-h2/ws/>
# timeout=10
Fetching upstream changes from https://git-wip-us.apache.org/repos/asf/hbase.git
 > git --version # timeout=10
 > git -c core.askpass=true fetch --tags --progress https://git-wip-us.apache.org/repos/asf/hbase.git
+refs/heads/*:refs/remotes/origin/*
 > git config remote.origin.url https://git-wip-us.apache.org/repos/asf/hbase.git # timeout=10
 > git config --add remote.origin.fetch +refs/heads/*:refs/remotes/origin/* # timeout=10
 > git config remote.origin.url https://git-wip-us.apache.org/repos/asf/hbase.git # timeout=10
Fetching upstream changes from https://git-wip-us.apache.org/repos/asf/hbase.git
 > git -c core.askpass=true fetch --tags --progress https://git-wip-us.apache.org/repos/asf/hbase.git
+refs/heads/*:refs/remotes/origin/*
Checking out Revision 6844474a122739f2cf42553280687bbef9bcd24a (refs/remotes/origin/branch-1.3)
 > git config core.sparsecheckout # timeout=10
 > git checkout -f 6844474a122739f2cf42553280687bbef9bcd24a
 > git rev-list 5c3a18e76e7e20492929df48c5b9c8376ab6af25 # timeout=10
[yahoo-not-h2] $ /bin/bash -xe /tmp/hudson798689831311724893.sh
+ which java
/home/jenkins/jenkins-slave/tools/hudson.model.JDK/latest1.8/bin/java
+ java -version
java version "1.8.0_74"
Java(TM) SE Runtime Environment (build 1.8.0_74-b02)
Java HotSpot(TM) 64-Bit Server VM (build 25.74-b02, mixed mode)
+ ulimit -a
core file size          (blocks, -c) 0
data seg size           (kbytes, -d) unlimited
scheduling priority             (-e) 0
file size               (blocks, -f) unlimited
pending signals                 (-i) 386178
max locked memory       (kbytes, -l) 64
max memory size         (kbytes, -m) unlimited
open files                      (-n) 60000
pipe size            (512 bytes, -p) 8
POSIX message queues     (bytes, -q) 819200
real-time priority              (-r) 0
stack size              (kbytes, -s) 8192
cpu time               (seconds, -t) unlimited
max user processes              (-u) 10240
virtual memory          (kbytes, -v) unlimited
file locks                      (-x) unlimited
+ rm -rf /tmp/hbase-jenkins/hbase
[yahoo-not-h2] $ /home/jenkins/jenkins-slave/tools/hudson.tasks.Maven_MavenInstallation/Maven_3.0.5/bin/mvn
-Dit.test=IntegrationTestBigLinkedList -Dlabel=yahoo-not-h2 -Djdk=latest1.8 -Dmaven.repo.local=<https://builds.apache.org/job/HBase-1.3-IT/it.test=IntegrationTestBigLinkedList,jdk=latest1.8,label=yahoo-not-h2/ws/.repository>
-Dtest=NoUnitTests clean package verify
[INFO] Scanning for projects...
Downloading: https://repository.apache.org/content/repositories/releases/org/apache/apache/12/apache-12.pom
4/16 KB   
8/16 KB   
8/16 KB   
12/16 KB   
14/16 KB   
16/16 KB   
           
Downloaded: https://repository.apache.org/content/repositories/releases/org/apache/apache/12/apache-12.pom
(16 KB at 6.6 KB/sec)
Downloading: http://repository.apache.org/snapshots/org/apache/felix/maven-bundle-plugin/2.5.3/maven-bundle-plugin-2.5.3.pom
           
Downloading: http://repo.maven.apache.org/maven2/org/apache/felix/maven-bundle-plugin/2.5.3/maven-bundle-plugin-2.5.3.pom
4/5 KB     
5/5 KB   
         
Downloaded: http://repo.maven.apache.org/maven2/org/apache/felix/maven-bundle-plugin/2.5.3/maven-bundle-plugin-2.5.3.pom
(5 KB at 12.1 KB/sec)
Downloading: http://repository.apache.org/snapshots/org/apache/felix/felix-parent/2.1/felix-parent-2.1.pom
         
Downloading: http://repo.maven.apache.org/maven2/org/apache/felix/felix-parent/2.1/felix-parent-2.1.pom
4/10 KB   
8/10 KB   
10/10 KB   
           
Downloaded: http://repo.maven.apache.org/maven2/org/apache/felix/felix-parent/2.1/felix-parent-2.1.pom
(10 KB at 67.4 KB/sec)
Downloading: http://repository.apache.org/snapshots/org/apache/apache/9/apache-9.pom
           
Downloading: http://repo.maven.apache.org/maven2/org/apache/apache/9/apache-9.pom
4/15 KB    
8/15 KB   
12/15 KB   
15/15 KB   
           
Downloaded: http://repo.maven.apache.org/maven2/org/apache/apache/9/apache-9.pom (15 KB at
117.5 KB/sec)
Downloading: http://repository.apache.org/snapshots/biz/aQute/bnd/bndlib/2.3.0/bndlib-2.3.0.pom
           
Downloading: http://repo.maven.apache.org/maven2/biz/aQute/bnd/bndlib/2.3.0/bndlib-2.3.0.pom
2/2 KB     
         
Downloaded: http://repo.maven.apache.org/maven2/biz/aQute/bnd/bndlib/2.3.0/bndlib-2.3.0.pom
(2 KB at 10.7 KB/sec)
Downloading: http://repository.apache.org/snapshots/biz/aQute/bnd/parent/2.3.0/parent-2.3.0.pom
         
Downloading: http://repo.maven.apache.org/maven2/biz/aQute/bnd/parent/2.3.0/parent-2.3.0.pom
4/5 KB   
5/5 KB   
         
Downloaded: http://repo.maven.apache.org/maven2/biz/aQute/bnd/parent/2.3.0/parent-2.3.0.pom
(5 KB at 32.7 KB/sec)
Downloading: http://repository.apache.org/snapshots/org/osgi/org.osgi.core/4.3.1/org.osgi.core-4.3.1.pom
         
Downloading: http://repo.maven.apache.org/maven2/org/osgi/org.osgi.core/4.3.1/org.osgi.core-4.3.1.pom
2/2 KB   
         
Downloaded: http://repo.maven.apache.org/maven2/org/osgi/org.osgi.core/4.3.1/org.osgi.core-4.3.1.pom
(2 KB at 11.8 KB/sec)
Downloading: http://repository.apache.org/snapshots/org/apache/felix/org.apache.felix.bundlerepository/1.6.6/org.apache.felix.bundlerepository-1.6.6.pom
         
Downloading: http://repo.maven.apache.org/maven2/org/apache/felix/org.apache.felix.bundlerepository/1.6.6/org.apache.felix.bundlerepository-1.6.6.pom
4/6 KB   
6/6 KB   
         
Downloaded: http://repo.maven.apache.org/maven2/org/apache/felix/org.apache.felix.bundlerepository/1.6.6/org.apache.felix.bundlerepository-1.6.6.pom
(6 KB at 50.0 KB/sec)
Downloading: http://repository.apache.org/snapshots/org/osgi/org.osgi.core/4.1.0/org.osgi.core-4.1.0.pom
         
Downloading: http://repo.maven.apache.org/maven2/org/osgi/org.osgi.core/4.1.0/org.osgi.core-4.1.0.pom
193/193 B   
            
Downloaded: http://repo.maven.apache.org/maven2/org/osgi/org.osgi.core/4.1.0/org.osgi.core-4.1.0.pom
(193 B at 1.6 KB/sec)
Downloading: http://repository.apache.org/snapshots/org/easymock/easymock/2.4/easymock-2.4.pom
            
Downloading: http://repo.maven.apache.org/maven2/org/easymock/easymock/2.4/easymock-2.4.pom
4/6 KB      
6/6 KB   
         
Downloaded: http://repo.maven.apache.org/maven2/org/easymock/easymock/2.4/easymock-2.4.pom
(6 KB at 43.7 KB/sec)
Downloading: http://repository.apache.org/snapshots/org/apache/felix/org.apache.felix.utils/1.6.0/org.apache.felix.utils-1.6.0.pom
         
Downloading: http://repo.maven.apache.org/maven2/org/apache/felix/org.apache.felix.utils/1.6.0/org.apache.felix.utils-1.6.0.pom
4/4 KB   
         
Downloaded: http://repo.maven.apache.org/maven2/org/apache/felix/org.apache.felix.utils/1.6.0/org.apache.felix.utils-1.6.0.pom
(4 KB at 26.4 KB/sec)
Downloading: http://repository.apache.org/snapshots/org/osgi/org.osgi.compendium/4.2.0/org.osgi.compendium-4.2.0.pom
         
Downloading: http://repo.maven.apache.org/maven2/org/osgi/org.osgi.compendium/4.2.0/org.osgi.compendium-4.2.0.pom
463/463 B   
            
Downloaded: http://repo.maven.apache.org/maven2/org/osgi/org.osgi.compendium/4.2.0/org.osgi.compendium-4.2.0.pom
(463 B at 3.4 KB/sec)
Downloading: http://repository.apache.org/snapshots/org/apache/maven/maven-core/2.0.7/maven-core-2.0.7.pom
            
Downloading: http://repo.maven.apache.org/maven2/org/apache/maven/maven-core/2.0.7/maven-core-2.0.7.pom
4/7 KB      
7/7 KB   
         
Downloaded: http://repo.maven.apache.org/maven2/org/apache/maven/maven-core/2.0.7/maven-core-2.0.7.pom
(7 KB at 55.1 KB/sec)
Downloading: http://repository.apache.org/snapshots/org/apache/maven/maven/2.0.7/maven-2.0.7.pom
         
Downloading: http://repo.maven.apache.org/maven2/org/apache/maven/maven/2.0.7/maven-2.0.7.pom
4/11 KB   
8/11 KB   
11/11 KB   
           
Downloaded: http://repo.maven.apache.org/maven2/org/apache/maven/maven/2.0.7/maven-2.0.7.pom
(11 KB at 92.1 KB/sec)
Downloading: http://repository.apache.org/snapshots/org/apache/maven/maven-parent/5/maven-parent-5.pom
           
Downloading: http://repo.maven.apache.org/maven2/org/apache/maven/maven-parent/5/maven-parent-5.pom
4/15 KB    
8/15 KB   
12/15 KB   
15/15 KB   
           
Downloaded: http://repo.maven.apache.org/maven2/org/apache/maven/maven-parent/5/maven-parent-5.pom
(15 KB at 123.0 KB/sec)
Downloading: http://repository.apache.org/snapshots/org/apache/apache/3/apache-3.pom
           
Downloading: http://repo.maven.apache.org/maven2/org/apache/apache/3/apache-3.pom
4/4 KB     
         
Downloaded: http://repo.maven.apache.org/maven2/org/apache/apache/3/apache-3.pom (4 KB at
28.6 KB/sec)
Downloading: http://repository.apache.org/snapshots/org/apache/maven/maven-settings/2.0.7/maven-settings-2.0.7.pom
         
Downloading: http://repo.maven.apache.org/maven2/org/apache/maven/maven-settings/2.0.7/maven-settings-2.0.7.pom
2/2 KB   
         
Downloaded: http://repo.maven.apache.org/maven2/org/apache/maven/maven-settings/2.0.7/maven-settings-2.0.7.pom
(2 KB at 16.3 KB/sec)
Downloading: http://repository.apache.org/snapshots/org/apache/maven/maven-model/2.0.7/maven-model-2.0.7.pom
         
[ERROR] unable to create new native thread -> [Help 1]
[ERROR] 
[ERROR] To see the full stack trace of the errors, re-run Maven with the -e switch.
[ERROR] Re-run Maven using the -X switch to enable full debug logging.
[ERROR] 
[ERROR] For more information about the errors and possible solutions, please read the following
articles:
[ERROR] [Help 1] http://cwiki.apache.org/confluence/display/MAVEN/OutOfMemoryError
Build step 'Invoke top-level Maven targets' marked build as failure
Performing Post build task...
Match found for :.* : True
Logical operation result is TRUE
Running script  : # Post-build task script. TODO: Check this in and have all builds reference
check-in.
pwd && ls
# NOTE!!!! The below code has been copied and pasted from ./dev-tools/run-test.sh
# Do not change here without syncing there and vice-versa.
ZOMBIE_TESTS_COUNT=`jps -v | grep surefirebooter | grep -e '-Dhbase.test' | wc -l`
if [[ $ZOMBIE_TESTS_COUNT != 0 ]] ; then
 echo "Suspicious java process found - waiting 30s to see if there are just slow to stop"
 sleep 30
 ZOMBIE_TESTS_COUNT=`jps -v | grep surefirebooter | grep -e '-Dhbase.test' | wc -l`
 if [[ $ZOMBIE_TESTS_COUNT != 0 ]] ; then
   echo " {color:red}There appear to be $ZOMBIE_TESTS_COUNT zombie tests{color}, they should
have been killed by surefire but survived"
   jps -v | grep surefirebooter | grep -e '-Dhbase.test'
   jps -v | grep surefirebooter | grep -e '-Dhbase.test' | cut -d ' ' -f 1 | xargs -n 1 jstack
   # Exit with error
   exit 1
 else
   echo "We're ok: there is no zombie test, but some tests took some time to stop"
 fi
else
  echo "We're ok: there is no zombie test"
fi
[yahoo-not-h2] $ /bin/bash -xe /tmp/hudson591378286074323909.sh
+ pwd
<https://builds.apache.org/job/HBase-1.3-IT/it.test=IntegrationTestBigLinkedList,jdk=latest1.8,label=yahoo-not-h2/ws/>
+ ls
bin
CHANGES.txt
conf
dev-support
hbase-annotations
hbase-assembly
hbase-checkstyle
hbase-client
hbase-common
hbase-examples
hbase-external-blockcache
hbase-hadoop2-compat
hbase-hadoop-compat
hbase-it
hbase-native-client
hbase-prefix-tree
hbase-procedure
hbase-protocol
hbase-resource-bundle
hbase-rest
hbase-server
hbase-shaded
hbase-shell
hbase-testing-util
hbase-thrift
LICENSE.txt
NOTICE.txt
pom.xml
README.txt
src
++ jps -v
++ grep surefirebooter
++ grep -e -Dhbase.test
++ wc -l
+ ZOMBIE_TESTS_COUNT=0
+ [[ 0 != 0 ]]
+ echo 'We'\''re ok: there is no zombie test'
We're ok: there is no zombie test
POST BUILD TASK : SUCCESS
END OF POST BUILD TASK : 0
Archiving artifacts

Mime
View raw message