hbase-builds mailing list archives

Site index · List index
Message view « Date » · « Thread »
Top « Date » · « Thread »
From Apache Jenkins Server <jenk...@builds.apache.org>
Subject Build failed in Jenkins: HBase-Trunk_matrix » latest1.7,yahoo-not-h2 #1214
Date Tue, 12 Jul 2016 11:02:40 GMT
See <https://builds.apache.org/job/HBase-Trunk_matrix/jdk=latest1.7,label=yahoo-not-h2/1214/changes>

Changes:

[tedyu] HBASE-16184 Shell test fails due to rLoadSink being nil (Phil Yang)

------------------------------------------
[...truncated 5454 lines...]
Tests run: 1, Failures: 0, Errors: 0, Skipped: 0, Time elapsed: 10.488 sec - in org.apache.hadoop.hbase.security.token.TestDelegationTokenWithEncryption
Running org.apache.hadoop.hbase.security.visibility.TestVisibilityLabelsReplication
Tests run: 1, Failures: 0, Errors: 0, Skipped: 0, Time elapsed: 3.937 sec - in org.apache.hadoop.hbase.security.visibility.TestVisibilityLabelsWithSLGStack
Tests run: 6, Failures: 0, Errors: 0, Skipped: 0, Time elapsed: 142.929 sec - in org.apache.hadoop.hbase.security.access.TestAccessController2
Tests run: 64, Failures: 0, Errors: 0, Skipped: 0, Time elapsed: 116.681 sec - in org.apache.hadoop.hbase.security.access.TestAccessController
Running org.apache.hadoop.hbase.security.visibility.TestDefaultScanLabelGeneratorStack
Tests run: 1, Failures: 0, Errors: 0, Skipped: 0, Time elapsed: 4.338 sec - in org.apache.hadoop.hbase.security.visibility.TestDefaultScanLabelGeneratorStack
Running org.apache.hadoop.hbase.security.visibility.TestVisibilityLabelsWithACL
Running org.apache.hadoop.hbase.security.visibility.TestEnforcingScanLabelGenerator
Running org.apache.hadoop.hbase.security.visibility.TestVisibilityLablesWithGroups
Tests run: 1, Failures: 0, Errors: 0, Skipped: 0, Time elapsed: 4.085 sec - in org.apache.hadoop.hbase.security.visibility.TestEnforcingScanLabelGenerator
Tests run: 1, Failures: 0, Errors: 0, Skipped: 0, Time elapsed: 4.205 sec - in org.apache.hadoop.hbase.security.visibility.TestVisibilityLablesWithGroups
Tests run: 5, Failures: 0, Errors: 0, Skipped: 0, Time elapsed: 12.993 sec - in org.apache.hadoop.hbase.security.visibility.TestVisibilityLabelsWithACL
Running org.apache.hadoop.hbase.security.visibility.TestVisibilityWithCheckAuths
Tests run: 1, Failures: 0, Errors: 0, Skipped: 0, Time elapsed: 31.288 sec - in org.apache.hadoop.hbase.security.visibility.TestVisibilityLabelsReplication
Running org.apache.hadoop.hbase.security.visibility.TestVisibilityLabelReplicationWithExpAsString
Tests run: 2, Failures: 0, Errors: 0, Skipped: 0, Time elapsed: 7.158 sec - in org.apache.hadoop.hbase.security.visibility.TestVisibilityWithCheckAuths
Running org.apache.hadoop.hbase.TestRegionRebalancing
Running org.apache.hadoop.hbase.security.visibility.TestVisibilityLabelsWithDefaultVisLabelService
Running org.apache.hadoop.hbase.security.visibility.TestVisibilityLabelsWithCustomVisLabService
Running org.apache.hadoop.hbase.security.visibility.TestVisibilityLabelsOpWithDifferentUsersNoACL
Tests run: 1, Failures: 0, Errors: 0, Skipped: 0, Time elapsed: 2.43 sec - in org.apache.hadoop.hbase.security.visibility.TestVisibilityLabelsOpWithDifferentUsersNoACL
Tests run: 1, Failures: 0, Errors: 0, Skipped: 0, Time elapsed: 32.083 sec - in org.apache.hadoop.hbase.security.visibility.TestVisibilityLabelReplicationWithExpAsString
Running org.apache.hadoop.hbase.TestServerSideScanMetricsFromClientSide
Tests run: 2, Failures: 0, Errors: 0, Skipped: 0, Time elapsed: 3.324 sec - in org.apache.hadoop.hbase.TestServerSideScanMetricsFromClientSide
Running org.apache.hadoop.hbase.namespace.TestNamespaceAuditor
Tests run: 2, Failures: 0, Errors: 0, Skipped: 0, Time elapsed: 48.183 sec - in org.apache.hadoop.hbase.TestRegionRebalancing
Running org.apache.hadoop.hbase.quotas.TestQuotaTableUtil
Tests run: 21, Failures: 0, Errors: 0, Skipped: 0, Time elapsed: 46.958 sec - in org.apache.hadoop.hbase.security.visibility.TestVisibilityLabelsWithCustomVisLabService
Tests run: 3, Failures: 0, Errors: 0, Skipped: 0, Time elapsed: 2.304 sec - in org.apache.hadoop.hbase.quotas.TestQuotaTableUtil
Tests run: 26, Failures: 0, Errors: 0, Skipped: 0, Time elapsed: 57.31 sec - in org.apache.hadoop.hbase.security.visibility.TestVisibilityLabelsWithDefaultVisLabelService
Running org.apache.hadoop.hbase.wal.TestWALFactory
Running org.apache.hadoop.hbase.wal.TestFSHLogProvider
Running org.apache.hadoop.hbase.quotas.TestQuotaAdmin
Running org.apache.hadoop.hbase.wal.TestBoundedRegionGroupingStrategy
Tests run: 5, Failures: 0, Errors: 0, Skipped: 0, Time elapsed: 8 sec - in org.apache.hadoop.hbase.wal.TestFSHLogProvider
Tests run: 3, Failures: 0, Errors: 0, Skipped: 0, Time elapsed: 5.732 sec - in org.apache.hadoop.hbase.quotas.TestQuotaAdmin
Running org.apache.hadoop.hbase.wal.TestSecureWAL
Tests run: 9, Failures: 0, Errors: 0, Skipped: 0, Time elapsed: 16.859 sec - in org.apache.hadoop.hbase.wal.TestWALFactory
Running org.apache.hadoop.hbase.wal.TestWALSplitCompressed
Tests run: 2, Failures: 0, Errors: 0, Skipped: 0, Time elapsed: 2.585 sec - in org.apache.hadoop.hbase.wal.TestSecureWAL
Running org.apache.hadoop.hbase.wal.TestWALReaderOnSecureWAL
Tests run: 2, Failures: 0, Errors: 0, Skipped: 0, Time elapsed: 2.428 sec - in org.apache.hadoop.hbase.wal.TestWALReaderOnSecureWAL
Running org.apache.hadoop.hbase.wal.TestWALSplit
Running org.apache.hadoop.hbase.wal.TestDefaultWALProviderWithHLogKey
Tests run: 5, Failures: 0, Errors: 0, Skipped: 0, Time elapsed: 9.216 sec - in org.apache.hadoop.hbase.wal.TestDefaultWALProviderWithHLogKey
Running org.apache.hadoop.hbase.wal.TestWALFiltering
Tests run: 10, Failures: 0, Errors: 0, Skipped: 0, Time elapsed: 44.304 sec - in org.apache.hadoop.hbase.wal.TestBoundedRegionGroupingStrategy
Running org.apache.hadoop.hbase.TestLocalHBaseCluster
Tests run: 1, Failures: 0, Errors: 0, Skipped: 0, Time elapsed: 12.954 sec - in org.apache.hadoop.hbase.TestLocalHBaseCluster
Tests run: 1, Failures: 0, Errors: 0, Skipped: 0, Time elapsed: 33.518 sec - in org.apache.hadoop.hbase.wal.TestWALFiltering
Running org.apache.hadoop.hbase.master.TestRegionPlacement2
Tests run: 2, Failures: 0, Errors: 0, Skipped: 0, Time elapsed: 2.306 sec - in org.apache.hadoop.hbase.master.TestRegionPlacement2
Running org.apache.hadoop.hbase.master.TestRegionPlacement
Tests run: 2, Failures: 0, Errors: 0, Skipped: 2, Time elapsed: 0.002 sec - in org.apache.hadoop.hbase.master.TestRegionPlacement
Running org.apache.hadoop.hbase.master.TestActiveMasterManager
Tests run: 2, Failures: 0, Errors: 0, Skipped: 0, Time elapsed: 1.83 sec - in org.apache.hadoop.hbase.master.TestActiveMasterManager
Running org.apache.hadoop.hbase.master.TestSplitLogManager
Running org.apache.hadoop.hbase.master.TestMasterOperationsForRegionReplicas
Tests run: 32, Failures: 0, Errors: 0, Skipped: 0, Time elapsed: 84.409 sec - in org.apache.hadoop.hbase.wal.TestWALSplitCompressed
Running org.apache.hadoop.hbase.master.TestMasterFileSystem
Tests run: 1, Failures: 0, Errors: 0, Skipped: 0, Time elapsed: 1.101 sec - in org.apache.hadoop.hbase.master.TestMasterFileSystem
Tests run: 32, Failures: 0, Errors: 0, Skipped: 0, Time elapsed: 92.314 sec - in org.apache.hadoop.hbase.wal.TestWALSplit
Running org.apache.hadoop.hbase.master.TestMasterFailover
Tests run: 2, Failures: 0, Errors: 0, Skipped: 0, Time elapsed: 34.686 sec - in org.apache.hadoop.hbase.master.TestMasterOperationsForRegionReplicas
Running org.apache.hadoop.hbase.master.TestDeadServer
Tests run: 4, Failures: 0, Errors: 0, Skipped: 0, Time elapsed: 2.589 sec - in org.apache.hadoop.hbase.master.TestDeadServer
Running org.apache.hadoop.hbase.master.procedure.TestAddColumnFamilyProcedure
Running org.apache.hadoop.hbase.master.procedure.TestTableDescriptorModificationFromClient
Exception: java.lang.NoClassDefFoundError thrown from the UncaughtExceptionHandler in thread
"regionserver/proserpina.apache.org/67.195.81.189:0.logRoller"
Tests run: 8, Failures: 0, Errors: 4, Skipped: 0, Time elapsed: 32.385 sec <<< FAILURE!
- in org.apache.hadoop.hbase.master.procedure.TestAddColumnFamilyProcedure
testAddColumnFamily(org.apache.hadoop.hbase.master.procedure.TestAddColumnFamilyProcedure)
 Time elapsed: 0.94 sec  <<< ERROR!
java.lang.NullPointerException: null
	at org.apache.hadoop.hbase.procedure2.ProcedureTestingUtility.assertProcNotFailed(ProcedureTestingUtility.java:181)
	at org.apache.hadoop.hbase.master.procedure.MasterProcedureTestingUtility.createTable(MasterProcedureTestingUtility.java:77)
	at org.apache.hadoop.hbase.master.procedure.TestAddColumnFamilyProcedure.testAddColumnFamily(TestAddColumnFamilyProcedure.java:99)

testAddColumnFamily(org.apache.hadoop.hbase.master.procedure.TestAddColumnFamilyProcedure)
 Time elapsed: 0.94 sec  <<< ERROR!
java.lang.NullPointerException: null
	at org.apache.hadoop.hbase.master.procedure.TestAddColumnFamilyProcedure.getMasterProcedureExecutor(TestAddColumnFamilyProcedure.java:292)
	at org.apache.hadoop.hbase.master.procedure.TestAddColumnFamilyProcedure.tearDown(TestAddColumnFamilyProcedure.java:83)

testRecoveryAndDoubleExecutionOffline(org.apache.hadoop.hbase.master.procedure.TestAddColumnFamilyProcedure)
 Time elapsed: 0.029 sec  <<< ERROR!
java.lang.NullPointerException: null
	at org.apache.hadoop.hbase.master.procedure.TestAddColumnFamilyProcedure.getMasterProcedureExecutor(TestAddColumnFamilyProcedure.java:292)
	at org.apache.hadoop.hbase.master.procedure.TestAddColumnFamilyProcedure.setup(TestAddColumnFamilyProcedure.java:75)

testRecoveryAndDoubleExecutionOffline(org.apache.hadoop.hbase.master.procedure.TestAddColumnFamilyProcedure)
 Time elapsed: 0.03 sec  <<< ERROR!
java.lang.NullPointerException: null
	at org.apache.hadoop.hbase.master.procedure.TestAddColumnFamilyProcedure.getMasterProcedureExecutor(TestAddColumnFamilyProcedure.java:292)
	at org.apache.hadoop.hbase.master.procedure.TestAddColumnFamilyProcedure.tearDown(TestAddColumnFamilyProcedure.java:83)

Tests run: 13, Failures: 0, Errors: 2, Skipped: 0, Time elapsed: 216.955 sec <<<
FAILURE! - in org.apache.hadoop.hbase.namespace.TestNamespaceAuditor
testRegionMerge(org.apache.hadoop.hbase.namespace.TestNamespaceAuditor)  Time elapsed: 30.789
sec  <<< ERROR!
org.apache.hadoop.hbase.client.RetriesExhaustedWithDetailsException: Failed 1 action: RetriesExhaustedException:
1 time, servers with issues: null, 
	at org.apache.hadoop.hbase.client.AsyncProcess$BatchErrors.makeException(AsyncProcess.java:265)
	at org.apache.hadoop.hbase.client.AsyncProcess$BatchErrors.access$2200(AsyncProcess.java:241)
	at org.apache.hadoop.hbase.client.AsyncProcess.waitForAllPreviousOpsAndReset(AsyncProcess.java:1867)
	at org.apache.hadoop.hbase.client.BufferedMutatorImpl.backgroundFlushCommits(BufferedMutatorImpl.java:241)
	at org.apache.hadoop.hbase.client.BufferedMutatorImpl.flush(BufferedMutatorImpl.java:191)
	at org.apache.hadoop.hbase.client.HTable.flushCommits(HTable.java:979)
	at org.apache.hadoop.hbase.client.HTable.put(HTable.java:566)
	at org.apache.hadoop.hbase.HBaseTestingUtility.loadNumericRows(HBaseTestingUtility.java:2116)
	at org.apache.hadoop.hbase.namespace.TestNamespaceAuditor.testRegionMerge(TestNamespaceAuditor.java:329)

testRegionMerge(org.apache.hadoop.hbase.namespace.TestNamespaceAuditor)  Time elapsed: 30.792
sec  <<< ERROR!
org.apache.hadoop.hbase.client.RetriesExhaustedException: Failed after attempts=6, exceptions:
Tue Jul 12 10:47:32 UTC 2016, RpcRetryingCaller{globalStartTime=1468320452054, pause=100,
maxAttempts=6}, org.apache.hadoop.hbase.MasterNotRunningException: java.io.IOException: Can't
get master address from ZooKeeper; znode data == null
Tue Jul 12 10:47:32 UTC 2016, RpcRetryingCaller{globalStartTime=1468320452054, pause=100,
maxAttempts=6}, org.apache.hadoop.hbase.MasterNotRunningException: java.io.IOException: Can't
get master address from ZooKeeper; znode data == null
Tue Jul 12 10:47:32 UTC 2016, RpcRetryingCaller{globalStartTime=1468320452054, pause=100,
maxAttempts=6}, org.apache.hadoop.hbase.MasterNotRunningException: java.io.IOException: Can't
get master address from ZooKeeper; znode data == null
Tue Jul 12 10:47:32 UTC 2016, RpcRetryingCaller{globalStartTime=1468320452054, pause=100,
maxAttempts=6}, org.apache.hadoop.hbase.MasterNotRunningException: java.io.IOException: Can't
get master address from ZooKeeper; znode data == null
Tue Jul 12 10:47:33 UTC 2016, RpcRetryingCaller{globalStartTime=1468320452054, pause=100,
maxAttempts=6}, org.apache.hadoop.hbase.MasterNotRunningException: java.io.IOException: Can't
get master address from ZooKeeper; znode data == null
Tue Jul 12 10:47:34 UTC 2016, RpcRetryingCaller{globalStartTime=1468320452054, pause=100,
maxAttempts=6}, org.apache.hadoop.hbase.MasterNotRunningException: java.io.IOException: Can't
get master address from ZooKeeper; znode data == null

	at org.apache.hadoop.hbase.zookeeper.MasterAddressTracker.getMasterAddress(MasterAddressTracker.java:155)
	at org.apache.hadoop.hbase.client.ConnectionImplementation$StubMaker.makeStubNoRetries(ConnectionImplementation.java:1078)
	at org.apache.hadoop.hbase.client.ConnectionImplementation$StubMaker.makeStub(ConnectionImplementation.java:1119)
	at org.apache.hadoop.hbase.client.ConnectionImplementation$MasterServiceStubMaker.makeStub(ConnectionImplementation.java:1148)
	at org.apache.hadoop.hbase.client.ConnectionImplementation.getKeepAliveMasterService(ConnectionImplementation.java:1289)
	at org.apache.hadoop.hbase.client.MasterCallable.prepare(MasterCallable.java:38)
	at org.apache.hadoop.hbase.client.RpcRetryingCallerImpl.callWithRetries(RpcRetryingCallerImpl.java:100)
	at org.apache.hadoop.hbase.client.HBaseAdmin.executeCallable(HBaseAdmin.java:2889)
	at org.apache.hadoop.hbase.client.HBaseAdmin.executeCallable(HBaseAdmin.java:2881)
	at org.apache.hadoop.hbase.client.HBaseAdmin.listTables(HBaseAdmin.java:350)
	at org.apache.hadoop.hbase.client.HBaseAdmin.listTables(HBaseAdmin.java:334)
	at org.apache.hadoop.hbase.namespace.TestNamespaceAuditor.cleanup(TestNamespaceAuditor.java:129)

Tests run: 15, Failures: 0, Errors: 2, Skipped: 1, Time elapsed: 133.425 sec <<<
FAILURE! - in org.apache.hadoop.hbase.master.TestSplitLogManager
testLogFilesAreArchived(org.apache.hadoop.hbase.master.TestSplitLogManager)  Time elapsed:
0.194 sec  <<< ERROR!
java.lang.NoClassDefFoundError: org/apache/hadoop/hbase/master/TestSplitLogManager$5
	at java.net.URLClassLoader$1.run(URLClassLoader.java:366)
	at java.net.URLClassLoader$1.run(URLClassLoader.java:355)
	at java.security.AccessController.doPrivileged(Native Method)
	at java.net.URLClassLoader.findClass(URLClassLoader.java:354)
	at java.lang.ClassLoader.loadClass(ClassLoader.java:425)
	at sun.misc.Launcher$AppClassLoader.loadClass(Launcher.java:308)
	at java.lang.ClassLoader.loadClass(ClassLoader.java:358)
	at org.apache.hadoop.hbase.master.TestSplitLogManager.testLogFilesAreArchived(TestSplitLogManager.java:598)

testRescanCleanup(org.apache.hadoop.hbase.master.TestSplitLogManager)  Time elapsed: 0.162
sec  <<< ERROR!
java.lang.NoClassDefFoundError: org/apache/hadoop/hbase/master/TestSplitLogManager$4
	at java.net.URLClassLoader$1.run(URLClassLoader.java:366)
	at java.net.URLClassLoader$1.run(URLClassLoader.java:355)
	at java.security.AccessController.doPrivileged(Native Method)
	at java.net.URLClassLoader.findClass(URLClassLoader.java:354)
	at java.lang.ClassLoader.loadClass(ClassLoader.java:425)
	at sun.misc.Launcher$AppClassLoader.loadClass(Launcher.java:308)
	at java.lang.ClassLoader.loadClass(ClassLoader.java:358)
	at org.apache.hadoop.hbase.master.TestSplitLogManager.testRescanCleanup(TestSplitLogManager.java:400)

Tests run: 3, Failures: 0, Errors: 1, Skipped: 0, Time elapsed: 254.608 sec <<< FAILURE!
- in org.apache.hadoop.hbase.master.TestMasterFailover
testSimpleMasterFailover(org.apache.hadoop.hbase.master.TestMasterFailover)  Time elapsed:
218.927 sec  <<< ERROR!
java.io.IOException: Shutting down
	at org.apache.hadoop.hbase.util.JVMClusterUtil.startup(JVMClusterUtil.java:225)
	at org.apache.hadoop.hbase.LocalHBaseCluster.startup(LocalHBaseCluster.java:410)
	at org.apache.hadoop.hbase.MiniHBaseCluster.init(MiniHBaseCluster.java:227)
	at org.apache.hadoop.hbase.MiniHBaseCluster.<init>(MiniHBaseCluster.java:96)
	at org.apache.hadoop.hbase.HBaseTestingUtility.startMiniHBaseCluster(HBaseTestingUtility.java:1093)
	at org.apache.hadoop.hbase.HBaseTestingUtility.startMiniCluster(HBaseTestingUtility.java:1053)
	at org.apache.hadoop.hbase.HBaseTestingUtility.startMiniCluster(HBaseTestingUtility.java:925)
	at org.apache.hadoop.hbase.HBaseTestingUtility.startMiniCluster(HBaseTestingUtility.java:919)
	at org.apache.hadoop.hbase.master.TestMasterFailover.testSimpleMasterFailover(TestMasterFailover.java:102)


Results :

Tests in error: 
  TestMasterFailover.testSimpleMasterFailover:102 » IO Shutting down
  TestSplitLogManager.testLogFilesAreArchived:598 NoClassDefFound org/apache/had...
  TestSplitLogManager.testRescanCleanup:400 NoClassDefFound org/apache/hadoop/hb...
org.apache.hadoop.hbase.master.procedure.TestAddColumnFamilyProcedure.testAddColumnFamily(org.apache.hadoop.hbase.master.procedure.TestAddColumnFamilyProcedure)
  Run 1: TestAddColumnFamilyProcedure.testAddColumnFamily:99 » NullPointer
  Run 2: TestAddColumnFamilyProcedure.tearDown:83->getMasterProcedureExecutor:292 NullPointer

org.apache.hadoop.hbase.master.procedure.TestAddColumnFamilyProcedure.testRecoveryAndDoubleExecutionOffline(org.apache.hadoop.hbase.master.procedure.TestAddColumnFamilyProcedure)
  Run 1: TestAddColumnFamilyProcedure.setup:75->getMasterProcedureExecutor:292 NullPointer
  Run 2: TestAddColumnFamilyProcedure.tearDown:83->getMasterProcedureExecutor:292 NullPointer

org.apache.hadoop.hbase.namespace.TestNamespaceAuditor.testRegionMerge(org.apache.hadoop.hbase.namespace.TestNamespaceAuditor)
  Run 1: TestNamespaceAuditor.testRegionMerge:329 » RetriesExhaustedWithDetails Failed ...
  Run 2: TestNamespaceAuditor.cleanup:129 » RetriesExhausted Failed after attempts=6, e...


Tests run: 1727, Failures: 0, Errors: 6, Skipped: 19

[INFO] ------------------------------------------------------------------------
[INFO] Reactor Summary:
[INFO] 
[INFO] Apache HBase ...................................... SUCCESS [  2.574 s]
[INFO] Apache HBase - Checkstyle ......................... SUCCESS [  0.648 s]
[INFO] Apache HBase - Resource Bundle .................... SUCCESS [  0.207 s]
[INFO] Apache HBase - Annotations ........................ SUCCESS [  0.179 s]
[INFO] Apache HBase - Protocol ........................... SUCCESS [  3.158 s]
[INFO] Apache HBase - Common ............................. SUCCESS [01:32 min]
[INFO] Apache HBase - Procedure .......................... SUCCESS [01:34 min]
[INFO] Apache HBase - Client ............................. SUCCESS [ 41.793 s]
[INFO] Apache HBase - Hadoop Compatibility ............... SUCCESS [  7.580 s]
[INFO] Apache HBase - Hadoop Two Compatibility ........... SUCCESS [  9.648 s]
[INFO] Apache HBase - Prefix Tree ........................ SUCCESS [ 10.650 s]
[INFO] Apache HBase - Server ............................. FAILURE [  01:15 h]
[INFO] Apache HBase - Testing Util ....................... SKIPPED
[INFO] Apache HBase - Thrift ............................. SKIPPED
[INFO] Apache HBase - RSGroup ............................ SKIPPED
[INFO] Apache HBase - Shell .............................. SKIPPED
[INFO] Apache HBase - Integration Tests .................. SKIPPED
[INFO] Apache HBase - Examples ........................... SKIPPED
[INFO] Apache HBase - Rest ............................... SKIPPED
[INFO] Apache HBase - External Block Cache ............... SKIPPED
[INFO] Apache HBase - Spark .............................. SKIPPED
[INFO] Apache HBase - Assembly ........................... SKIPPED
[INFO] Apache HBase - Shaded ............................. SKIPPED
[INFO] Apache HBase - Shaded - Client .................... SKIPPED
[INFO] Apache HBase - Shaded - Server .................... SKIPPED
[INFO] Apache HBase - Archetypes ......................... SKIPPED
[INFO] Apache HBase - Exemplar for hbase-client archetype  SKIPPED
[INFO] Apache HBase - Exemplar for hbase-shaded-client archetype  SKIPPED
[INFO] Apache HBase - Archetype builder .................. SKIPPED
[INFO] ------------------------------------------------------------------------
[INFO] BUILD FAILURE
[INFO] ------------------------------------------------------------------------
[INFO] Total time: 01:19 h
[INFO] Finished at: 2016-07-12T11:01:47+00:00
[INFO] Final Memory: 259M/480M
[INFO] ------------------------------------------------------------------------
[ERROR] Failed to execute goal org.apache.maven.plugins:maven-surefire-plugin:2.18.1:test
(secondPartTestsExecution) on project hbase-server: ExecutionException: org.apache.maven.surefire.booter.SurefireBooterForkException:
Error creating properties files for forking: No such file or directory -> [Help 1]
[ERROR] 
[ERROR] To see the full stack trace of the errors, re-run Maven with the -e switch.
[ERROR] Re-run Maven using the -X switch to enable full debug logging.
[ERROR] 
[ERROR] For more information about the errors and possible solutions, please read the following
articles:
[ERROR] [Help 1] http://cwiki.apache.org/confluence/display/MAVEN/MojoFailureException
[ERROR] 
[ERROR] After correcting the problems, you can resume the build with the command
[ERROR]   mvn <goals> -rf :hbase-server
Build step 'Invoke top-level Maven targets' marked build as failure
Performing Post build task...
Match found for :.* : True
Logical operation result is TRUE
Running script  : # Run zombie detector script
./dev-support/zombie-detector.sh --jenkins ${BUILD_ID}
[yahoo-not-h2] $ /bin/bash -xe /tmp/hudson6902131504685107149.sh
+ ./dev-support/zombie-detector.sh --jenkins 1214
/tmp/hudson6902131504685107149.sh: line 3: ./dev-support/zombie-detector.sh: No such file
or directory
POST BUILD TASK : FAILURE
END OF POST BUILD TASK : 0
Archiving artifacts
Recording test results
[FINDBUGS] Skipping publisher since build result is FAILURE
[CHECKSTYLE] Skipping publisher since build result is FAILURE

Mime
View raw message