hbase-builds mailing list archives

Site index · List index
Message view « Date » · « Thread »
Top « Date » · « Thread »
From Apache Jenkins Server <jenk...@builds.apache.org>
Subject Build failed in Jenkins: HBase-1.4 » JDK_1_7,Hadoop&&!H13 #721
Date Thu, 04 May 2017 17:37:47 GMT
See <https://builds.apache.org/job/HBase-1.4/jdk=JDK_1_7,label=Hadoop&&!H13/721/display/redirect?page=changes>

Changes:

[tedyu] HBASE-17991 Add more details about compaction queue on /dump (Guangxu

------------------------------------------
[...truncated 2.25 MB...]
Running org.apache.hadoop.hbase.master.procedure.TestAddColumnFamilyProcedure
Tests run: 7, Failures: 0, Errors: 0, Skipped: 0, Time elapsed: 13.047 sec - in org.apache.hadoop.hbase.master.procedure.TestCreateNamespaceProcedure
Running org.apache.hadoop.hbase.master.procedure.TestEnableTableProcedure
Running org.apache.hadoop.hbase.master.procedure.TestModifyTableProcedure
Tests run: 3, Failures: 0, Errors: 0, Skipped: 0, Time elapsed: 44.574 sec - in org.apache.hadoop.hbase.master.procedure.TestWALProcedureStoreOnHDFS
Tests run: 5, Failures: 0, Errors: 0, Skipped: 0, Time elapsed: 33.067 sec - in org.apache.hadoop.hbase.master.procedure.TestAddColumnFamilyProcedure
Running org.apache.hadoop.hbase.master.procedure.TestTableDescriptorModificationFromClient
Tests run: 8, Failures: 0, Errors: 0, Skipped: 0, Time elapsed: 314.754 sec - in org.apache.hadoop.hbase.replication.TestMasterReplication
Running org.apache.hadoop.hbase.master.procedure.TestCreateTableProcedure
Tests run: 4, Failures: 0, Errors: 0, Skipped: 0, Time elapsed: 36.002 sec - in org.apache.hadoop.hbase.master.procedure.TestEnableTableProcedure
Running org.apache.hadoop.hbase.master.procedure.TestTruncateTableProcedure
Running org.apache.hadoop.hbase.master.procedure.TestDeleteNamespaceProcedure
Tests run: 8, Failures: 0, Errors: 0, Skipped: 0, Time elapsed: 62.905 sec - in org.apache.hadoop.hbase.master.procedure.TestModifyTableProcedure
Tests run: 6, Failures: 0, Errors: 0, Skipped: 0, Time elapsed: 18.828 sec - in org.apache.hadoop.hbase.master.procedure.TestDeleteNamespaceProcedure
Tests run: 7, Failures: 0, Errors: 0, Skipped: 0, Time elapsed: 40.713 sec - in org.apache.hadoop.hbase.master.procedure.TestCreateTableProcedure
Running org.apache.hadoop.hbase.master.procedure.TestSafemodeBringsDownMaster
Running org.apache.hadoop.hbase.master.procedure.TestModifyColumnFamilyProcedure
Tests run: 1, Failures: 0, Errors: 0, Skipped: 0, Time elapsed: 3.827 sec - in org.apache.hadoop.hbase.master.procedure.TestSafemodeBringsDownMaster
Tests run: 7, Failures: 0, Errors: 0, Skipped: 0, Time elapsed: 60.49 sec - in org.apache.hadoop.hbase.master.procedure.TestTableDescriptorModificationFromClient
Running org.apache.hadoop.hbase.master.procedure.TestModifyNamespaceProcedure
Running org.apache.hadoop.hbase.master.procedure.TestDeleteColumnFamilyProcedure
Tests run: 6, Failures: 0, Errors: 0, Skipped: 0, Time elapsed: 11.482 sec - in org.apache.hadoop.hbase.master.procedure.TestModifyNamespaceProcedure
Running org.apache.hadoop.hbase.master.procedure.TestDeleteTableProcedure
Tests run: 7, Failures: 0, Errors: 0, Skipped: 0, Time elapsed: 62.54 sec - in org.apache.hadoop.hbase.master.procedure.TestTruncateTableProcedure
Tests run: 5, Failures: 0, Errors: 0, Skipped: 0, Time elapsed: 34.649 sec - in org.apache.hadoop.hbase.master.procedure.TestModifyColumnFamilyProcedure
Running org.apache.hadoop.hbase.master.procedure.TestMasterProcedureEvents
Running org.apache.hadoop.hbase.master.handler.TestCreateTableHandler
Running org.apache.hadoop.hbase.master.procedure.TestDisableTableProcedure
Tests run: 6, Failures: 0, Errors: 0, Skipped: 0, Time elapsed: 22.256 sec - in org.apache.hadoop.hbase.master.procedure.TestDeleteTableProcedure
Running org.apache.hadoop.hbase.master.handler.TestEnableTableHandler
Tests run: 2, Failures: 0, Errors: 0, Skipped: 0, Time elapsed: 14.789 sec - in org.apache.hadoop.hbase.master.procedure.TestMasterProcedureEvents
Tests run: 7, Failures: 0, Errors: 0, Skipped: 0, Time elapsed: 41.803 sec - in org.apache.hadoop.hbase.master.procedure.TestDeleteColumnFamilyProcedure
Running org.apache.hadoop.hbase.master.TestRestartCluster
Tests run: 3, Failures: 0, Errors: 0, Skipped: 0, Time elapsed: 14.569 sec - in org.apache.hadoop.hbase.master.procedure.TestDisableTableProcedure
Running org.apache.hadoop.hbase.master.TestRegionPlacement2
Tests run: 2, Failures: 0, Errors: 0, Skipped: 0, Time elapsed: 2.433 sec - in org.apache.hadoop.hbase.master.TestRegionPlacement2
Running org.apache.hadoop.hbase.master.TestMasterNoCluster
Running org.apache.hadoop.hbase.master.TestAssignmentListener
Tests run: 3, Failures: 0, Errors: 0, Skipped: 0, Time elapsed: 40.331 sec - in org.apache.hadoop.hbase.master.handler.TestCreateTableHandler
Tests run: 3, Failures: 0, Errors: 0, Skipped: 0, Time elapsed: 15.654 sec - in org.apache.hadoop.hbase.master.TestMasterNoCluster
Tests run: 3, Failures: 0, Errors: 0, Skipped: 0, Time elapsed: 12.81 sec - in org.apache.hadoop.hbase.master.TestAssignmentListener
Running org.apache.hadoop.hbase.master.TestZKBasedOpenCloseRegion
Tests run: 3, Failures: 0, Errors: 0, Skipped: 0, Time elapsed: 4.218 sec - in org.apache.hadoop.hbase.master.TestZKBasedOpenCloseRegion
Running org.apache.hadoop.hbase.master.balancer.TestStochasticLoadBalancer2
Running org.apache.hadoop.hbase.master.TestWarmupRegion
Running org.apache.hadoop.hbase.master.TestDeadServer
Tests run: 4, Failures: 0, Errors: 0, Skipped: 0, Time elapsed: 2.256 sec - in org.apache.hadoop.hbase.master.TestDeadServer
Running org.apache.hadoop.hbase.master.balancer.TestBaseLoadBalancer
Tests run: 7, Failures: 0, Errors: 0, Skipped: 0, Time elapsed: 0.652 sec - in org.apache.hadoop.hbase.master.balancer.TestBaseLoadBalancer
Running org.apache.hadoop.hbase.master.balancer.TestStochasticLoadBalancer
Tests run: 3, Failures: 0, Errors: 0, Skipped: 0, Time elapsed: 70.431 sec - in org.apache.hadoop.hbase.master.TestRestartCluster
Running org.apache.hadoop.hbase.master.balancer.TestDefaultLoadBalancer
Tests run: 3, Failures: 0, Errors: 0, Skipped: 0, Time elapsed: 86.498 sec - in org.apache.hadoop.hbase.master.handler.TestEnableTableHandler
Tests run: 1, Failures: 0, Errors: 0, Skipped: 0, Time elapsed: 3.531 sec - in org.apache.hadoop.hbase.master.balancer.TestDefaultLoadBalancer
Running org.apache.hadoop.hbase.master.TestGetInfoPort
Running org.apache.hadoop.hbase.master.TestGetLastFlushedSequenceId
Tests run: 1, Failures: 0, Errors: 0, Skipped: 0, Time elapsed: 33.431 sec - in org.apache.hadoop.hbase.master.TestWarmupRegion
Running org.apache.hadoop.hbase.master.TestSplitLogManager
Tests run: 1, Failures: 0, Errors: 0, Skipped: 0, Time elapsed: 13.874 sec - in org.apache.hadoop.hbase.master.TestGetInfoPort
Running org.apache.hadoop.hbase.master.TestRollingRestart
Tests run: 1, Failures: 0, Errors: 0, Skipped: 0, Time elapsed: 21.815 sec - in org.apache.hadoop.hbase.master.TestGetLastFlushedSequenceId
Running org.apache.hadoop.hbase.master.TestMasterPriorityRpc
Tests run: 3, Failures: 0, Errors: 0, Skipped: 0, Time elapsed: 2.796 sec - in org.apache.hadoop.hbase.master.TestMasterPriorityRpc
Running org.apache.hadoop.hbase.master.TestMasterFileSystem
Tests run: 2, Failures: 0, Errors: 0, Skipped: 0, Time elapsed: 1.545 sec - in org.apache.hadoop.hbase.master.TestMasterFileSystem
Running org.apache.hadoop.hbase.master.TestMasterFileSystemWithWALDir
Tests run: 1, Failures: 0, Errors: 0, Skipped: 0, Time elapsed: 1.682 sec - in org.apache.hadoop.hbase.master.TestMasterFileSystemWithWALDir
Running org.apache.hadoop.hbase.master.TestMasterTransitions
Tests run: 3, Failures: 0, Errors: 0, Skipped: 3, Time elapsed: 0.002 sec - in org.apache.hadoop.hbase.master.TestMasterTransitions
Tests run: 1, Failures: 0, Errors: 0, Skipped: 0, Time elapsed: 50.327 sec - in org.apache.hadoop.hbase.master.TestRollingRestart
Running org.apache.hadoop.hbase.master.TestDistributedLogSplitting
Running org.apache.hadoop.hbase.master.TestAssignmentManagerOnCluster
Tests run: 18, Failures: 0, Errors: 0, Skipped: 15, Time elapsed: 75.357 sec - in org.apache.hadoop.hbase.master.TestDistributedLogSplitting
Running org.apache.hadoop.hbase.master.TestMasterBalanceThrottling
Tests run: 15, Failures: 0, Errors: 0, Skipped: 1, Time elapsed: 143.166 sec - in org.apache.hadoop.hbase.master.TestSplitLogManager
Running org.apache.hadoop.hbase.master.TestMasterFailover
Tests run: 2, Failures: 0, Errors: 0, Skipped: 0, Time elapsed: 102.017 sec - in org.apache.hadoop.hbase.master.TestMasterBalanceThrottling
Running org.apache.hadoop.hbase.master.snapshot.TestSnapshotFileCache
Tests run: 23, Failures: 0, Errors: 0, Skipped: 1, Time elapsed: 285.829 sec - in org.apache.hadoop.hbase.master.balancer.TestStochasticLoadBalancer
Tests run: 21, Failures: 0, Errors: 0, Skipped: 0, Time elapsed: 184.136 sec - in org.apache.hadoop.hbase.master.TestAssignmentManagerOnCluster
Running org.apache.hadoop.hbase.master.TestMasterMetrics
Tests run: 3, Failures: 0, Errors: 0, Skipped: 0, Time elapsed: 1.023 sec - in org.apache.hadoop.hbase.master.TestMasterMetrics
Running org.apache.hadoop.hbase.master.TestMasterFailoverBalancerPersistence
Running org.apache.hadoop.hbase.master.TestMaster
Tests run: 7, Failures: 0, Errors: 0, Skipped: 0, Time elapsed: 147.041 sec - in org.apache.hadoop.hbase.master.TestMasterFailover
Tests run: 4, Failures: 0, Errors: 0, Skipped: 0, Time elapsed: 40.592 sec - in org.apache.hadoop.hbase.master.snapshot.TestSnapshotFileCache
Running org.apache.hadoop.hbase.master.TestMasterShutdown
Tests run: 1, Failures: 0, Errors: 0, Skipped: 0, Time elapsed: 21.213 sec - in org.apache.hadoop.hbase.master.TestMasterFailoverBalancerPersistence
Running org.apache.hadoop.hbase.master.TestMasterStatusServlet
Tests run: 4, Failures: 0, Errors: 0, Skipped: 0, Time elapsed: 2.603 sec - in org.apache.hadoop.hbase.master.TestMasterStatusServlet
Tests run: 4, Failures: 0, Errors: 0, Skipped: 0, Time elapsed: 24.357 sec - in org.apache.hadoop.hbase.master.TestMaster
Running org.apache.hadoop.hbase.master.TestAssignmentManagerMetrics
Running org.apache.hadoop.hbase.master.TestMasterOperationsForRegionReplicas
Running org.apache.hadoop.hbase.master.TestMasterMetricsWrapper
Tests run: 1, Failures: 0, Errors: 0, Skipped: 0, Time elapsed: 13.424 sec - in org.apache.hadoop.hbase.master.TestAssignmentManagerMetrics
Running org.apache.hadoop.hbase.master.TestHMasterRPCException
Tests run: 1, Failures: 0, Errors: 0, Skipped: 0, Time elapsed: 2.057 sec - in org.apache.hadoop.hbase.master.TestMasterMetricsWrapper
Running org.apache.hadoop.hbase.master.TestTableLockManager
Tests run: 1, Failures: 0, Errors: 0, Skipped: 0, Time elapsed: 4.969 sec - in org.apache.hadoop.hbase.master.TestHMasterRPCException
Tests run: 2, Failures: 0, Errors: 0, Skipped: 0, Time elapsed: 38.489 sec - in org.apache.hadoop.hbase.master.TestMasterShutdown
Running org.apache.hadoop.hbase.master.TestActiveMasterManager
Tests run: 2, Failures: 0, Errors: 0, Skipped: 0, Time elapsed: 2.058 sec - in org.apache.hadoop.hbase.master.TestActiveMasterManager
Tests run: 2, Failures: 0, Errors: 0, Skipped: 0, Time elapsed: 41.152 sec - in org.apache.hadoop.hbase.master.TestMasterOperationsForRegionReplicas
Tests run: 4, Failures: 0, Errors: 0, Skipped: 0, Time elapsed: 108.993 sec - in org.apache.hadoop.hbase.master.TestTableLockManager
Tests run: 4, Failures: 0, Errors: 0, Skipped: 0, Time elapsed: 502.296 sec - in org.apache.hadoop.hbase.master.balancer.TestStochasticLoadBalancer2

Results :

Failed tests: 
org.apache.hadoop.hbase.regionserver.TestCompactionInDeadRegionServer.test(org.apache.hadoop.hbase.regionserver.TestCompactionInDeadRegionServer)
  Run 1: TestCompactionInDeadRegionServer.test:132 Should fail as our wal file has already
been closed, and walDir has also been renamed
  Run 2: TestCompactionInDeadRegionServer.test:132 Should fail as our wal file has already
been closed, and walDir has also been renamed
  Run 3: TestCompactionInDeadRegionServer.test:132 Should fail as our wal file has already
been closed, and walDir has also been renamed


Tests run: 2784, Failures: 1, Errors: 0, Skipped: 57

[INFO] ------------------------------------------------------------------------
[INFO] Reactor Summary:
[INFO] 
[INFO] Apache HBase ...................................... SUCCESS [1:42.601s]
[INFO] Apache HBase - Checkstyle ......................... SUCCESS [15.445s]
[INFO] Apache HBase - Resource Bundle .................... SUCCESS [0.258s]
[INFO] Apache HBase - Annotations ........................ SUCCESS [1.245s]
[INFO] Apache HBase - Protocol ........................... SUCCESS [18.460s]
[INFO] Apache HBase - Common ............................. SUCCESS [2:42.837s]
[INFO] Apache HBase - Procedure .......................... SUCCESS [3:37.847s]
[INFO] Apache HBase - Hadoop Compatibility ............... SUCCESS [10.514s]
[INFO] Apache HBase - Hadoop Two Compatibility ........... SUCCESS [18.452s]
[INFO] Apache HBase - Client ............................. SUCCESS [1:45.853s]
[INFO] Apache HBase - Prefix Tree ........................ SUCCESS [10.057s]
[INFO] Apache HBase - Server ............................. FAILURE [1:49:35.302s]
[INFO] Apache HBase - Testing Util ....................... SKIPPED
[INFO] Apache HBase - Thrift ............................. SKIPPED
[INFO] Apache HBase - Rest ............................... SKIPPED
[INFO] Apache HBase - Shell .............................. SKIPPED
[INFO] Apache HBase - Integration Tests .................. SKIPPED
[INFO] Apache HBase - Examples ........................... SKIPPED
[INFO] Apache HBase - External Block Cache ............... SKIPPED
[INFO] Apache HBase - Assembly ........................... SKIPPED
[INFO] Apache HBase - Shaded ............................. SKIPPED
[INFO] Apache HBase - Shaded - Client .................... SKIPPED
[INFO] Apache HBase - Shaded - Server .................... SKIPPED
[INFO] Apache HBase - Archetypes ......................... SKIPPED
[INFO] Apache HBase - Exemplar for hbase-client archetype  SKIPPED
[INFO] Apache HBase - Exemplar for hbase-shaded-client archetype  SKIPPED
[INFO] Apache HBase - Archetype builder .................. SKIPPED
[INFO] ------------------------------------------------------------------------
[INFO] BUILD FAILURE
[INFO] ------------------------------------------------------------------------
[INFO] Total time: 2:01:11.153s
[INFO] Finished at: Thu May 04 17:32:03 UTC 2017
[INFO] Final Memory: 97M/770M
[INFO] ------------------------------------------------------------------------
[ERROR] Failed to execute goal org.apache.maven.plugins:maven-surefire-plugin:2.18.1:test
(secondPartTestsExecution) on project hbase-server: There are test failures.
[ERROR] 
[ERROR] Please refer to <https://builds.apache.org/job/HBase-1.4/jdk=JDK_1_7,label=Hadoop&&!H13/ws/hbase-server/target/surefire-reports>
for the individual test results.
[ERROR] -> [Help 1]
[ERROR] 
[ERROR] To see the full stack trace of the errors, re-run Maven with the -e switch.
[ERROR] Re-run Maven using the -X switch to enable full debug logging.
[ERROR] 
[ERROR] For more information about the errors and possible solutions, please read the following
articles:
[ERROR] [Help 1] http://cwiki.apache.org/confluence/display/MAVEN/MojoFailureException
[ERROR] 
[ERROR] After correcting the problems, you can resume the build with the command
[ERROR]   mvn <goals> -rf :hbase-server
Build step 'Invoke top-level Maven targets' marked build as failure
Performing Post build task...
Match found for :.* : True
Logical operation result is TRUE
Running script  : # Post-build task script. TODO: Check this in and have all builds reference
check-in.
pwd && ls
# NOTE!!!! The below code has been copied and pasted from ./dev-tools/run-test.sh
# Do not change here without syncing there and vice-versa.
ZOMBIE_TESTS_COUNT=`jps -v | grep surefirebooter | grep -e '-Dhbase.test' | wc -l`
if [[ $ZOMBIE_TESTS_COUNT != 0 ]] ; then
 echo "Suspicious java process found - waiting 30s to see if there are just slow to stop"
 sleep 30
 ZOMBIE_TESTS_COUNT=`jps -v | grep surefirebooter | grep -e '-Dhbase.test' | wc -l`
 if [[ $ZOMBIE_TESTS_COUNT != 0 ]] ; then
   echo " {color:red}There appear to be $ZOMBIE_TESTS_COUNT zombie tests{color}, they should
have been killed by surefire but survived"
   jps -v | grep surefirebooter | grep -e '-Dhbase.test'
   jps -v | grep surefirebooter | grep -e '-Dhbase.test' | cut -d ' ' -f 1 | xargs -n 1 jstack
   # Exit with error
   exit 1
 else
   echo "We're ok: there is no zombie test, but some tests took some time to stop"
 fi
else
  echo "We're ok: there is no zombie test"
fi
Setting JDK_1_7_LATEST__HOME=/home/jenkins/tools/java/latest1.7
Setting JDK_1_8_LATEST__HOME=/home/jenkins/tools/java/latest1.8
[19ccb43d] $ /bin/bash -xe /tmp/hudson5802467717420182231.sh
+ pwd
<https://builds.apache.org/job/HBase-1.4/jdk=JDK_1_7,label=Hadoop&&!H13/ws/>
+ ls
bin
CHANGES.txt
conf
dev-support
extra_env_var
hbase-annotations
hbase-archetypes
hbase-assembly
hbase-checkstyle
hbase-client
hbase-common
hbase-examples
hbase-external-blockcache
hbase-hadoop2-compat
hbase-hadoop-compat
hbase-it
hbase-native-client
hbase-prefix-tree
hbase-procedure
hbase-protocol
hbase-resource-bundle
hbase-rest
hbase-server
hbase-shaded
hbase-shell
hbase-testing-util
hbase-thrift
LICENSE.txt
NOTICE.txt
pom.xml
README.txt
src
target
++ jps -v
++ grep surefirebooter
++ grep -e -Dhbase.test
++ wc -l
+ ZOMBIE_TESTS_COUNT=0
+ [[ 0 != 0 ]]
+ echo 'We'\''re ok: there is no zombie test'
We're ok: there is no zombie test
POST BUILD TASK : SUCCESS
END OF POST BUILD TASK : 0
Archiving artifacts
Setting JDK_1_7_LATEST__HOME=/home/jenkins/tools/java/latest1.7
Setting JDK_1_8_LATEST__HOME=/home/jenkins/tools/java/latest1.8
Recording test results
Setting JDK_1_7_LATEST__HOME=/home/jenkins/tools/java/latest1.7
Setting JDK_1_8_LATEST__HOME=/home/jenkins/tools/java/latest1.8
Setting JDK_1_7_LATEST__HOME=/home/jenkins/tools/java/latest1.7
Setting JDK_1_8_LATEST__HOME=/home/jenkins/tools/java/latest1.8

Mime
View raw message