hbase-builds mailing list archives

Site index · List index
Message view « Date » · « Thread »
Top « Date » · « Thread »
From Apache Jenkins Server <jenk...@builds.apache.org>
Subject Build failed in Jenkins: HBase-1.4 » JDK_1_8,Hadoop&&!H13 #780
Date Tue, 20 Jun 2017 23:08:21 GMT
See <https://builds.apache.org/job/HBase-1.4/jdk=JDK_1_8,label=Hadoop&&!H13/780/display/redirect?page=changes>

Changes:

[syuanjiangdev] HBASE-18036 Data locality is not maintained after cluster restart or SSH

------------------------------------------
[...truncated 2.36 MB...]
Tests run: 1, Failures: 0, Errors: 0, Skipped: 0, Time elapsed: 78.007 sec - in org.apache.hadoop.hbase.replication.TestReplicationSyncUpTool
Tests run: 14, Failures: 0, Errors: 0, Skipped: 0, Time elapsed: 111.897 sec - in org.apache.hadoop.hbase.replication.TestReplicationSmallTests
Running org.apache.hadoop.hbase.mapred.TestTableSnapshotInputFormat
Running org.apache.hadoop.hbase.mapred.TestMultiTableSnapshotInputFormat
Tests run: 4, Failures: 0, Errors: 0, Skipped: 0, Time elapsed: 53.266 sec - in org.apache.hadoop.hbase.mapred.TestMultiTableSnapshotInputFormat
Tests run: 8, Failures: 0, Errors: 0, Skipped: 0, Time elapsed: 265.171 sec - in org.apache.hadoop.hbase.replication.TestMasterReplication
Tests run: 12, Failures: 0, Errors: 0, Skipped: 1, Time elapsed: 113.745 sec - in org.apache.hadoop.hbase.namespace.TestNamespaceAuditor
Running org.apache.hadoop.hbase.TestMultiVersions
Running org.apache.hadoop.hbase.mapred.TestTableMapReduce
Running org.apache.hadoop.hbase.mapred.TestTableInputFormat
Tests run: 3, Failures: 0, Errors: 0, Skipped: 0, Time elapsed: 10.953 sec - in org.apache.hadoop.hbase.TestMultiVersions
Tests run: 4, Failures: 0, Errors: 0, Skipped: 0, Time elapsed: 115.391 sec - in org.apache.hadoop.hbase.mapred.TestTableMapReduceUtil
Tests run: 2, Failures: 0, Errors: 0, Skipped: 0, Time elapsed: 26.936 sec - in org.apache.hadoop.hbase.mapred.TestTableMapReduce
Tests run: 7, Failures: 0, Errors: 0, Skipped: 0, Time elapsed: 129.192 sec - in org.apache.hadoop.hbase.mapred.TestTableSnapshotInputFormat
Tests run: 8, Failures: 0, Errors: 0, Skipped: 0, Time elapsed: 101.352 sec - in org.apache.hadoop.hbase.mapred.TestTableInputFormat

Results :

Failed tests: 
org.apache.hadoop.hbase.TestRegionRebalancing.testRebalanceOnRegionServerNumberChange[1](org.apache.hadoop.hbase.TestRegionRebalancing)
  Run 1: TestRegionRebalancing.testRebalanceOnRegionServerNumberChange:120->assertRegionsAreBalanced:229
After 5 attempts, region assignments were not balanced.
  Run 2: TestRegionRebalancing.testRebalanceOnRegionServerNumberChange:120->assertRegionsAreBalanced:229
After 5 attempts, region assignments were not balanced.
  Run 3: TestRegionRebalancing.testRebalanceOnRegionServerNumberChange:120->assertRegionsAreBalanced:229
After 5 attempts, region assignments were not balanced.

Flaked tests: 
org.apache.hadoop.hbase.regionserver.TestRegionReplicaFailover.testPrimaryRegionKill[0](org.apache.hadoop.hbase.regionserver.TestRegionReplicaFailover)
  Run 1: TestRegionReplicaFailover.testPrimaryRegionKill:201->verifyNumericRowsWithTimeout:213->Object.wait:460->Object.wait:-2
» TestTimedOut
  Run 2: PASS

org.apache.hadoop.hbase.regionserver.TestRegionReplicaFailover.testSecondaryRegionWithNonEmptyRegion[0](org.apache.hadoop.hbase.regionserver.TestRegionReplicaFailover)
  Run 1: TestRegionReplicaFailover.testSecondaryRegionWithNonEmptyRegion:165->Object.wait:460->Object.wait:-2
» TestTimedOut
  Run 2: PASS

org.apache.hadoop.hbase.regionserver.TestScannerHeartbeatMessages.testScannerHeartbeatMessages(org.apache.hadoop.hbase.regionserver.TestScannerHeartbeatMessages)
  Run 1: TestScannerHeartbeatMessages.testScannerHeartbeatMessages:209->testImportanceOfHeartbeats:225
Heartbeat messages are enabled, exceptions should NOT be thrown. Exception trace:org.apache.hadoop.hbase.client.RetriesExhaustedException:
Failed after attempts=36, exceptions:
Tue Jun 20 21:58:27 UTC 2017, null, java.net.SocketTimeoutException: callTimeout=1000, callDuration=1129:
Call to asf907.gq1.ygridcore.net/67.195.81.151:55942 failed on local exception: org.apache.hadoop.hbase.ipc.CallTimeoutException:
Call id=109, waitTime=1084, rpcTimetout=1000 row '' on table 'testScannerHeartbeatMessagesTable'
at region=testScannerHeartbeatMessagesTable,,1497995857458.8a66ef51be1ea826fd59262286b80693.,
hostname=asf907.gq1.ygridcore.net,55942,1497995844475, seqNum=2

	at org.apache.hadoop.hbase.client.RpcRetryingCallerWithReadReplicas.throwEnrichedException(RpcRetryingCallerWithReadReplicas.java:321)
	at org.apache.hadoop.hbase.client.ScannerCallableWithReplicas.call(ScannerCallableWithReplicas.java:235)
	at org.apache.hadoop.hbase.client.ScannerCallableWithReplicas.call(ScannerCallableWithReplicas.java:58)
	at org.apache.hadoop.hbase.client.RpcRetryingCaller.callWithoutRetries(RpcRetryingCaller.java:218)
	at org.apache.hadoop.hbase.client.ClientScanner.call(ClientScanner.java:277)
	at org.apache.hadoop.hbase.client.ClientScanner.loadCache(ClientScanner.java:438)
	at org.apache.hadoop.hbase.client.ClientScanner.next(ClientScanner.java:312)
	at org.apache.hadoop.hbase.regionserver.TestScannerHeartbeatMessages$3.call(TestScannerHeartbeatMessages.java:321)
	at org.apache.hadoop.hbase.regionserver.TestScannerHeartbeatMessages$3.call(TestScannerHeartbeatMessages.java:312)
	at org.apache.hadoop.hbase.regionserver.TestScannerHeartbeatMessages.testImportanceOfHeartbeats(TestScannerHeartbeatMessages.java:223)
	at org.apache.hadoop.hbase.regionserver.TestScannerHeartbeatMessages.testScannerHeartbeatMessages(TestScannerHeartbeatMessages.java:209)
	at sun.reflect.NativeMethodAccessorImpl.invoke0(Native Method)
	at sun.reflect.NativeMethodAccessorImpl.invoke(NativeMethodAccessorImpl.java:62)
	at sun.reflect.DelegatingMethodAccessorImpl.invoke(DelegatingMethodAccessorImpl.java:43)
	at java.lang.reflect.Method.invoke(Method.java:498)
	at org.junit.runners.model.FrameworkMethod$1.runReflectiveCall(FrameworkMethod.java:50)
	at org.junit.internal.runners.model.ReflectiveCallable.run(ReflectiveCallable.java:12)
	at org.junit.runners.model.FrameworkMethod.invokeExplosively(FrameworkMethod.java:47)
	at org.junit.internal.runners.statements.InvokeMethod.evaluate(InvokeMethod.java:17)
	at org.junit.internal.runners.statements.RunBefores.evaluate(RunBefores.java:26)
	at org.junit.internal.runners.statements.RunAfters.evaluate(RunAfters.java:27)
	at org.junit.runners.ParentRunner.runLeaf(ParentRunner.java:325)
	at org.junit.runners.BlockJUnit4ClassRunner.runChild(BlockJUnit4ClassRunner.java:78)
	at org.junit.runners.BlockJUnit4ClassRunner.runChild(BlockJUnit4ClassRunner.java:57)
	at org.junit.runners.ParentRunner$3.run(ParentRunner.java:290)
	at org.junit.runners.ParentRunner$1.schedule(ParentRunner.java:71)
	at org.junit.runners.ParentRunner.runChildren(ParentRunner.java:288)
	at org.junit.runners.ParentRunner.access$000(ParentRunner.java:58)
	at org.junit.runners.ParentRunner$2.evaluate(ParentRunner.java:268)
	at org.junit.internal.runners.statements.RunBefores.evaluate(RunBefores.java:26)
	at org.junit.internal.runners.statements.RunAfters.evaluate(RunAfters.java:27)
	at org.junit.runners.ParentRunner.run(ParentRunner.java:363)
	at org.junit.runners.Suite.runChild(Suite.java:128)
	at org.junit.runners.Suite.runChild(Suite.java:27)
	at org.junit.runners.ParentRunner$3.run(ParentRunner.java:290)
	at org.junit.runners.ParentRunner$1.schedule(ParentRunner.java:71)
	at org.junit.runners.ParentRunner.runChildren(ParentRunner.java:288)
	at org.junit.runners.ParentRunner.access$000(ParentRunner.java:58)
	at org.junit.runners.ParentRunner$2.evaluate(ParentRunner.java:268)
	at org.junit.runners.ParentRunner.run(ParentRunner.java:363)
	at org.junit.runner.JUnitCore.run(JUnitCore.java:137)
	at org.junit.runner.JUnitCore.run(JUnitCore.java:115)
	at org.apache.maven.surefire.junitcore.JUnitCoreWrapper.createRequestAndRun(JUnitCoreWrapper.java:108)
	at org.apache.maven.surefire.junitcore.JUnitCoreWrapper.executeEager(JUnitCoreWrapper.java:78)
	at org.apache.maven.surefire.junitcore.JUnitCoreWrapper.execute(JUnitCoreWrapper.java:54)
	at org.apache.maven.surefire.junitcore.JUnitCoreProvider.invoke(JUnitCoreProvider.java:144)
	at org.apache.maven.surefire.booter.ForkedBooter.invokeProviderInSameClassLoader(ForkedBooter.java:203)
	at org.apache.maven.surefire.booter.ForkedBooter.runSuitesInProcess(ForkedBooter.java:155)
	at org.apache.maven.surefire.booter.ForkedBooter.main(ForkedBooter.java:103)
Caused by: java.net.SocketTimeoutException: callTimeout=1000, callDuration=1129: Call to asf907.gq1.ygridcore.net/67.195.81.151:55942
failed on local exception: org.apache.hadoop.hbase.ipc.CallTimeoutException: Call id=109,
waitTime=1084, rpcTimetout=1000 row '' on table 'testScannerHeartbeatMessagesTable' at region=testScannerHeartbeatMessagesTable,,1497995857458.8a66ef51be1ea826fd59262286b80693.,
hostname=asf907.gq1.ygridcore.net,55942,1497995844475, seqNum=2
	at org.apache.hadoop.hbase.client.RpcRetryingCaller.callWithRetries(RpcRetryingCaller.java:177)
	at org.apache.hadoop.hbase.client.ResultBoundedCompletionService$QueueingFuture.run(ResultBoundedCompletionService.java:80)
	at java.util.concurrent.ThreadPoolExecutor.runWorker(ThreadPoolExecutor.java:1142)
	at java.util.concurrent.ThreadPoolExecutor$Worker.run(ThreadPoolExecutor.java:617)
	at java.lang.Thread.run(Thread.java:748)
Caused by: java.io.IOException: Call to asf907.gq1.ygridcore.net/67.195.81.151:55942 failed
on local exception: org.apache.hadoop.hbase.ipc.CallTimeoutException: Call id=109, waitTime=1084,
rpcTimetout=1000
	at org.apache.hadoop.hbase.ipc.IPCUtil.wrapException(IPCUtil.java:179)
	at org.apache.hadoop.hbase.ipc.AbstractRpcClient.onCallFinished(AbstractRpcClient.java:387)
	at org.apache.hadoop.hbase.ipc.AbstractRpcClient.access$100(AbstractRpcClient.java:94)
	at org.apache.hadoop.hbase.ipc.AbstractRpcClient$3.run(AbstractRpcClient.java:407)
	at org.apache.hadoop.hbase.ipc.AbstractRpcClient$3.run(AbstractRpcClient.java:403)
	at org.apache.hadoop.hbase.ipc.Call.setTimeout(Call.java:96)
	at org.apache.hadoop.hbase.ipc.RpcConnection$1.run(RpcConnection.java:188)
	at io.netty.util.HashedWheelTimer$HashedWheelTimeout.expire(HashedWheelTimer.java:625)
	at io.netty.util.HashedWheelTimer$HashedWheelBucket.expireTimeouts(HashedWheelTimer.java:700)
	at io.netty.util.HashedWheelTimer$Worker.run(HashedWheelTimer.java:428)
	... 1 more
Caused by: org.apache.hadoop.hbase.ipc.CallTimeoutException: Call id=109, waitTime=1084, rpcTimetout=1000
	at org.apache.hadoop.hbase.ipc.RpcConnection$1.run(RpcConnection.java:189)
	... 4 more

  Run 2: PASS


Tests run: 2820, Failures: 1, Errors: 0, Skipped: 57, Flakes: 3

[INFO] ------------------------------------------------------------------------
[INFO] Reactor Summary:
[INFO] 
[INFO] Apache HBase ...................................... SUCCESS [1:43.968s]
[INFO] Apache HBase - Checkstyle ......................... SUCCESS [15.212s]
[INFO] Apache HBase - Resource Bundle .................... SUCCESS [0.606s]
[INFO] Apache HBase - Annotations ........................ SUCCESS [2.047s]
[INFO] Apache HBase - Protocol ........................... SUCCESS [21.629s]
[INFO] Apache HBase - Common ............................. SUCCESS [2:53.498s]
[INFO] Apache HBase - Procedure .......................... SUCCESS [4:04.524s]
[INFO] Apache HBase - Metrics API ........................ SUCCESS [1.421s]
[INFO] Apache HBase - Hadoop Compatibility ............... SUCCESS [12.786s]
[INFO] Apache HBase - Metrics Implementation ............. SUCCESS [7.201s]
[INFO] Apache HBase - Hadoop Two Compatibility ........... SUCCESS [21.470s]
[INFO] Apache HBase - Client ............................. SUCCESS [1:48.406s]
[INFO] Apache HBase - Prefix Tree ........................ SUCCESS [9.240s]
[INFO] Apache HBase - Server ............................. FAILURE [1:40:44.527s]
[INFO] Apache HBase - Testing Util ....................... SKIPPED
[INFO] Apache HBase - Thrift ............................. SKIPPED
[INFO] Apache HBase - Rest ............................... SKIPPED
[INFO] Apache HBase - Shell .............................. SKIPPED
[INFO] Apache HBase - Integration Tests .................. SKIPPED
[INFO] Apache HBase - Examples ........................... SKIPPED
[INFO] Apache HBase - External Block Cache ............... SKIPPED
[INFO] Apache HBase - Assembly ........................... SKIPPED
[INFO] Apache HBase - Shaded ............................. SKIPPED
[INFO] Apache HBase - Shaded - Client .................... SKIPPED
[INFO] Apache HBase - Shaded - Server .................... SKIPPED
[INFO] Apache HBase - Archetypes ......................... SKIPPED
[INFO] Apache HBase - Exemplar for hbase-client archetype  SKIPPED
[INFO] Apache HBase - Exemplar for hbase-shaded-client archetype  SKIPPED
[INFO] Apache HBase - Archetype builder .................. SKIPPED
[INFO] ------------------------------------------------------------------------
[INFO] BUILD FAILURE
[INFO] ------------------------------------------------------------------------
[INFO] Total time: 1:53:19.437s
[INFO] Finished at: Tue Jun 20 23:03:38 UTC 2017
[INFO] Final Memory: 103M/1746M
[INFO] ------------------------------------------------------------------------
[ERROR] Failed to execute goal org.apache.maven.plugins:maven-surefire-plugin:2.18.1:test
(secondPartTestsExecution) on project hbase-server: There are test failures.
[ERROR] 
[ERROR] Please refer to <https://builds.apache.org/job/HBase-1.4/jdk=JDK_1_8,label=Hadoop&&!H13/ws/hbase-server/target/surefire-reports>
for the individual test results.
[ERROR] -> [Help 1]
[ERROR] 
[ERROR] To see the full stack trace of the errors, re-run Maven with the -e switch.
[ERROR] Re-run Maven using the -X switch to enable full debug logging.
[ERROR] 
[ERROR] For more information about the errors and possible solutions, please read the following
articles:
[ERROR] [Help 1] http://cwiki.apache.org/confluence/display/MAVEN/MojoFailureException
[ERROR] 
[ERROR] After correcting the problems, you can resume the build with the command
[ERROR]   mvn <goals> -rf :hbase-server
Build step 'Invoke top-level Maven targets' marked build as failure
Performing Post build task...
Match found for :.* : True
Logical operation result is TRUE
Running script  : # Post-build task script. TODO: Check this in and have all builds reference
check-in.
pwd && ls
# NOTE!!!! The below code has been copied and pasted from ./dev-tools/run-test.sh
# Do not change here without syncing there and vice-versa.
ZOMBIE_TESTS_COUNT=`jps -v | grep surefirebooter | grep -e '-Dhbase.test' | wc -l`
if [[ $ZOMBIE_TESTS_COUNT != 0 ]] ; then
 echo "Suspicious java process found - waiting 30s to see if there are just slow to stop"
 sleep 30
 ZOMBIE_TESTS_COUNT=`jps -v | grep surefirebooter | grep -e '-Dhbase.test' | wc -l`
 if [[ $ZOMBIE_TESTS_COUNT != 0 ]] ; then
   echo " {color:red}There appear to be $ZOMBIE_TESTS_COUNT zombie tests{color}, they should
have been killed by surefire but survived"
   jps -v | grep surefirebooter | grep -e '-Dhbase.test'
   jps -v | grep surefirebooter | grep -e '-Dhbase.test' | cut -d ' ' -f 1 | xargs -n 1 jstack
   # Exit with error
   exit 1
 else
   echo "We're ok: there is no zombie test, but some tests took some time to stop"
 fi
else
  echo "We're ok: there is no zombie test"
fi
Setting JDK_1_7_LATEST__HOME=/home/jenkins/tools/java/latest1.7
Setting JDK_1_8_LATEST__HOME=/home/jenkins/tools/java/latest1.8
[30b16b4c] $ /bin/bash -xe /tmp/hudson5716824492475842934.sh
+ pwd
<https://builds.apache.org/job/HBase-1.4/jdk=JDK_1_8,label=Hadoop&&!H13/ws/>
+ ls
bin
CHANGES.txt
conf
dev-support
extra_env_var
hbase-annotations
hbase-archetypes
hbase-assembly
hbase-checkstyle
hbase-client
hbase-common
hbase-examples
hbase-external-blockcache
hbase-hadoop2-compat
hbase-hadoop-compat
hbase-it
hbase-metrics
hbase-metrics-api
hbase-native-client
hbase-prefix-tree
hbase-procedure
hbase-protocol
hbase-resource-bundle
hbase-rest
hbase-server
hbase-shaded
hbase-shell
hbase-testing-util
hbase-thrift
LICENSE.txt
NOTICE.txt
pom.xml
README.txt
src
target
++ jps -v
++ grep surefirebooter
++ grep -e -Dhbase.test
++ wc -l
+ ZOMBIE_TESTS_COUNT=0
+ [[ 0 != 0 ]]
+ echo 'We'\''re ok: there is no zombie test'
We're ok: there is no zombie test
POST BUILD TASK : SUCCESS
END OF POST BUILD TASK : 0
Archiving artifacts
Setting JDK_1_7_LATEST__HOME=/home/jenkins/tools/java/latest1.7
Setting JDK_1_8_LATEST__HOME=/home/jenkins/tools/java/latest1.8
Recording test results
Setting JDK_1_7_LATEST__HOME=/home/jenkins/tools/java/latest1.7
Setting JDK_1_8_LATEST__HOME=/home/jenkins/tools/java/latest1.8
Setting JDK_1_7_LATEST__HOME=/home/jenkins/tools/java/latest1.7
Setting JDK_1_8_LATEST__HOME=/home/jenkins/tools/java/latest1.8

Mime
View raw message