hbase-builds mailing list archives

Site index · List index
Message view « Date » · « Thread »
Top « Date » · « Thread »
From Apache Jenkins Server <jenk...@builds.apache.org>
Subject Build failed in Jenkins: HBase-1.4 » JDK_1_8,Hadoop&&!H13 #795
Date Fri, 30 Jun 2017 23:33:26 GMT
See <https://builds.apache.org/job/HBase-1.4/jdk=JDK_1_8,label=Hadoop&&!H13/795/display/redirect?page=changes>

Changes:

[busbey] HBASE-17995 improve log messages during snapshot tests.

[busbey] HBASE-18293 Only add the spotbugs dependency when jdk8 is active

------------------------------------------
[...truncated 2.40 MB...]
Tests run: 5, Failures: 0, Errors: 0, Skipped: 0, Time elapsed: 19.933 sec - in org.apache.hadoop.hbase.master.procedure.TestAddColumnFamilyProcedure
Running org.apache.hadoop.hbase.master.procedure.TestDeleteColumnFamilyProcedureFromClient
Running org.apache.hadoop.hbase.master.procedure.TestEnableTableProcedure
Tests run: 7, Failures: 0, Errors: 0, Skipped: 0, Time elapsed: 11.597 sec - in org.apache.hadoop.hbase.master.procedure.TestCreateNamespaceProcedure
Running org.apache.hadoop.hbase.master.procedure.TestCreateTableProcedure
Tests run: 1, Failures: 0, Errors: 0, Skipped: 0, Time elapsed: 20.265 sec - in org.apache.hadoop.hbase.master.procedure.TestServerCrashProcedure
Tests run: 2, Failures: 0, Errors: 0, Skipped: 0, Time elapsed: 15.414 sec - in org.apache.hadoop.hbase.master.procedure.TestDeleteColumnFamilyProcedureFromClient
Running org.apache.hadoop.hbase.master.procedure.TestWALProcedureStoreOnHDFS
Running org.apache.hadoop.hbase.master.procedure.TestModifyTableProcedure
Tests run: 4, Failures: 0, Errors: 0, Skipped: 0, Time elapsed: 20.049 sec - in org.apache.hadoop.hbase.master.procedure.TestEnableTableProcedure
Running org.apache.hadoop.hbase.master.TestMasterShutdown
Running org.apache.hadoop.hbase.master.procedure.TestDeleteColumnFamilyProcedure
Tests run: 7, Failures: 0, Errors: 0, Skipped: 0, Time elapsed: 23.286 sec - in org.apache.hadoop.hbase.master.procedure.TestCreateTableProcedure
Running org.apache.hadoop.hbase.master.cleaner.TestHFileCleaner
Tests run: 3, Failures: 0, Errors: 0, Skipped: 0, Time elapsed: 0.952 sec - in org.apache.hadoop.hbase.master.cleaner.TestHFileCleaner
Tests run: 7, Failures: 0, Errors: 0, Skipped: 0, Time elapsed: 22.338 sec - in org.apache.hadoop.hbase.master.procedure.TestDeleteColumnFamilyProcedure
Tests run: 3, Failures: 0, Errors: 0, Skipped: 0, Time elapsed: 31.749 sec - in org.apache.hadoop.hbase.master.procedure.TestWALProcedureStoreOnHDFS
Running org.apache.hadoop.hbase.master.cleaner.TestSnapshotFromMaster
Running org.apache.hadoop.hbase.master.cleaner.TestLogsCleaner
Tests run: 2, Failures: 0, Errors: 0, Skipped: 0, Time elapsed: 28.892 sec - in org.apache.hadoop.hbase.master.TestMasterShutdown
Tests run: 8, Failures: 0, Errors: 0, Skipped: 0, Time elapsed: 35.486 sec - in org.apache.hadoop.hbase.master.procedure.TestModifyTableProcedure
Running org.apache.hadoop.hbase.master.cleaner.TestReplicationZKNodeCleaner
Tests run: 3, Failures: 0, Errors: 0, Skipped: 0, Time elapsed: 11.389 sec - in org.apache.hadoop.hbase.master.cleaner.TestLogsCleaner
Running org.apache.hadoop.hbase.master.TestGetInfoPort
Running org.apache.hadoop.hbase.master.TestMasterOperationsForRegionReplicas
Running org.apache.hadoop.hbase.master.TestWarmupRegion
Tests run: 1, Failures: 0, Errors: 0, Skipped: 0, Time elapsed: 12.468 sec - in org.apache.hadoop.hbase.master.TestGetInfoPort
Running org.apache.hadoop.hbase.master.TestMasterStatusServlet
Tests run: 4, Failures: 0, Errors: 0, Skipped: 0, Time elapsed: 1.254 sec - in org.apache.hadoop.hbase.master.TestMasterStatusServlet
Tests run: 4, Failures: 0, Errors: 0, Skipped: 0, Time elapsed: 29.802 sec - in org.apache.hadoop.hbase.master.cleaner.TestSnapshotFromMaster
Tests run: 2, Failures: 0, Errors: 0, Skipped: 0, Time elapsed: 21.396 sec - in org.apache.hadoop.hbase.master.cleaner.TestReplicationZKNodeCleaner
Running org.apache.hadoop.hbase.master.balancer.TestStochasticLoadBalancer
Running org.apache.hadoop.hbase.master.balancer.TestStochasticLoadBalancer2
Running org.apache.hadoop.hbase.master.balancer.TestDefaultLoadBalancer
Tests run: 1, Failures: 0, Errors: 0, Skipped: 0, Time elapsed: 2.55 sec - in org.apache.hadoop.hbase.master.balancer.TestDefaultLoadBalancer
Running org.apache.hadoop.hbase.master.balancer.TestBaseLoadBalancer
Tests run: 1, Failures: 0, Errors: 0, Skipped: 0, Time elapsed: 21.774 sec - in org.apache.hadoop.hbase.master.TestWarmupRegion
Tests run: 7, Failures: 0, Errors: 0, Skipped: 0, Time elapsed: 0.592 sec - in org.apache.hadoop.hbase.master.balancer.TestBaseLoadBalancer
Tests run: 2, Failures: 0, Errors: 0, Skipped: 0, Time elapsed: 23.863 sec - in org.apache.hadoop.hbase.master.TestMasterOperationsForRegionReplicas
Running org.apache.hadoop.hbase.master.TestMasterFailover
Running org.apache.hadoop.hbase.master.TestDistributedLogSplitting
Running org.apache.hadoop.hbase.master.TestAssignmentManagerMetrics
Tests run: 1, Failures: 0, Errors: 0, Skipped: 0, Time elapsed: 9.463 sec - in org.apache.hadoop.hbase.master.TestAssignmentManagerMetrics
Running org.apache.hadoop.hbase.master.TestMasterNoCluster
Tests run: 3, Failures: 0, Errors: 0, Skipped: 0, Time elapsed: 13.007 sec - in org.apache.hadoop.hbase.master.TestMasterNoCluster
Running org.apache.hadoop.hbase.master.TestGetLastFlushedSequenceId
Tests run: 1, Failures: 0, Errors: 0, Skipped: 0, Time elapsed: 18.778 sec - in org.apache.hadoop.hbase.master.TestGetLastFlushedSequenceId
Running org.apache.hadoop.hbase.master.TestRollingRestart
Tests run: 18, Failures: 0, Errors: 0, Skipped: 15, Time elapsed: 63.806 sec - in org.apache.hadoop.hbase.master.TestDistributedLogSplitting
Running org.apache.hadoop.hbase.master.TestMetaShutdownHandler
Tests run: 7, Failures: 0, Errors: 0, Skipped: 0, Time elapsed: 102.389 sec - in org.apache.hadoop.hbase.master.TestMasterFailover
Tests run: 1, Failures: 0, Errors: 0, Skipped: 0, Time elapsed: 48.416 sec - in org.apache.hadoop.hbase.master.TestRollingRestart
Tests run: 1, Failures: 0, Errors: 0, Skipped: 0, Time elapsed: 31.116 sec - in org.apache.hadoop.hbase.master.TestMetaShutdownHandler
Running org.apache.hadoop.hbase.master.TestRegionPlacement2
Running org.apache.hadoop.hbase.master.TestMasterFileSystemWithWALDir
Tests run: 1, Failures: 0, Errors: 0, Skipped: 0, Time elapsed: 1.997 sec - in org.apache.hadoop.hbase.master.TestMasterFileSystemWithWALDir
Tests run: 2, Failures: 0, Errors: 0, Skipped: 0, Time elapsed: 2.155 sec - in org.apache.hadoop.hbase.master.TestRegionPlacement2
Running org.apache.hadoop.hbase.master.TestActiveMasterManager
Tests run: 2, Failures: 0, Errors: 0, Skipped: 0, Time elapsed: 1.173 sec - in org.apache.hadoop.hbase.master.TestActiveMasterManager
Running org.apache.hadoop.hbase.master.TestMaster
Running org.apache.hadoop.hbase.master.TestMasterMetricsWrapper
Running org.apache.hadoop.hbase.master.normalizer.TestSimpleRegionNormalizerOnCluster
Tests run: 1, Failures: 0, Errors: 0, Skipped: 0, Time elapsed: 2.469 sec - in org.apache.hadoop.hbase.master.TestMasterMetricsWrapper
Running org.apache.hadoop.hbase.master.TestMasterBalanceThrottling
Tests run: 4, Failures: 0, Errors: 0, Skipped: 0, Time elapsed: 13.437 sec - in org.apache.hadoop.hbase.master.TestMaster
Running org.apache.hadoop.hbase.master.TestMasterTransitions
Tests run: 3, Failures: 0, Errors: 0, Skipped: 3, Time elapsed: 0.002 sec - in org.apache.hadoop.hbase.master.TestMasterTransitions
Running org.apache.hadoop.hbase.master.TestRestartCluster
Tests run: 2, Failures: 0, Errors: 0, Skipped: 0, Time elapsed: 28.261 sec - in org.apache.hadoop.hbase.master.normalizer.TestSimpleRegionNormalizerOnCluster
Running org.apache.hadoop.hbase.master.TestOpenedRegionHandler
Tests run: 2, Failures: 0, Errors: 0, Skipped: 0, Time elapsed: 42.211 sec - in org.apache.hadoop.hbase.master.TestMasterBalanceThrottling
Running org.apache.hadoop.hbase.master.handler.TestCreateTableHandler
Tests run: 2, Failures: 0, Errors: 0, Skipped: 0, Time elapsed: 16.296 sec - in org.apache.hadoop.hbase.master.TestOpenedRegionHandler
Running org.apache.hadoop.hbase.master.handler.TestEnableTableHandler
Tests run: 3, Failures: 0, Errors: 0, Skipped: 0, Time elapsed: 48.506 sec - in org.apache.hadoop.hbase.master.TestRestartCluster
Running org.apache.hadoop.hbase.master.TestMasterPriorityRpc
Tests run: 3, Failures: 0, Errors: 0, Skipped: 0, Time elapsed: 2.042 sec - in org.apache.hadoop.hbase.master.TestMasterPriorityRpc
Running org.apache.hadoop.hbase.master.TestSplitLogManager
Tests run: 3, Failures: 0, Errors: 0, Skipped: 0, Time elapsed: 28.609 sec - in org.apache.hadoop.hbase.master.handler.TestCreateTableHandler
Running org.apache.hadoop.hbase.master.TestAssignmentManagerOnCluster
Tests run: 3, Failures: 0, Errors: 0, Skipped: 0, Time elapsed: 61.454 sec - in org.apache.hadoop.hbase.master.handler.TestEnableTableHandler
Running org.apache.hadoop.hbase.master.TestRegionPlacement
Tests run: 2, Failures: 0, Errors: 0, Skipped: 2, Time elapsed: 0.001 sec - in org.apache.hadoop.hbase.master.TestRegionPlacement
Running org.apache.hadoop.hbase.master.TestClusterStatusPublisher
Tests run: 3, Failures: 0, Errors: 0, Skipped: 0, Time elapsed: 0.434 sec - in org.apache.hadoop.hbase.master.TestClusterStatusPublisher
Running org.apache.hadoop.hbase.master.TestTableLockManager
Tests run: 23, Failures: 0, Errors: 0, Skipped: 1, Time elapsed: 296.673 sec - in org.apache.hadoop.hbase.master.balancer.TestStochasticLoadBalancer
Running org.apache.hadoop.hbase.master.TestMasterMetrics
Tests run: 3, Failures: 0, Errors: 0, Skipped: 0, Time elapsed: 1.36 sec - in org.apache.hadoop.hbase.master.TestMasterMetrics
Running org.apache.hadoop.hbase.master.TestMasterFileSystem
Tests run: 2, Failures: 0, Errors: 0, Skipped: 0, Time elapsed: 1.355 sec - in org.apache.hadoop.hbase.master.TestMasterFileSystem
Tests run: 15, Failures: 0, Errors: 0, Skipped: 1, Time elapsed: 133.307 sec - in org.apache.hadoop.hbase.master.TestSplitLogManager
Tests run: 4, Failures: 0, Errors: 0, Skipped: 0, Time elapsed: 85.959 sec - in org.apache.hadoop.hbase.master.TestTableLockManager
Tests run: 21, Failures: 0, Errors: 0, Skipped: 0, Time elapsed: 111.818 sec - in org.apache.hadoop.hbase.master.TestAssignmentManagerOnCluster
Tests run: 4, Failures: 0, Errors: 0, Skipped: 0, Time elapsed: 502.942 sec - in org.apache.hadoop.hbase.master.balancer.TestStochasticLoadBalancer2

Results :

Tests in error: 
  TestSerialReplication.testRegionSplit:265  Not all logs have been pushed
Flaked tests: 
org.apache.hadoop.hbase.TestAcidGuarantees.testMixedAtomicity(org.apache.hadoop.hbase.TestAcidGuarantees)
  Run 1: TestAcidGuarantees.testMixedAtomicity:357->runTestAtomicity:254->runTestAtomicity:315
» Runtime
  Run 2: PASS

org.apache.hadoop.hbase.regionserver.TestCompactionInDeadRegionServer.test(org.apache.hadoop.hbase.regionserver.TestCompactionInDeadRegionServer)
  Run 1: TestCompactionInDeadRegionServer.test:132 Should fail as our wal file has already
been closed, and walDir has also been renamed
  Run 2: PASS

org.apache.hadoop.hbase.regionserver.TestScannerHeartbeatMessages.testScannerHeartbeatMessages(org.apache.hadoop.hbase.regionserver.TestScannerHeartbeatMessages)
  Run 1: TestScannerHeartbeatMessages.testScannerHeartbeatMessages:207->testImportanceOfHeartbeats:237
Heartbeats messages are disabled, an exception should be thrown. If an exception  is not thrown,
the test case is not testing the importance of heartbeat messages
  Run 2: PASS


Tests run: 2825, Failures: 0, Errors: 1, Skipped: 57, Flakes: 3

[INFO] ------------------------------------------------------------------------
[INFO] Reactor Summary:
[INFO] 
[INFO] Apache HBase ...................................... SUCCESS [1:41.232s]
[INFO] Apache HBase - Checkstyle ......................... SUCCESS [14.820s]
[INFO] Apache HBase - Resource Bundle .................... SUCCESS [0.331s]
[INFO] Apache HBase - Annotations ........................ SUCCESS [1.031s]
[INFO] Apache HBase - Protocol ........................... SUCCESS [16.170s]
[INFO] Apache HBase - Common ............................. SUCCESS [2:31.073s]
[INFO] Apache HBase - Procedure .......................... SUCCESS [3:34.303s]
[INFO] Apache HBase - Metrics API ........................ SUCCESS [1.161s]
[INFO] Apache HBase - Hadoop Compatibility ............... SUCCESS [11.083s]
[INFO] Apache HBase - Metrics Implementation ............. SUCCESS [5.124s]
[INFO] Apache HBase - Hadoop Two Compatibility ........... SUCCESS [18.094s]
[INFO] Apache HBase - Client ............................. SUCCESS [1:42.105s]
[INFO] Apache HBase - Prefix Tree ........................ SUCCESS [7.580s]
[INFO] Apache HBase - Server ............................. FAILURE [1:27:33.638s]
[INFO] Apache HBase - Testing Util ....................... SKIPPED
[INFO] Apache HBase - Thrift ............................. SKIPPED
[INFO] Apache HBase - Rest ............................... SKIPPED
[INFO] Apache HBase - Shell .............................. SKIPPED
[INFO] Apache HBase - Integration Tests .................. SKIPPED
[INFO] Apache HBase - Examples ........................... SKIPPED
[INFO] Apache HBase - External Block Cache ............... SKIPPED
[INFO] Apache HBase - Assembly ........................... SKIPPED
[INFO] Apache HBase - Shaded ............................. SKIPPED
[INFO] Apache HBase - Shaded - Client .................... SKIPPED
[INFO] Apache HBase - Shaded - Server .................... SKIPPED
[INFO] Apache HBase - Archetypes ......................... SKIPPED
[INFO] Apache HBase - Exemplar for hbase-client archetype  SKIPPED
[INFO] Apache HBase - Exemplar for hbase-shaded-client archetype  SKIPPED
[INFO] Apache HBase - Archetype builder .................. SKIPPED
[INFO] ------------------------------------------------------------------------
[INFO] BUILD FAILURE
[INFO] ------------------------------------------------------------------------
[INFO] Total time: 1:38:49.228s
[INFO] Finished at: Fri Jun 30 23:29:17 UTC 2017
[INFO] Final Memory: 103M/761M
[INFO] ------------------------------------------------------------------------
[ERROR] Failed to execute goal org.apache.maven.plugins:maven-surefire-plugin:2.18.1:test
(secondPartTestsExecution) on project hbase-server: ExecutionException: java.lang.RuntimeException:
java.lang.RuntimeException: org.apache.maven.surefire.report.ReporterException: When writing
xml report stdout/stderr: /tmp/stderr183887743049648072deferred (No such file or directory)
-> [Help 1]
[ERROR] 
[ERROR] To see the full stack trace of the errors, re-run Maven with the -e switch.
[ERROR] Re-run Maven using the -X switch to enable full debug logging.
[ERROR] 
[ERROR] For more information about the errors and possible solutions, please read the following
articles:
[ERROR] [Help 1] http://cwiki.apache.org/confluence/display/MAVEN/MojoFailureException
[ERROR] 
[ERROR] After correcting the problems, you can resume the build with the command
[ERROR]   mvn <goals> -rf :hbase-server
Build step 'Invoke top-level Maven targets' marked build as failure
Performing Post build task...
Match found for :.* : True
Logical operation result is TRUE
Running script  : # Post-build task script. TODO: Check this in and have all builds reference
check-in.
pwd && ls
# NOTE!!!! The below code has been copied and pasted from ./dev-tools/run-test.sh
# Do not change here without syncing there and vice-versa.
ZOMBIE_TESTS_COUNT=`jps -v | grep surefirebooter | grep -e '-Dhbase.test' | wc -l`
if [[ $ZOMBIE_TESTS_COUNT != 0 ]] ; then
 echo "Suspicious java process found - waiting 30s to see if there are just slow to stop"
 sleep 30
 ZOMBIE_TESTS_COUNT=`jps -v | grep surefirebooter | grep -e '-Dhbase.test' | wc -l`
 if [[ $ZOMBIE_TESTS_COUNT != 0 ]] ; then
   echo " {color:red}There appear to be $ZOMBIE_TESTS_COUNT zombie tests{color}, they should
have been killed by surefire but survived"
   jps -v | grep surefirebooter | grep -e '-Dhbase.test'
   jps -v | grep surefirebooter | grep -e '-Dhbase.test' | cut -d ' ' -f 1 | xargs -n 1 jstack
   # Exit with error
   exit 1
 else
   echo "We're ok: there is no zombie test, but some tests took some time to stop"
 fi
else
  echo "We're ok: there is no zombie test"
fi
Setting JDK_1_7_LATEST__HOME=/home/jenkins/tools/java/latest1.7
Setting JDK_1_8_LATEST__HOME=/home/jenkins/tools/java/latest1.8
[30b16b4c] $ /bin/bash -xe /tmp/hudson3722726870902149760.sh
+ pwd
<https://builds.apache.org/job/HBase-1.4/jdk=JDK_1_8,label=Hadoop&&!H13/ws/>
+ ls
bin
CHANGES.txt
conf
dev-support
extra_env_var
hbase-annotations
hbase-archetypes
hbase-assembly
hbase-checkstyle
hbase-client
hbase-common
hbase-examples
hbase-external-blockcache
hbase-hadoop2-compat
hbase-hadoop-compat
hbase-it
hbase-metrics
hbase-metrics-api
hbase-native-client
hbase-prefix-tree
hbase-procedure
hbase-protocol
hbase-resource-bundle
hbase-rest
hbase-server
hbase-shaded
hbase-shell
hbase-testing-util
hbase-thrift
LICENSE.txt
NOTICE.txt
pom.xml
README.txt
src
target
++ jps -v
++ grep surefirebooter
++ grep -e -Dhbase.test
++ wc -l
+ ZOMBIE_TESTS_COUNT=0
+ [[ 0 != 0 ]]
+ echo 'We'\''re ok: there is no zombie test'
We're ok: there is no zombie test
POST BUILD TASK : SUCCESS
END OF POST BUILD TASK : 0
Archiving artifacts
Setting JDK_1_7_LATEST__HOME=/home/jenkins/tools/java/latest1.7
Setting JDK_1_8_LATEST__HOME=/home/jenkins/tools/java/latest1.8
Recording test results
Setting JDK_1_7_LATEST__HOME=/home/jenkins/tools/java/latest1.7
Setting JDK_1_8_LATEST__HOME=/home/jenkins/tools/java/latest1.8
Setting JDK_1_7_LATEST__HOME=/home/jenkins/tools/java/latest1.7
Setting JDK_1_8_LATEST__HOME=/home/jenkins/tools/java/latest1.8

Mime
View raw message