hbase-builds mailing list archives

Site index · List index
Message view « Date » · « Thread »
Top « Date » · « Thread »
From Apache Jenkins Server <jenk...@builds.apache.org>
Subject Build failed in Jenkins: HBase-1.4 » JDK_1_8,Hadoop&&!H13 #772
Date Sat, 10 Jun 2017 21:46:33 GMT
See <https://builds.apache.org/job/HBase-1.4/jdk=JDK_1_8,label=Hadoop&&!H13/772/display/redirect?page=changes>

Changes:

[apurtell] HBASE-18137 Replication gets stuck for empty WALs

------------------------------------------
[...truncated 2.79 MB...]
	at sun.nio.ch.EPollArrayWrapper.poll(EPollArrayWrapper.java:269)
	at sun.nio.ch.EPollSelectorImpl.doSelect(EPollSelectorImpl.java:79)
	at sun.nio.ch.SelectorImpl.lockAndDoSelect(SelectorImpl.java:87)
	- locked <0x0000000759943138> (a sun.nio.ch.Util$2)
	- locked <0x0000000759943128> (a java.util.Collections$UnmodifiableSet)
	- locked <0x0000000759942058> (a sun.nio.ch.EPollSelectorImpl)
	at sun.nio.ch.SelectorImpl.select(SelectorImpl.java:98)
	at sun.nio.ch.SelectorImpl.select(SelectorImpl.java:102)
	at org.apache.hadoop.ipc.Server$Listener$Reader.doRunLoop(Server.java:616)
	- locked <0x000000075995b7c8> (a org.apache.hadoop.ipc.Server$Listener$Reader)
	at org.apache.hadoop.ipc.Server$Listener$Reader.run(Server.java:595)

"Timer-0" daemon prio=10 tid=0x00007fbddd10c800 nid=0x5d2b in Object.wait() [0x00007fbdc81e4000]
   java.lang.Thread.State: TIMED_WAITING (on object monitor)
	at java.lang.Object.wait(Native Method)
	- waiting on <0x00000007f6e3b168> (a java.util.TaskQueue)
	at java.util.TimerThread.mainLoop(Timer.java:552)
	- locked <0x00000007f6e3b168> (a java.util.TaskQueue)
	at java.util.TimerThread.run(Timer.java:505)

"1873166156@qtp-192161248-1 - Acceptor0 HttpServer2$SelectChannelConnectorWithSafeStartup@localhost:37733"
daemon prio=10 tid=0x00007fbddd107800 nid=0x5cb9 runnable [0x00007fbdc82e5000]
   java.lang.Thread.State: RUNNABLE
	at sun.nio.ch.EPollArrayWrapper.epollWait(Native Method)
	at sun.nio.ch.EPollArrayWrapper.poll(EPollArrayWrapper.java:269)
	at sun.nio.ch.EPollSelectorImpl.doSelect(EPollSelectorImpl.java:79)
	at sun.nio.ch.SelectorImpl.lockAndDoSelect(SelectorImpl.java:87)
	- locked <0x00000007599aceb8> (a sun.nio.ch.Util$2)
	- locked <0x00000007599acea8> (a java.util.Collections$UnmodifiableSet)
	- locked <0x00000007599acd00> (a sun.nio.ch.EPollSelectorImpl)
	at sun.nio.ch.SelectorImpl.select(SelectorImpl.java:98)
	at org.mortbay.io.nio.SelectorManager$SelectSet.doSelect(SelectorManager.java:498)
	at org.mortbay.io.nio.SelectorManager.doSelect(SelectorManager.java:192)
	at org.mortbay.jetty.nio.SelectChannelConnector.accept(SelectChannelConnector.java:124)
	at org.mortbay.jetty.AbstractConnector$Acceptor.run(AbstractConnector.java:708)
	at org.mortbay.thread.QueuedThreadPool$PoolThread.run(QueuedThreadPool.java:582)

"320704373@qtp-192161248-0" daemon prio=10 tid=0x00007fbddd106800 nid=0x5cb8 in Object.wait()
[0x00007fbdc83e6000]
   java.lang.Thread.State: TIMED_WAITING (on object monitor)
	at java.lang.Object.wait(Native Method)
	- waiting on <0x0000000759a120b0> (a org.mortbay.thread.QueuedThreadPool$PoolThread)
	at org.mortbay.thread.QueuedThreadPool$PoolThread.run(QueuedThreadPool.java:626)
	- locked <0x0000000759a120b0> (a org.mortbay.thread.QueuedThreadPool$PoolThread)

"process reaper" daemon prio=10 tid=0x00007fbddcdbd000 nid=0x588f waiting on condition [0x00007fbdc8b93000]
   java.lang.Thread.State: TIMED_WAITING (parking)
	at sun.misc.Unsafe.park(Native Method)
	- parking to wait for  <0x00000007f6616b48> (a java.util.concurrent.SynchronousQueue$TransferStack)
	at java.util.concurrent.locks.LockSupport.parkNanos(LockSupport.java:226)
	at java.util.concurrent.SynchronousQueue$TransferStack.awaitFulfill(SynchronousQueue.java:460)
	at java.util.concurrent.SynchronousQueue$TransferStack.transfer(SynchronousQueue.java:359)
	at java.util.concurrent.SynchronousQueue.poll(SynchronousQueue.java:942)
	at java.util.concurrent.ThreadPoolExecutor.getTask(ThreadPoolExecutor.java:1068)
	at java.util.concurrent.ThreadPoolExecutor.runWorker(ThreadPoolExecutor.java:1130)
	at java.util.concurrent.ThreadPoolExecutor$Worker.run(ThreadPoolExecutor.java:615)
	at java.lang.Thread.run(Thread.java:745)

"Service Thread" daemon prio=10 tid=0x00007fbddc29a000 nid=0x5640 runnable [0x0000000000000000]
   java.lang.Thread.State: RUNNABLE

"C2 CompilerThread1" daemon prio=10 tid=0x00007fbddc298000 nid=0x563f waiting on condition
[0x0000000000000000]
   java.lang.Thread.State: RUNNABLE

"C2 CompilerThread0" daemon prio=10 tid=0x00007fbddc295000 nid=0x563e waiting on condition
[0x0000000000000000]
   java.lang.Thread.State: RUNNABLE

"Signal Dispatcher" daemon prio=10 tid=0x00007fbddc292800 nid=0x563d runnable [0x0000000000000000]
   java.lang.Thread.State: RUNNABLE

"Finalizer" daemon prio=10 tid=0x00007fbddc26a000 nid=0x5630 in Object.wait() [0x00007fbdca2e1000]
   java.lang.Thread.State: WAITING (on object monitor)
	at java.lang.Object.wait(Native Method)
	- waiting on <0x00000007557734f0> (a java.lang.ref.ReferenceQueue$Lock)
	at java.lang.ref.ReferenceQueue.remove(ReferenceQueue.java:135)
	- locked <0x00000007557734f0> (a java.lang.ref.ReferenceQueue$Lock)
	at java.lang.ref.ReferenceQueue.remove(ReferenceQueue.java:151)
	at java.lang.ref.Finalizer$FinalizerThread.run(Finalizer.java:209)

"Reference Handler" daemon prio=10 tid=0x00007fbddc268000 nid=0x562f in Object.wait() [0x00007fbdca3e2000]
   java.lang.Thread.State: WAITING (on object monitor)
	at java.lang.Object.wait(Native Method)
	- waiting on <0x0000000758a1eb98> (a java.lang.ref.Reference$Lock)
	at java.lang.Object.wait(Object.java:503)
	at java.lang.ref.Reference$ReferenceHandler.run(Reference.java:133)
	- locked <0x0000000758a1eb98> (a java.lang.ref.Reference$Lock)

"main" prio=10 tid=0x00007fbddc009000 nid=0x5612 waiting on condition [0x00007fbde494d000]
   java.lang.Thread.State: TIMED_WAITING (parking)
	at sun.misc.Unsafe.park(Native Method)
	- parking to wait for  <0x000000075891a3c8> (a java.util.concurrent.locks.AbstractQueuedSynchronizer$ConditionObject)
	at java.util.concurrent.locks.LockSupport.parkNanos(LockSupport.java:226)
	at java.util.concurrent.locks.AbstractQueuedSynchronizer$ConditionObject.awaitNanos(AbstractQueuedSynchronizer.java:2082)
	at java.util.concurrent.ThreadPoolExecutor.awaitTermination(ThreadPoolExecutor.java:1468)
	at org.apache.hadoop.yarn.server.nodemanager.containermanager.loghandler.NonAggregatingLogHandler.serviceStop(NonAggregatingLogHandler.java:88)
	at org.apache.hadoop.service.AbstractService.stop(AbstractService.java:221)
	- locked <0x000000075881d400> (a java.lang.Object)
	at org.apache.hadoop.service.ServiceOperations.stop(ServiceOperations.java:52)
	at org.apache.hadoop.service.ServiceOperations.stopQuietly(ServiceOperations.java:80)
	at org.apache.hadoop.service.CompositeService.stop(CompositeService.java:157)
	at org.apache.hadoop.service.CompositeService.serviceStop(CompositeService.java:131)
	at org.apache.hadoop.yarn.server.nodemanager.containermanager.ContainerManagerImpl.serviceStop(ContainerManagerImpl.java:333)
	at org.apache.hadoop.service.AbstractService.stop(AbstractService.java:221)
	- locked <0x000000075881d270> (a java.lang.Object)
	at org.apache.hadoop.service.ServiceOperations.stop(ServiceOperations.java:52)
	at org.apache.hadoop.service.ServiceOperations.stopQuietly(ServiceOperations.java:80)
	at org.apache.hadoop.service.CompositeService.stop(CompositeService.java:157)
	at org.apache.hadoop.service.CompositeService.serviceStop(CompositeService.java:131)
	at org.apache.hadoop.yarn.server.nodemanager.NodeManager.serviceStop(NodeManager.java:253)
	at org.apache.hadoop.service.AbstractService.stop(AbstractService.java:221)
	- locked <0x000000075881ca58> (a java.lang.Object)
	at org.apache.hadoop.yarn.server.MiniYARNCluster$NodeManagerWrapper.serviceStop(MiniYARNCluster.java:579)
	- locked <0x000000075871a3a0> (a org.apache.hadoop.yarn.server.MiniYARNCluster$NodeManagerWrapper)
	at org.apache.hadoop.service.AbstractService.stop(AbstractService.java:221)
	- locked <0x00000007587c0000> (a java.lang.Object)
	at org.apache.hadoop.service.ServiceOperations.stop(ServiceOperations.java:52)
	at org.apache.hadoop.service.ServiceOperations.stopQuietly(ServiceOperations.java:80)
	at org.apache.hadoop.service.CompositeService.stop(CompositeService.java:157)
	at org.apache.hadoop.service.CompositeService.serviceStop(CompositeService.java:131)
	at org.apache.hadoop.service.AbstractService.stop(AbstractService.java:221)
	- locked <0x000000075871a340> (a java.lang.Object)
	at org.apache.hadoop.mapred.MiniMRYarnClusterAdapter.stop(MiniMRYarnClusterAdapter.java:55)
	at org.apache.hadoop.mapred.MiniMRCluster.shutdown(MiniMRCluster.java:267)
	at org.apache.hadoop.hbase.HBaseTestingUtility.shutdownMiniMapReduceCluster(HBaseTestingUtility.java:2783)
	at org.apache.hadoop.hbase.mapred.TestTableInputFormat.afterClass(TestTableInputFormat.java:96)
	at sun.reflect.NativeMethodAccessorImpl.invoke0(Native Method)
	at sun.reflect.NativeMethodAccessorImpl.invoke(NativeMethodAccessorImpl.java:57)
	at sun.reflect.DelegatingMethodAccessorImpl.invoke(DelegatingMethodAccessorImpl.java:43)
	at java.lang.reflect.Method.invoke(Method.java:606)
	at org.junit.runners.model.FrameworkMethod$1.runReflectiveCall(FrameworkMethod.java:50)
	at org.junit.internal.runners.model.ReflectiveCallable.run(ReflectiveCallable.java:12)
	at org.junit.runners.model.FrameworkMethod.invokeExplosively(FrameworkMethod.java:47)
	at org.junit.internal.runners.statements.RunAfters.evaluate(RunAfters.java:33)
	at org.junit.runners.ParentRunner.run(ParentRunner.java:363)
	at org.junit.runners.Suite.runChild(Suite.java:128)
	at org.junit.runners.Suite.runChild(Suite.java:27)
	at org.junit.runners.ParentRunner$3.run(ParentRunner.java:290)
	at org.junit.runners.ParentRunner$1.schedule(ParentRunner.java:71)
	at org.junit.runners.ParentRunner.runChildren(ParentRunner.java:288)
	at org.junit.runners.ParentRunner.access$000(ParentRunner.java:58)
	at org.junit.runners.ParentRunner$2.evaluate(ParentRunner.java:268)
	at org.junit.runners.ParentRunner.run(ParentRunner.java:363)
	at org.junit.runner.JUnitCore.run(JUnitCore.java:137)
	at org.junit.runner.JUnitCore.run(JUnitCore.java:115)
	at org.apache.maven.surefire.junitcore.JUnitCoreWrapper.createRequestAndRun(JUnitCoreWrapper.java:108)
	at org.apache.maven.surefire.junitcore.JUnitCoreWrapper.executeEager(JUnitCoreWrapper.java:78)
	at org.apache.maven.surefire.junitcore.JUnitCoreWrapper.execute(JUnitCoreWrapper.java:54)
	at org.apache.maven.surefire.junitcore.JUnitCoreProvider.invoke(JUnitCoreProvider.java:144)
	at org.apache.maven.surefire.booter.ForkedBooter.invokeProviderInSameClassLoader(ForkedBooter.java:203)
	at org.apache.maven.surefire.booter.ForkedBooter.runSuitesInProcess(ForkedBooter.java:155)
	at org.apache.maven.surefire.booter.ForkedBooter.main(ForkedBooter.java:103)

"VM Thread" prio=10 tid=0x00007fbddc263800 nid=0x562d runnable 

"GC task thread#0 (ParallelGC)" prio=10 tid=0x00007fbddc01f000 nid=0x5616 runnable 

"GC task thread#1 (ParallelGC)" prio=10 tid=0x00007fbddc020800 nid=0x5617 runnable 

"GC task thread#2 (ParallelGC)" prio=10 tid=0x00007fbddc022800 nid=0x5618 runnable 

"GC task thread#3 (ParallelGC)" prio=10 tid=0x00007fbddc024800 nid=0x5619 runnable 

"GC task thread#4 (ParallelGC)" prio=10 tid=0x00007fbddc026800 nid=0x561a runnable 

"GC task thread#5 (ParallelGC)" prio=10 tid=0x00007fbddc028000 nid=0x561b runnable 

"GC task thread#6 (ParallelGC)" prio=10 tid=0x00007fbddc02a000 nid=0x561c runnable 

"GC task thread#7 (ParallelGC)" prio=10 tid=0x00007fbddc02c000 nid=0x561d runnable 

"GC task thread#8 (ParallelGC)" prio=10 tid=0x00007fbddc02d800 nid=0x561e runnable 

"GC task thread#9 (ParallelGC)" prio=10 tid=0x00007fbddc02f800 nid=0x5620 runnable 

"GC task thread#10 (ParallelGC)" prio=10 tid=0x00007fbddc031800 nid=0x5621 runnable 

"GC task thread#11 (ParallelGC)" prio=10 tid=0x00007fbddc033800 nid=0x5622 runnable 

"GC task thread#12 (ParallelGC)" prio=10 tid=0x00007fbddc035000 nid=0x5623 runnable 

"VM Periodic Task Thread" prio=10 tid=0x00007fbddc2a5000 nid=0x5642 waiting on condition 

JNI global references: 318

+ exit 1
POST BUILD TASK : FAILURE
END OF POST BUILD TASK : 0
Archiving artifacts
Setting JDK_1_7_LATEST__HOME=/home/jenkins/tools/java/latest1.7
Setting JDK_1_8_LATEST__HOME=/home/jenkins/tools/java/latest1.8
Recording test results
Setting JDK_1_7_LATEST__HOME=/home/jenkins/tools/java/latest1.7
Setting JDK_1_8_LATEST__HOME=/home/jenkins/tools/java/latest1.8
ERROR: Step ?Publish JUnit test result report? aborted due to exception: 
java.lang.OutOfMemoryError: Java heap space
	at com.sun.org.apache.xerces.internal.util.XMLStringBuffer.append(XMLStringBuffer.java:208)
	at com.sun.org.apache.xerces.internal.impl.XMLEntityScanner.scanData(XMLEntityScanner.java:1507)
	at com.sun.org.apache.xerces.internal.impl.XMLDocumentFragmentScannerImpl.scanCDATASection(XMLDocumentFragmentScannerImpl.java:1648)
	at com.sun.org.apache.xerces.internal.impl.XMLDocumentFragmentScannerImpl$FragmentContentDriver.next(XMLDocumentFragmentScannerImpl.java:3011)
	at com.sun.org.apache.xerces.internal.impl.XMLDocumentScannerImpl.next(XMLDocumentScannerImpl.java:606)
	at com.sun.org.apache.xerces.internal.impl.XMLNSDocumentScannerImpl.next(XMLNSDocumentScannerImpl.java:118)
	at com.sun.org.apache.xerces.internal.impl.XMLDocumentFragmentScannerImpl.scanDocument(XMLDocumentFragmentScannerImpl.java:504)
	at com.sun.org.apache.xerces.internal.parsers.XML11Configuration.parse(XML11Configuration.java:848)
	at com.sun.org.apache.xerces.internal.parsers.XML11Configuration.parse(XML11Configuration.java:777)
	at com.sun.org.apache.xerces.internal.parsers.XMLParser.parse(XMLParser.java:141)
	at com.sun.org.apache.xerces.internal.parsers.AbstractSAXParser.parse(AbstractSAXParser.java:1213)
	at com.sun.org.apache.xerces.internal.jaxp.SAXParserImpl$JAXPSAXParser.parse(SAXParserImpl.java:642)
	at org.dom4j.io.SAXReader.read(SAXReader.java:465)
	at org.dom4j.io.SAXReader.read(SAXReader.java:264)
	at hudson.tasks.junit.SuiteResult.parse(SuiteResult.java:126)
	at hudson.tasks.junit.TestResult.parse(TestResult.java:302)
	at hudson.tasks.junit.TestResult.parsePossiblyEmpty(TestResult.java:244)
	at hudson.tasks.junit.TestResult.parse(TestResult.java:175)
	at hudson.tasks.junit.TestResult.parse(TestResult.java:154)
	at hudson.tasks.junit.TestResult.<init>(TestResult.java:126)
	at hudson.tasks.junit.JUnitParser$ParseResultCallable.invoke(JUnitParser.java:132)
	at hudson.tasks.junit.JUnitParser$ParseResultCallable.invoke(JUnitParser.java:107)
	at hudson.FilePath$FileCallableWrapper.call(FilePath.java:2731)
	at hudson.remoting.UserRequest.perform(UserRequest.java:153)
	at hudson.remoting.UserRequest.perform(UserRequest.java:50)
	at hudson.remoting.Request$2.run(Request.java:336)
	at hudson.remoting.InterceptingExecutorService$1.call(InterceptingExecutorService.java:68)
	at java.util.concurrent.FutureTask.run(FutureTask.java:262)
	at java.util.concurrent.ThreadPoolExecutor.runWorker(ThreadPoolExecutor.java:1145)
	at java.util.concurrent.ThreadPoolExecutor$Worker.run(ThreadPoolExecutor.java:615)
	at java.lang.Thread.run(Thread.java:745)
	at ......remote call to H7(Native Method)
	at hudson.remoting.Channel.attachCallSiteStackTrace(Channel.java:1545)
	at hudson.remoting.UserResponse.retrieve(UserRequest.java:253)
	at hudson.remoting.Channel.call(Channel.java:830)
Caused: java.io.IOException: Remote call on H7 failed
	at hudson.remoting.Channel.call(Channel.java:838)
	at hudson.FilePath.act(FilePath.java:985)
Caused: java.io.IOException: remote file operation failed: <https://builds.apache.org/job/HBase-1.4/jdk=JDK_1_8,label=Hadoop&&!H13/ws/>
at hudson.remoting.Channel@6634b718:H7
	at hudson.FilePath.act(FilePath.java:992)
	at hudson.FilePath.act(FilePath.java:974)
	at hudson.tasks.junit.JUnitParser.parseResult(JUnitParser.java:103)
	at hudson.tasks.junit.JUnitResultArchiver.parse(JUnitResultArchiver.java:128)
	at hudson.tasks.junit.JUnitResultArchiver.perform(JUnitResultArchiver.java:149)
	at hudson.tasks.BuildStepCompatibilityLayer.perform(BuildStepCompatibilityLayer.java:78)
	at hudson.tasks.BuildStepMonitor$1.perform(BuildStepMonitor.java:20)
	at hudson.model.AbstractBuild$AbstractBuildExecution.perform(AbstractBuild.java:779)
	at hudson.model.AbstractBuild$AbstractBuildExecution.performAllBuildSteps(AbstractBuild.java:720)
	at hudson.model.Build$BuildExecution.post2(Build.java:186)
	at hudson.model.AbstractBuild$AbstractBuildExecution.post(AbstractBuild.java:665)
	at hudson.model.Run.execute(Run.java:1753)
	at hudson.matrix.MatrixRun.run(MatrixRun.java:146)
	at hudson.model.ResourceController.execute(ResourceController.java:98)
	at hudson.model.Executor.run(Executor.java:405)
Setting JDK_1_7_LATEST__HOME=/home/jenkins/tools/java/latest1.7
Setting JDK_1_8_LATEST__HOME=/home/jenkins/tools/java/latest1.8

Mime
View raw message