hbase-builds mailing list archives

Site index · List index
Message view « Date » · « Thread »
Top « Date » · « Thread »
From Apache Jenkins Server <jenk...@builds.apache.org>
Subject Build failed in Jenkins: HBase-1.5 » JDK_1_8,Hadoop&&!H13 #88
Date Mon, 09 Oct 2017 19:36:33 GMT
See <https://builds.apache.org/job/HBase-1.5/jdk=JDK_1_8,label=Hadoop&&!H13/88/display/redirect?page=changes>

Changes:

[busbey] HBASE-18934 pick hadoop versions for precommit test after patch branch

------------------------------------------
[...truncated 2.47 MB...]
Tests run: 8, Failures: 0, Errors: 2, Skipped: 0, Time elapsed: 6.424 sec <<< FAILURE!
- in org.apache.hadoop.hbase.rest.TestTableResource
testTableInfoPB(org.apache.hadoop.hbase.rest.TestTableResource)  Time elapsed: 0.288 sec 
<<< ERROR!
java.lang.NullPointerException: null
	at org.apache.hadoop.hbase.rest.TestTableResource.checkTableInfo(TestTableResource.java:184)
	at org.apache.hadoop.hbase.rest.TestTableResource.testTableInfoPB(TestTableResource.java:271)

testTableInfoXML(org.apache.hadoop.hbase.rest.TestTableResource)  Time elapsed: 0.118 sec
 <<< ERROR!
java.lang.NullPointerException: null
	at org.apache.hadoop.hbase.rest.TestTableResource.checkTableInfo(TestTableResource.java:184)
	at org.apache.hadoop.hbase.rest.TestTableResource.testTableInfoXML(TestTableResource.java:254)

Tests run: 2, Failures: 0, Errors: 2, Skipped: 0, Time elapsed: 24.643 sec <<< FAILURE!
- in org.apache.hadoop.hbase.rest.TestTableResource
testTableInfoPB(org.apache.hadoop.hbase.rest.TestTableResource)  Time elapsed: 0.872 sec 
<<< ERROR!
java.lang.NullPointerException: null
	at org.apache.hadoop.hbase.rest.TestTableResource.checkTableInfo(TestTableResource.java:184)
	at org.apache.hadoop.hbase.rest.TestTableResource.testTableInfoPB(TestTableResource.java:271)

testTableInfoXML(org.apache.hadoop.hbase.rest.TestTableResource)  Time elapsed: 0.071 sec
 <<< ERROR!
java.lang.NullPointerException: null
	at org.apache.hadoop.hbase.rest.TestTableResource.checkTableInfo(TestTableResource.java:184)
	at org.apache.hadoop.hbase.rest.TestTableResource.testTableInfoXML(TestTableResource.java:254)

Tests run: 2, Failures: 0, Errors: 2, Skipped: 0, Time elapsed: 41.838 sec <<< FAILURE!
- in org.apache.hadoop.hbase.rest.TestTableResource
testTableInfoPB(org.apache.hadoop.hbase.rest.TestTableResource)  Time elapsed: 0.749 sec 
<<< ERROR!
java.lang.NullPointerException: null
	at org.apache.hadoop.hbase.rest.TestTableResource.checkTableInfo(TestTableResource.java:184)
	at org.apache.hadoop.hbase.rest.TestTableResource.testTableInfoPB(TestTableResource.java:271)

testTableInfoXML(org.apache.hadoop.hbase.rest.TestTableResource)  Time elapsed: 0.078 sec
 <<< ERROR!
java.lang.NullPointerException: null
	at org.apache.hadoop.hbase.rest.TestTableResource.checkTableInfo(TestTableResource.java:184)
	at org.apache.hadoop.hbase.rest.TestTableResource.testTableInfoXML(TestTableResource.java:254)

Running org.apache.hadoop.hbase.rest.TestGZIPResponseWrapper
Tests run: 4, Failures: 0, Errors: 0, Skipped: 0, Time elapsed: 0.803 sec - in org.apache.hadoop.hbase.rest.TestGZIPResponseWrapper
Running org.apache.hadoop.hbase.rest.TestVersionResource
Tests run: 7, Failures: 0, Errors: 0, Skipped: 0, Time elapsed: 5.788 sec - in org.apache.hadoop.hbase.rest.TestVersionResource
Running org.apache.hadoop.hbase.rest.TestStatusResource
Tests run: 2, Failures: 0, Errors: 0, Skipped: 0, Time elapsed: 4.1 sec - in org.apache.hadoop.hbase.rest.TestStatusResource
Running org.apache.hadoop.hbase.rest.TestScannersWithFilters
Tests run: 10, Failures: 0, Errors: 0, Skipped: 0, Time elapsed: 8.658 sec - in org.apache.hadoop.hbase.rest.TestScannersWithFilters
Running org.apache.hadoop.hbase.rest.TestScannerResource
Tests run: 6, Failures: 0, Errors: 0, Skipped: 0, Time elapsed: 8.833 sec - in org.apache.hadoop.hbase.rest.TestScannerResource
Running org.apache.hadoop.hbase.rest.TestMultiRowResource
Tests run: 8, Failures: 0, Errors: 0, Skipped: 0, Time elapsed: 7.368 sec - in org.apache.hadoop.hbase.rest.TestMultiRowResource
Running org.apache.hadoop.hbase.rest.client.TestRemoteTable
Tests run: 9, Failures: 0, Errors: 0, Skipped: 0, Time elapsed: 46.773 sec - in org.apache.hadoop.hbase.rest.client.TestRemoteTable
Running org.apache.hadoop.hbase.rest.client.TestXmlParsing
Tests run: 2, Failures: 0, Errors: 0, Skipped: 0, Time elapsed: 1.522 sec - in org.apache.hadoop.hbase.rest.client.TestXmlParsing
Running org.apache.hadoop.hbase.rest.client.TestRemoteHTableRetries
Tests run: 7, Failures: 0, Errors: 0, Skipped: 0, Time elapsed: 1.918 sec - in org.apache.hadoop.hbase.rest.client.TestRemoteHTableRetries
Running org.apache.hadoop.hbase.rest.client.TestRemoteAdminRetries
Tests run: 7, Failures: 0, Errors: 0, Skipped: 0, Time elapsed: 1.943 sec - in org.apache.hadoop.hbase.rest.client.TestRemoteAdminRetries
Running org.apache.hadoop.hbase.rest.model.TestCellModel
Tests run: 6, Failures: 0, Errors: 0, Skipped: 0, Time elapsed: 1.75 sec - in org.apache.hadoop.hbase.rest.model.TestCellModel
Running org.apache.hadoop.hbase.rest.model.TestTableListModel
Tests run: 6, Failures: 0, Errors: 0, Skipped: 0, Time elapsed: 1.988 sec - in org.apache.hadoop.hbase.rest.model.TestTableListModel
Running org.apache.hadoop.hbase.rest.model.TestVersionModel
Tests run: 6, Failures: 0, Errors: 0, Skipped: 0, Time elapsed: 1.938 sec - in org.apache.hadoop.hbase.rest.model.TestVersionModel
Running org.apache.hadoop.hbase.rest.model.TestRowModel
Tests run: 6, Failures: 0, Errors: 0, Skipped: 0, Time elapsed: 0.998 sec - in org.apache.hadoop.hbase.rest.model.TestRowModel
Running org.apache.hadoop.hbase.rest.model.TestColumnSchemaModel
Tests run: 6, Failures: 0, Errors: 0, Skipped: 0, Time elapsed: 0.96 sec - in org.apache.hadoop.hbase.rest.model.TestColumnSchemaModel
Running org.apache.hadoop.hbase.rest.model.TestTableInfoModel
Tests run: 6, Failures: 0, Errors: 0, Skipped: 0, Time elapsed: 1.794 sec - in org.apache.hadoop.hbase.rest.model.TestTableInfoModel
Running org.apache.hadoop.hbase.rest.model.TestNamespacesModel
Tests run: 6, Failures: 0, Errors: 0, Skipped: 0, Time elapsed: 0.976 sec - in org.apache.hadoop.hbase.rest.model.TestNamespacesModel
Running org.apache.hadoop.hbase.rest.model.TestStorageClusterVersionModel
Tests run: 6, Failures: 0, Errors: 0, Skipped: 0, Time elapsed: 0.982 sec - in org.apache.hadoop.hbase.rest.model.TestStorageClusterVersionModel
Running org.apache.hadoop.hbase.rest.model.TestStorageClusterStatusModel
Tests run: 6, Failures: 0, Errors: 0, Skipped: 0, Time elapsed: 2.288 sec - in org.apache.hadoop.hbase.rest.model.TestStorageClusterStatusModel
Running org.apache.hadoop.hbase.rest.model.TestCellSetModel
Tests run: 6, Failures: 0, Errors: 0, Skipped: 0, Time elapsed: 2.12 sec - in org.apache.hadoop.hbase.rest.model.TestCellSetModel
Running org.apache.hadoop.hbase.rest.model.TestTableSchemaModel
Tests run: 6, Failures: 0, Errors: 0, Skipped: 0, Time elapsed: 1.982 sec - in org.apache.hadoop.hbase.rest.model.TestTableSchemaModel
Running org.apache.hadoop.hbase.rest.model.TestNamespacesInstanceModel
Tests run: 6, Failures: 0, Errors: 0, Skipped: 0, Time elapsed: 1.072 sec - in org.apache.hadoop.hbase.rest.model.TestNamespacesInstanceModel
Running org.apache.hadoop.hbase.rest.model.TestScannerModel
Tests run: 6, Failures: 0, Errors: 0, Skipped: 0, Time elapsed: 1.902 sec - in org.apache.hadoop.hbase.rest.model.TestScannerModel
Running org.apache.hadoop.hbase.rest.model.TestTableRegionModel
Tests run: 8, Failures: 0, Errors: 0, Skipped: 0, Time elapsed: 1.097 sec - in org.apache.hadoop.hbase.rest.model.TestTableRegionModel
Running org.apache.hadoop.hbase.rest.TestScannersWithLabels
Tests run: 2, Failures: 0, Errors: 0, Skipped: 0, Time elapsed: 5.125 sec - in org.apache.hadoop.hbase.rest.TestScannersWithLabels
Running org.apache.hadoop.hbase.rest.TestTableScan
Tests run: 12, Failures: 0, Errors: 0, Skipped: 0, Time elapsed: 29.296 sec - in org.apache.hadoop.hbase.rest.TestTableScan
Running org.apache.hadoop.hbase.rest.TestNamespacesResource
Tests run: 2, Failures: 0, Errors: 0, Skipped: 0, Time elapsed: 11.369 sec - in org.apache.hadoop.hbase.rest.TestNamespacesResource
Running org.apache.hadoop.hbase.rest.TestGzipFilter
Tests run: 2, Failures: 0, Errors: 0, Skipped: 0, Time elapsed: 5.057 sec - in org.apache.hadoop.hbase.rest.TestGzipFilter
Running org.apache.hadoop.hbase.rest.TestGetAndPutResource
Tests run: 27, Failures: 0, Errors: 0, Skipped: 0, Time elapsed: 143.365 sec - in org.apache.hadoop.hbase.rest.TestGetAndPutResource
Running org.apache.hadoop.hbase.rest.TestNamespacesInstanceResource
Tests run: 5, Failures: 0, Errors: 0, Skipped: 0, Time elapsed: 20.472 sec - in org.apache.hadoop.hbase.rest.TestNamespacesInstanceResource
Running org.apache.hadoop.hbase.rest.TestSchemaResource
Tests run: 4, Failures: 0, Errors: 0, Skipped: 0, Time elapsed: 25.308 sec - in org.apache.hadoop.hbase.rest.TestSchemaResource

Results :

Tests in error: 
org.apache.hadoop.hbase.rest.TestTableResource.testTableInfoPB(org.apache.hadoop.hbase.rest.TestTableResource)
  Run 1: TestTableResource.testTableInfoPB:271->checkTableInfo:184 NullPointer
  Run 2: TestTableResource.testTableInfoPB:271->checkTableInfo:184 NullPointer
  Run 3: TestTableResource.testTableInfoPB:271->checkTableInfo:184 NullPointer

org.apache.hadoop.hbase.rest.TestTableResource.testTableInfoXML(org.apache.hadoop.hbase.rest.TestTableResource)
  Run 1: TestTableResource.testTableInfoXML:254->checkTableInfo:184 NullPointer
  Run 2: TestTableResource.testTableInfoXML:254->checkTableInfo:184 NullPointer
  Run 3: TestTableResource.testTableInfoXML:254->checkTableInfo:184 NullPointer


Tests run: 213, Failures: 0, Errors: 2, Skipped: 0

[INFO] ------------------------------------------------------------------------
[INFO] Reactor Summary:
[INFO] 
[INFO] Apache HBase ...................................... SUCCESS [1:45.641s]
[INFO] Apache HBase - Checkstyle ......................... SUCCESS [15.634s]
[INFO] Apache HBase - Resource Bundle .................... SUCCESS [0.259s]
[INFO] Apache HBase - Annotations ........................ SUCCESS [1.482s]
[INFO] Apache HBase - Protocol ........................... SUCCESS [17.992s]
[INFO] Apache HBase - Common ............................. SUCCESS [2:40.963s]
[INFO] Apache HBase - Procedure .......................... SUCCESS [3:40.885s]
[INFO] Apache HBase - Metrics API ........................ SUCCESS [1.254s]
[INFO] Apache HBase - Hadoop Compatibility ............... SUCCESS [11.691s]
[INFO] Apache HBase - Metrics Implementation ............. SUCCESS [5.327s]
[INFO] Apache HBase - Hadoop Two Compatibility ........... SUCCESS [20.336s]
[INFO] Apache HBase - Client ............................. SUCCESS [1:45.668s]
[INFO] Apache HBase - Prefix Tree ........................ SUCCESS [8.335s]
[INFO] Apache HBase - Server ............................. SUCCESS [1:54:59.991s]
[INFO] Apache HBase - Testing Util ....................... SUCCESS [3.400s]
[INFO] Apache HBase - Thrift ............................. SUCCESS [6:09.438s]
[INFO] Apache HBase - Rest ............................... FAILURE [13:56.051s]
[INFO] Apache HBase - Shell .............................. SKIPPED
[INFO] Apache HBase - Integration Tests .................. SKIPPED
[INFO] Apache HBase - Examples ........................... SKIPPED
[INFO] Apache HBase - External Block Cache ............... SKIPPED
[INFO] Apache HBase - Assembly ........................... SKIPPED
[INFO] Apache HBase - Shaded ............................. SKIPPED
[INFO] Apache HBase - Shaded - Client .................... SKIPPED
[INFO] Apache HBase - Shaded - Server .................... SKIPPED
[INFO] Apache HBase Shaded Packaging Invariants .......... SKIPPED
[INFO] Apache HBase - Archetypes ......................... SKIPPED
[INFO] Apache HBase - Exemplar for hbase-client archetype  SKIPPED
[INFO] Apache HBase - Exemplar for hbase-shaded-client archetype  SKIPPED
[INFO] Apache HBase - Archetype builder .................. SKIPPED
[INFO] ------------------------------------------------------------------------
[INFO] BUILD FAILURE
[INFO] ------------------------------------------------------------------------
[INFO] Total time: 2:26:56.147s
[INFO] Finished at: Mon Oct 09 19:31:07 UTC 2017
[INFO] Final Memory: 126M/1685M
[INFO] ------------------------------------------------------------------------
[ERROR] Failed to execute goal org.apache.maven.plugins:maven-surefire-plugin:2.18.1:test
(default-test) on project hbase-rest: There are test failures.
[ERROR] 
[ERROR] Please refer to <https://builds.apache.org/job/HBase-1.5/jdk=JDK_1_8,label=Hadoop&&!H13/ws/hbase-rest/target/surefire-reports>
for the individual test results.
[ERROR] -> [Help 1]
[ERROR] 
[ERROR] To see the full stack trace of the errors, re-run Maven with the -e switch.
[ERROR] Re-run Maven using the -X switch to enable full debug logging.
[ERROR] 
[ERROR] For more information about the errors and possible solutions, please read the following
articles:
[ERROR] [Help 1] http://cwiki.apache.org/confluence/display/MAVEN/MojoFailureException
[ERROR] 
[ERROR] After correcting the problems, you can resume the build with the command
[ERROR]   mvn <goals> -rf :hbase-rest
Build step 'Invoke top-level Maven targets' marked build as failure
Performing Post build task...
Match found for :.* : True
Logical operation result is TRUE
Running script  : # Post-build task script. TODO: Check this in and have all builds reference
check-in.
pwd && ls
# NOTE!!!! The below code has been copied and pasted from ./dev-tools/run-test.sh
# Do not change here without syncing there and vice-versa.
ZOMBIE_TESTS_COUNT=`jps -v | grep surefirebooter | grep -e '-Dhbase.test' | wc -l`
if [[ $ZOMBIE_TESTS_COUNT != 0 ]] ; then
 echo "Suspicious java process found - waiting 30s to see if there are just slow to stop"
 sleep 30
 ZOMBIE_TESTS_COUNT=`jps -v | grep surefirebooter | grep -e '-Dhbase.test' | wc -l`
 if [[ $ZOMBIE_TESTS_COUNT != 0 ]] ; then
   echo " {color:red}There appear to be $ZOMBIE_TESTS_COUNT zombie tests{color}, they should
have been killed by surefire but survived"
   jps -v | grep surefirebooter | grep -e '-Dhbase.test'
   jps -v | grep surefirebooter | grep -e '-Dhbase.test' | cut -d ' ' -f 1 | xargs -n 1 jstack
   # Exit with error
   exit 1
 else
   echo "We're ok: there is no zombie test, but some tests took some time to stop"
 fi
else
  echo "We're ok: there is no zombie test"
fi
Setting JDK_1_7_LATEST__HOME=/home/jenkins/tools/java/latest1.7
Setting JDK_1_8_LATEST__HOME=/home/jenkins/tools/java/latest1.8
[30b16b4c] $ /bin/bash -xe /tmp/jenkins7948816763265228552.sh
+ pwd
<https://builds.apache.org/job/HBase-1.5/jdk=JDK_1_8,label=Hadoop&&!H13/ws/>
+ ls
bin
CHANGES.txt
conf
dev-support
extra_env_var
hbase-annotations
hbase-archetypes
hbase-assembly
hbase-checkstyle
hbase-client
hbase-common
hbase-examples
hbase-external-blockcache
hbase-hadoop2-compat
hbase-hadoop-compat
hbase-it
hbase-metrics
hbase-metrics-api
hbase-native-client
hbase-prefix-tree
hbase-procedure
hbase-protocol
hbase-resource-bundle
hbase-rest
hbase-server
hbase-shaded
hbase-shell
hbase-testing-util
hbase-thrift
LICENSE.txt
NOTICE.txt
pom.xml
README.txt
src
target
++ jps -v
++ grep surefirebooter
++ grep -e -Dhbase.test
++ wc -l
+ ZOMBIE_TESTS_COUNT=0
+ [[ 0 != 0 ]]
+ echo 'We'\''re ok: there is no zombie test'
We're ok: there is no zombie test
POST BUILD TASK : SUCCESS
END OF POST BUILD TASK : 0
Archiving artifacts
Setting JDK_1_7_LATEST__HOME=/home/jenkins/tools/java/latest1.7
Setting JDK_1_8_LATEST__HOME=/home/jenkins/tools/java/latest1.8
Recording test results
Setting JDK_1_7_LATEST__HOME=/home/jenkins/tools/java/latest1.7
Setting JDK_1_8_LATEST__HOME=/home/jenkins/tools/java/latest1.8
Setting JDK_1_7_LATEST__HOME=/home/jenkins/tools/java/latest1.7
Setting JDK_1_8_LATEST__HOME=/home/jenkins/tools/java/latest1.8

Mime
View raw message