hbase-builds mailing list archives

Site index · List index
Message view « Date » · « Thread »
Top « Date » · « Thread »
From Apache Jenkins Server <jenk...@builds.apache.org>
Subject Build failed in Jenkins: HBase-Trunk_matrix » JDK 1.8 (latest),(Hadoop && !H5) #4585
Date Wed, 14 Feb 2018 22:15:46 GMT
See <https://builds.apache.org/job/HBase-Trunk_matrix/jdk=JDK%201.8%20(latest),label=(Hadoop%20&&%20!H5)/4585/display/redirect?page=changes>

Changes:

[stack] HBASE-19116 Currently the tail of hfiles with CellComparator* classname

------------------------------------------
[...truncated 1.56 MB...]
-------------------------------------------------------
 T E S T S
-------------------------------------------------------
Running org.apache.hbase.archetypes.exemplars.client.TestHelloHBase
Tests run: 4, Failures: 0, Errors: 0, Skipped: 0, Time elapsed: 32.574 sec - in org.apache.hbase.archetypes.exemplars.client.TestHelloHBase

Results :

Tests run: 4, Failures: 0, Errors: 0, Skipped: 0

[INFO] 
[INFO] --- maven-jar-plugin:3.0.0:test-jar (default) @ hbase-client-project ---
[INFO] Building jar: <https://builds.apache.org/job/HBase-Trunk_matrix/jdk=JDK%201.8%20(latest),label=(Hadoop%20&&%20!H5)/ws/hbase-archetypes/hbase-client-project/target/hbase-client-project-3.0.0-SNAPSHOT-tests.jar>
[INFO] 
[INFO] --- maven-jar-plugin:3.0.0:jar (default-jar) @ hbase-client-project ---
[INFO] Building jar: <https://builds.apache.org/job/HBase-Trunk_matrix/jdk=JDK%201.8%20(latest),label=(Hadoop%20&&%20!H5)/ws/hbase-archetypes/hbase-client-project/target/hbase-client-project-3.0.0-SNAPSHOT.jar>
[INFO] 
[INFO] --- maven-install-plugin:2.5.2:install (default-install) @ hbase-client-project ---
[INFO] Installing <https://builds.apache.org/job/HBase-Trunk_matrix/jdk=JDK%201.8%20(latest),label=(Hadoop%20&&%20!H5)/ws/hbase-archetypes/hbase-client-project/target/hbase-client-project-3.0.0-SNAPSHOT.jar>
to /home/jenkins/.m2/repository/org/apache/hbase/hbase-client-project/3.0.0-SNAPSHOT/hbase-client-project-3.0.0-SNAPSHOT.jar
[INFO] Installing <https://builds.apache.org/job/HBase-Trunk_matrix/jdk=JDK%201.8%20(latest),label=(Hadoop%20&&%20!H5)/4585/artifact/hbase-archetypes/hbase-client-project/pom.xml>
to /home/jenkins/.m2/repository/org/apache/hbase/hbase-client-project/3.0.0-SNAPSHOT/hbase-client-project-3.0.0-SNAPSHOT.pom
[INFO] Installing <https://builds.apache.org/job/HBase-Trunk_matrix/jdk=JDK%201.8%20(latest),label=(Hadoop%20&&%20!H5)/ws/hbase-archetypes/hbase-client-project/target/hbase-client-project-3.0.0-SNAPSHOT-tests.jar>
to /home/jenkins/.m2/repository/org/apache/hbase/hbase-client-project/3.0.0-SNAPSHOT/hbase-client-project-3.0.0-SNAPSHOT-tests.jar
[INFO]                                                                         
[INFO] ------------------------------------------------------------------------
[INFO] Building Apache HBase - Exemplar for hbase-shaded-client archetype 3.0.0-SNAPSHOT
[INFO] ------------------------------------------------------------------------
[INFO] 
[INFO] --- build-helper-maven-plugin:3.0.0:bsh-property (negate-license-bundles-property)
@ hbase-shaded-client-project ---
[INFO] 
[INFO] --- maven-enforcer-plugin:3.0.0-M1:enforce (hadoop-profile-min-maven-min-java-banned-xerces)
@ hbase-shaded-client-project ---
[INFO] 
[INFO] --- maven-enforcer-plugin:3.0.0-M1:enforce (banned-jsr305) @ hbase-shaded-client-project
---
[INFO] 
[INFO] --- maven-enforcer-plugin:3.0.0-M1:enforce (banned-scala) @ hbase-shaded-client-project
---
[INFO] 
[INFO] --- maven-enforcer-plugin:3.0.0-M1:enforce (banned-hbase-spark) @ hbase-shaded-client-project
---
[INFO] 
[INFO] --- buildnumber-maven-plugin:1.4:create-timestamp (default) @ hbase-shaded-client-project
---
[INFO] 
[INFO] --- maven-remote-resources-plugin:1.5:process (process-resource-bundles) @ hbase-shaded-client-project
---
[INFO] 
[INFO] --- maven-resources-plugin:2.7:resources (default-resources) @ hbase-shaded-client-project
---
[INFO] Using 'UTF-8' encoding to copy filtered resources.
[INFO] Copying 1 resource
[INFO] Copying 3 resources
[INFO] 
[INFO] --- maven-enforcer-plugin:3.0.0-M1:enforce (check-aggregate-license) @ hbase-shaded-client-project
---
[INFO] Skipping Rule Enforcement.
[INFO] 
[INFO] --- maven-compiler-plugin:3.6.1:compile (default-compile) @ hbase-shaded-client-project
---
[INFO] Compiling 1 source file to <https://builds.apache.org/job/HBase-Trunk_matrix/jdk=JDK%201.8%20(latest),label=(Hadoop%20&&%20!H5)/ws/hbase-archetypes/hbase-shaded-client-project/target/classes>
[INFO] 
[INFO] --- maven-resources-plugin:2.7:testResources (default-testResources) @ hbase-shaded-client-project
---
[INFO] Using 'UTF-8' encoding to copy filtered resources.
[INFO] skip non existing resourceDirectory <https://builds.apache.org/job/HBase-Trunk_matrix/jdk=JDK%201.8%20(latest),label=(Hadoop%20&&%20!H5)/ws/hbase-archetypes/hbase-shaded-client-project/src/test/resources>
[INFO] Copying 3 resources
[INFO] 
[INFO] --- maven-compiler-plugin:3.6.1:testCompile (default-testCompile) @ hbase-shaded-client-project
---
[INFO] Nothing to compile - all classes are up to date
[INFO] 
[INFO] --- maven-surefire-plugin:2.19:test (default-test) @ hbase-shaded-client-project ---

-------------------------------------------------------
 T E S T S
-------------------------------------------------------

Results :

Tests run: 0, Failures: 0, Errors: 0, Skipped: 0

[INFO] 
[INFO] --- maven-surefire-plugin:2.19:test (secondPartTestsExecution) @ hbase-shaded-client-project
---

-------------------------------------------------------
 T E S T S
-------------------------------------------------------
Running org.apache.hbase.archetypes.exemplars.shaded_client.TestHelloHBase
Tests run: 4, Failures: 0, Errors: 0, Skipped: 0, Time elapsed: 23.402 sec - in org.apache.hbase.archetypes.exemplars.shaded_client.TestHelloHBase

Results :

Tests run: 4, Failures: 0, Errors: 0, Skipped: 0

[INFO] 
[INFO] --- maven-jar-plugin:3.0.0:test-jar (default) @ hbase-shaded-client-project ---
[INFO] Building jar: <https://builds.apache.org/job/HBase-Trunk_matrix/jdk=JDK%201.8%20(latest),label=(Hadoop%20&&%20!H5)/ws/hbase-archetypes/hbase-shaded-client-project/target/hbase-shaded-client-project-3.0.0-SNAPSHOT-tests.jar>
[INFO] 
[INFO] --- maven-jar-plugin:3.0.0:jar (default-jar) @ hbase-shaded-client-project ---
[INFO] Building jar: <https://builds.apache.org/job/HBase-Trunk_matrix/jdk=JDK%201.8%20(latest),label=(Hadoop%20&&%20!H5)/ws/hbase-archetypes/hbase-shaded-client-project/target/hbase-shaded-client-project-3.0.0-SNAPSHOT.jar>
[INFO] 
[INFO] --- maven-install-plugin:2.5.2:install (default-install) @ hbase-shaded-client-project
---
[INFO] Installing <https://builds.apache.org/job/HBase-Trunk_matrix/jdk=JDK%201.8%20(latest),label=(Hadoop%20&&%20!H5)/ws/hbase-archetypes/hbase-shaded-client-project/target/hbase-shaded-client-project-3.0.0-SNAPSHOT.jar>
to /home/jenkins/.m2/repository/org/apache/hbase/hbase-shaded-client-project/3.0.0-SNAPSHOT/hbase-shaded-client-project-3.0.0-SNAPSHOT.jar
[INFO] Installing <https://builds.apache.org/job/HBase-Trunk_matrix/jdk=JDK%201.8%20(latest),label=(Hadoop%20&&%20!H5)/4585/artifact/hbase-archetypes/hbase-shaded-client-project/pom.xml>
to /home/jenkins/.m2/repository/org/apache/hbase/hbase-shaded-client-project/3.0.0-SNAPSHOT/hbase-shaded-client-project-3.0.0-SNAPSHOT.pom
[INFO] Installing <https://builds.apache.org/job/HBase-Trunk_matrix/jdk=JDK%201.8%20(latest),label=(Hadoop%20&&%20!H5)/ws/hbase-archetypes/hbase-shaded-client-project/target/hbase-shaded-client-project-3.0.0-SNAPSHOT-tests.jar>
to /home/jenkins/.m2/repository/org/apache/hbase/hbase-shaded-client-project/3.0.0-SNAPSHOT/hbase-shaded-client-project-3.0.0-SNAPSHOT-tests.jar
[INFO]                                                                         
[INFO] ------------------------------------------------------------------------
[INFO] Building Apache HBase - Archetype builder 3.0.0-SNAPSHOT
[INFO] ------------------------------------------------------------------------
[INFO] 
[INFO] --- build-helper-maven-plugin:3.0.0:bsh-property (negate-license-bundles-property)
@ hbase-archetype-builder ---
[INFO] 
[INFO] --- maven-enforcer-plugin:3.0.0-M1:enforce (hadoop-profile-min-maven-min-java-banned-xerces)
@ hbase-archetype-builder ---
[INFO] 
[INFO] --- maven-enforcer-plugin:3.0.0-M1:enforce (banned-jsr305) @ hbase-archetype-builder
---
[INFO] 
[INFO] --- maven-enforcer-plugin:3.0.0-M1:enforce (banned-scala) @ hbase-archetype-builder
---
[INFO] 
[INFO] --- maven-enforcer-plugin:3.0.0-M1:enforce (banned-hbase-spark) @ hbase-archetype-builder
---
[INFO] 
[INFO] --- buildnumber-maven-plugin:1.4:create-timestamp (default) @ hbase-archetype-builder
---
[INFO] 
[INFO] --- maven-remote-resources-plugin:1.5:process (process-resource-bundles) @ hbase-archetype-builder
---
[INFO] 
[INFO] --- maven-resources-plugin:2.7:copy-resources (hbase-client__copy-src-to-build-archetype-subdir)
@ hbase-archetype-builder ---
[INFO] Using 'UTF-8' encoding to copy filtered resources.
[INFO] Copying 4 resources
[INFO] 
[INFO] --- maven-resources-plugin:2.7:copy-resources (hbase-client__copy-pom-to-temp-for-xslt-processing)
@ hbase-archetype-builder ---
[INFO] Using 'UTF-8' encoding to copy filtered resources.
[INFO] Copying 1 resource
[INFO] 
[INFO] --- maven-resources-plugin:2.7:copy-resources (hbase-shaded-client__copy-src-to-build-archetype-subdir)
@ hbase-archetype-builder ---
[INFO] Using 'UTF-8' encoding to copy filtered resources.
[INFO] Copying 4 resources
[INFO] 
[INFO] --- maven-resources-plugin:2.7:copy-resources (hbase-shaded-client__copy-pom-to-temp-for-xslt-processing)
@ hbase-archetype-builder ---
[INFO] Using 'UTF-8' encoding to copy filtered resources.
[INFO] Copying 1 resource
[INFO] 
[INFO] --- maven-enforcer-plugin:3.0.0-M1:enforce (check-aggregate-license) @ hbase-archetype-builder
---
[INFO] Skipping Rule Enforcement.
[INFO] 
[INFO] --- xml-maven-plugin:1.0.1:transform (modify-exemplar-pom-files-via-xslt) @ hbase-archetype-builder
---
Warning: org.apache.xerces.parsers.SAXParser: Feature 'http://javax.xml.XMLConstants/feature/secure-processing'
is not recognized.
Warning: org.apache.xerces.parsers.SAXParser: Property 'http://javax.xml.XMLConstants/property/accessExternalDTD'
is not recognized.
Warning: org.apache.xerces.parsers.SAXParser: Property 'http://www.oracle.com/xml/jaxp/properties/entityExpansionLimit'
is not recognized.
[INFO] Transforming file: <https://builds.apache.org/job/HBase-Trunk_matrix/jdk=JDK%201.8%20(latest),label=(Hadoop%20&&%20!H5)/4585/artifact/hbase-archetypes/hbase-archetype-builder/../hbase-client-project/target/temp/pom.xml>
[INFO] Transformed 1 file(s).
[INFO] Transforming file: <https://builds.apache.org/job/HBase-Trunk_matrix/jdk=JDK%201.8%20(latest),label=(Hadoop%20&&%20!H5)/4585/artifact/hbase-archetypes/hbase-archetype-builder/../hbase-shaded-client-project/target/temp/pom.xml>
[INFO] Transformed 1 file(s).
[INFO] 
[INFO] --- maven-antrun-plugin:1.8:run (make-scripts-executable) @ hbase-archetype-builder
---
[INFO] No Ant target defined - SKIPPED
[INFO] 
[INFO] --- maven-antrun-plugin:1.8:run (run-createArchetypes-script) @ hbase-archetype-builder
---
[INFO] No Ant target defined - SKIPPED
[INFO] 
[INFO] --- maven-resources-plugin:2.7:copy-resources (hbase-client-ARCHETYPE__copy-pom-to-temp-for-xslt-processing)
@ hbase-archetype-builder ---
[INFO] Using 'UTF-8' encoding to copy filtered resources.
[INFO] skip non existing resourceDirectory <https://builds.apache.org/job/HBase-Trunk_matrix/jdk=JDK%201.8%20(latest),label=(Hadoop%20&&%20!H5)/ws/hbase-archetypes/hbase-archetype-builder/../hbase-client-project/target/build-archetype/target/generated-sources/archetype>
[INFO] 
[INFO] --- maven-resources-plugin:2.7:copy-resources (hbase-shaded-client-ARCHETYPE__copy-pom-to-temp-for-xslt-processing)
@ hbase-archetype-builder ---
[INFO] Using 'UTF-8' encoding to copy filtered resources.
[INFO] skip non existing resourceDirectory <https://builds.apache.org/job/HBase-Trunk_matrix/jdk=JDK%201.8%20(latest),label=(Hadoop%20&&%20!H5)/ws/hbase-archetypes/hbase-archetype-builder/../hbase-shaded-client-project/target/build-archetype/target/generated-sources/archetype>
[INFO] 
[INFO] --- xml-maven-plugin:1.0.1:transform (modify-archetype-pom-files-via-xslt) @ hbase-archetype-builder
---
[WARNING] The directory <https://builds.apache.org/job/HBase-Trunk_matrix/jdk=JDK%201.8%20(latest),label=(Hadoop%20&&%20!H5)/ws/hbase-archetypes/hbase-archetype-builder/../hbase-client-project/target/temp-arch,>
which is a base directory of a ValidationSet or TransformationSet, does not exist.
[WARNING] No files found for transformation by stylesheet modify_archetype_pom.xsl
[WARNING] The directory <https://builds.apache.org/job/HBase-Trunk_matrix/jdk=JDK%201.8%20(latest),label=(Hadoop%20&&%20!H5)/ws/hbase-archetypes/hbase-archetype-builder/../hbase-shaded-client-project/target/temp-arch,>
which is a base directory of a ValidationSet or TransformationSet, does not exist.
[WARNING] No files found for transformation by stylesheet modify_archetype_pom.xsl
[INFO] 
[INFO] --- maven-install-plugin:2.5.2:install (default-install) @ hbase-archetype-builder
---
[INFO] Installing <https://builds.apache.org/job/HBase-Trunk_matrix/jdk=JDK%201.8%20(latest),label=(Hadoop%20&&%20!H5)/4585/artifact/hbase-archetypes/hbase-archetype-builder/pom.xml>
to /home/jenkins/.m2/repository/org/apache/hbase/hbase-archetype-builder/3.0.0-SNAPSHOT/hbase-archetype-builder-3.0.0-SNAPSHOT.pom
[INFO] 
[INFO] --- maven-antrun-plugin:1.8:run (run-installArchetypes-script) @ hbase-archetype-builder
---
[INFO] No Ant target defined - SKIPPED
[INFO] ------------------------------------------------------------------------
[INFO] Reactor Summary:
[INFO] 
[INFO] Apache HBase ...................................... SUCCESS [2.393s]
[INFO] Apache HBase - Checkstyle ......................... SUCCESS [0.520s]
[INFO] Apache HBase - Build Support ...................... SUCCESS [0.062s]
[INFO] Apache HBase - Error Prone Rules .................. SUCCESS [0.220s]
[INFO] Apache HBase - Annotations ........................ SUCCESS [0.467s]
[INFO] Apache HBase - Build Configuration ................ SUCCESS [0.076s]
[INFO] Apache HBase - Shaded Protocol .................... SUCCESS [22.907s]
[INFO] Apache HBase - Common ............................. SUCCESS [2:12.216s]
[INFO] Apache HBase - Metrics API ........................ SUCCESS [2.292s]
[INFO] Apache HBase - Hadoop Compatibility ............... SUCCESS [13.847s]
[INFO] Apache HBase - Metrics Implementation ............. SUCCESS [8.731s]
[INFO] Apache HBase - Hadoop Two Compatibility ........... SUCCESS [16.374s]
[INFO] Apache HBase - Protocol ........................... SUCCESS [6.887s]
[INFO] Apache HBase - Client ............................. SUCCESS [2:47.941s]
[INFO] Apache HBase - Zookeeper .......................... SUCCESS [27.994s]
[INFO] Apache HBase - Replication ........................ SUCCESS [8.846s]
[INFO] Apache HBase - Resource Bundle .................... SUCCESS [0.146s]
[INFO] Apache HBase - HTTP ............................... SUCCESS [32.688s]
[INFO] Apache HBase - Procedure .......................... SUCCESS [2:22.925s]
[INFO] Apache HBase - Server ............................. SUCCESS [2:52:47.536s]
[INFO] Apache HBase - MapReduce .......................... SUCCESS [18:52.488s]
[INFO] Apache HBase - Testing Util ....................... SUCCESS [2.968s]
[INFO] Apache HBase - Thrift ............................. SUCCESS [2:58.646s]
[INFO] Apache HBase - RSGroup ............................ SUCCESS [5:23.760s]
[INFO] Apache HBase - Shell .............................. FAILURE [10:10.994s]
[INFO] Apache HBase - Coprocessor Endpoint ............... SUCCESS [6:20.499s]
[INFO] Apache HBase - Backup ............................. SUCCESS [22:24.570s]
[INFO] Apache HBase - Integration Tests .................. SUCCESS [43.362s]
[INFO] Apache HBase - Examples ........................... SUCCESS [2:11.664s]
[INFO] Apache HBase - Rest ............................... SUCCESS [5:44.855s]
[INFO] Apache HBase - External Block Cache ............... SUCCESS [1.955s]
[INFO] Apache HBase - Spark .............................. SUCCESS [5:18.978s]
[INFO] Apache HBase - Spark Integration Tests ............ SUCCESS [3.877s]
[INFO] Apache HBase - Assembly ........................... SKIPPED
[INFO] Apache HBase - Shaded ............................. SUCCESS [1.218s]
[INFO] Apache HBase - Shaded - Client .................... SUCCESS [1.246s]
[INFO] Apache HBase - Shaded - MapReduce ................. SUCCESS [1.757s]
[INFO] Apache HBase Shaded Packaging Invariants .......... SUCCESS [1.984s]
[INFO] Apache HBase - Archetypes ......................... SUCCESS [0.043s]
[INFO] Apache HBase - Exemplar for hbase-client archetype  SUCCESS [1:00.400s]
[INFO] Apache HBase - Exemplar for hbase-shaded-client archetype  SUCCESS [49.601s]
[INFO] Apache HBase - Archetype builder .................. SUCCESS [0.479s]
[INFO] ------------------------------------------------------------------------
[INFO] BUILD FAILURE
[INFO] ------------------------------------------------------------------------
[INFO] Total time: 4:24:51.915s
[INFO] Finished at: Wed Feb 14 22:09:58 UTC 2018
[INFO] Final Memory: 201M/3810M
[INFO] ------------------------------------------------------------------------
[ERROR] Failed to execute goal org.apache.maven.plugins:maven-surefire-plugin:2.20.1:test
(secondPartTestsExecution) on project hbase-shell: There are test failures.
[ERROR] 
[ERROR] Please refer to <https://builds.apache.org/job/HBase-Trunk_matrix/jdk=JDK%201.8%20(latest),label=(Hadoop%20&&%20!H5)/ws/hbase-shell/target/surefire-reports>
for the individual test results.
[ERROR] Please refer to dump files (if any exist) [date]-jvmRun[N].dump, [date].dumpstream
and [date]-jvmRun[N].dumpstream.
[ERROR] -> [Help 1]
[ERROR] 
[ERROR] To see the full stack trace of the errors, re-run Maven with the -e switch.
[ERROR] Re-run Maven using the -X switch to enable full debug logging.
[ERROR] 
[ERROR] For more information about the errors and possible solutions, please read the following
articles:
[ERROR] [Help 1] http://cwiki.apache.org/confluence/display/MAVEN/MojoFailureException
[ERROR] 
[ERROR] After correcting the problems, you can resume the build with the command
[ERROR]   mvn <goals> -rf :hbase-shell
Build step 'Invoke top-level Maven targets' marked build as failure
Performing Post build task...
Match found for :.* : True
Logical operation result is TRUE
Running script  : # Run zombie detector script
./dev-support/zombie-detector.sh --jenkins ${BUILD_ID}
[11c72c70] $ /bin/bash -xe /tmp/jenkins4501163454910992682.sh
+ ./dev-support/zombie-detector.sh --jenkins 4585
Wed Feb 14 22:10:00 UTC 2018 We're ok: there is no zombie test


    {color:green}+1 zombies{color}. No zombie tests found running at the end of the build.
POST BUILD TASK : SUCCESS
END OF POST BUILD TASK : 0
Archiving artifacts
Recording test results
[FINDBUGS] Skipping publisher since build result is FAILURE
[CHECKSTYLE] Skipping publisher since build result is FAILURE

Mime
View raw message