hbase-builds mailing list archives

Site index · List index
Message view « Date » · « Thread »
Top « Date » · « Thread »
From Apache Jenkins Server <jenk...@builds.apache.org>
Subject Build failed in Jenkins: HBase-Trunk_matrix » JDK 1.8 (latest),(Hadoop && !H5) #4560
Date Sat, 10 Feb 2018 13:37:25 GMT
See <https://builds.apache.org/job/HBase-Trunk_matrix/jdk=JDK%201.8%20(latest),label=(Hadoop%20&&%20!H5)/4560/display/redirect>

------------------------------------------
[...truncated 1.56 MB...]
-------------------------------------------------------
 T E S T S
-------------------------------------------------------
Running org.apache.hbase.archetypes.exemplars.client.TestHelloHBase
Tests run: 4, Failures: 0, Errors: 0, Skipped: 0, Time elapsed: 21.246 sec - in org.apache.hbase.archetypes.exemplars.client.TestHelloHBase

Results :

Tests run: 4, Failures: 0, Errors: 0, Skipped: 0

[INFO] 
[INFO] --- maven-jar-plugin:3.0.0:test-jar (default) @ hbase-client-project ---
[INFO] Building jar: <https://builds.apache.org/job/HBase-Trunk_matrix/jdk=JDK%201.8%20(latest),label=(Hadoop%20&&%20!H5)/ws/hbase-archetypes/hbase-client-project/target/hbase-client-project-3.0.0-SNAPSHOT-tests.jar>
[INFO] 
[INFO] --- maven-jar-plugin:3.0.0:jar (default-jar) @ hbase-client-project ---
[INFO] Building jar: <https://builds.apache.org/job/HBase-Trunk_matrix/jdk=JDK%201.8%20(latest),label=(Hadoop%20&&%20!H5)/ws/hbase-archetypes/hbase-client-project/target/hbase-client-project-3.0.0-SNAPSHOT.jar>
[INFO] 
[INFO] --- maven-install-plugin:2.5.2:install (default-install) @ hbase-client-project ---
[INFO] Installing <https://builds.apache.org/job/HBase-Trunk_matrix/jdk=JDK%201.8%20(latest),label=(Hadoop%20&&%20!H5)/ws/hbase-archetypes/hbase-client-project/target/hbase-client-project-3.0.0-SNAPSHOT.jar>
to /home/jenkins/.m2/repository/org/apache/hbase/hbase-client-project/3.0.0-SNAPSHOT/hbase-client-project-3.0.0-SNAPSHOT.jar
[INFO] Installing <https://builds.apache.org/job/HBase-Trunk_matrix/jdk=JDK%201.8%20(latest),label=(Hadoop%20&&%20!H5)/4560/artifact/hbase-archetypes/hbase-client-project/pom.xml>
to /home/jenkins/.m2/repository/org/apache/hbase/hbase-client-project/3.0.0-SNAPSHOT/hbase-client-project-3.0.0-SNAPSHOT.pom
[INFO] Installing <https://builds.apache.org/job/HBase-Trunk_matrix/jdk=JDK%201.8%20(latest),label=(Hadoop%20&&%20!H5)/ws/hbase-archetypes/hbase-client-project/target/hbase-client-project-3.0.0-SNAPSHOT-tests.jar>
to /home/jenkins/.m2/repository/org/apache/hbase/hbase-client-project/3.0.0-SNAPSHOT/hbase-client-project-3.0.0-SNAPSHOT-tests.jar
[INFO]                                                                         
[INFO] ------------------------------------------------------------------------
[INFO] Building Apache HBase - Exemplar for hbase-shaded-client archetype 3.0.0-SNAPSHOT
[INFO] ------------------------------------------------------------------------
[INFO] 
[INFO] --- build-helper-maven-plugin:3.0.0:bsh-property (negate-license-bundles-property)
@ hbase-shaded-client-project ---
[INFO] 
[INFO] --- maven-enforcer-plugin:3.0.0-M1:enforce (hadoop-profile-min-maven-min-java-banned-xerces)
@ hbase-shaded-client-project ---
[INFO] 
[INFO] --- maven-enforcer-plugin:3.0.0-M1:enforce (banned-jsr305) @ hbase-shaded-client-project
---
[INFO] 
[INFO] --- maven-enforcer-plugin:3.0.0-M1:enforce (banned-scala) @ hbase-shaded-client-project
---
[INFO] 
[INFO] --- maven-enforcer-plugin:3.0.0-M1:enforce (banned-hbase-spark) @ hbase-shaded-client-project
---
[INFO] 
[INFO] --- buildnumber-maven-plugin:1.4:create-timestamp (default) @ hbase-shaded-client-project
---
[INFO] 
[INFO] --- maven-remote-resources-plugin:1.5:process (process-resource-bundles) @ hbase-shaded-client-project
---
[INFO] 
[INFO] --- maven-resources-plugin:2.7:resources (default-resources) @ hbase-shaded-client-project
---
[INFO] Using 'UTF-8' encoding to copy filtered resources.
[INFO] Copying 1 resource
[INFO] Copying 3 resources
[INFO] 
[INFO] --- maven-enforcer-plugin:3.0.0-M1:enforce (check-aggregate-license) @ hbase-shaded-client-project
---
[INFO] Skipping Rule Enforcement.
[INFO] 
[INFO] --- maven-compiler-plugin:3.6.1:compile (default-compile) @ hbase-shaded-client-project
---
[INFO] Compiling 1 source file to <https://builds.apache.org/job/HBase-Trunk_matrix/jdk=JDK%201.8%20(latest),label=(Hadoop%20&&%20!H5)/ws/hbase-archetypes/hbase-shaded-client-project/target/classes>
[INFO] 
[INFO] --- maven-resources-plugin:2.7:testResources (default-testResources) @ hbase-shaded-client-project
---
[INFO] Using 'UTF-8' encoding to copy filtered resources.
[INFO] skip non existing resourceDirectory <https://builds.apache.org/job/HBase-Trunk_matrix/jdk=JDK%201.8%20(latest),label=(Hadoop%20&&%20!H5)/ws/hbase-archetypes/hbase-shaded-client-project/src/test/resources>
[INFO] Copying 3 resources
[INFO] 
[INFO] --- maven-compiler-plugin:3.6.1:testCompile (default-testCompile) @ hbase-shaded-client-project
---
[INFO] Nothing to compile - all classes are up to date
[INFO] 
[INFO] --- maven-surefire-plugin:2.19:test (default-test) @ hbase-shaded-client-project ---

-------------------------------------------------------
 T E S T S
-------------------------------------------------------

Results :

Tests run: 0, Failures: 0, Errors: 0, Skipped: 0

[INFO] 
[INFO] --- maven-surefire-plugin:2.19:test (secondPartTestsExecution) @ hbase-shaded-client-project
---

-------------------------------------------------------
 T E S T S
-------------------------------------------------------
Running org.apache.hbase.archetypes.exemplars.shaded_client.TestHelloHBase
Tests run: 4, Failures: 0, Errors: 0, Skipped: 0, Time elapsed: 22.307 sec - in org.apache.hbase.archetypes.exemplars.shaded_client.TestHelloHBase

Results :

Tests run: 4, Failures: 0, Errors: 0, Skipped: 0

[INFO] 
[INFO] --- maven-jar-plugin:3.0.0:test-jar (default) @ hbase-shaded-client-project ---
[INFO] Building jar: <https://builds.apache.org/job/HBase-Trunk_matrix/jdk=JDK%201.8%20(latest),label=(Hadoop%20&&%20!H5)/ws/hbase-archetypes/hbase-shaded-client-project/target/hbase-shaded-client-project-3.0.0-SNAPSHOT-tests.jar>
[INFO] 
[INFO] --- maven-jar-plugin:3.0.0:jar (default-jar) @ hbase-shaded-client-project ---
[INFO] Building jar: <https://builds.apache.org/job/HBase-Trunk_matrix/jdk=JDK%201.8%20(latest),label=(Hadoop%20&&%20!H5)/ws/hbase-archetypes/hbase-shaded-client-project/target/hbase-shaded-client-project-3.0.0-SNAPSHOT.jar>
[INFO] 
[INFO] --- maven-install-plugin:2.5.2:install (default-install) @ hbase-shaded-client-project
---
[INFO] Installing <https://builds.apache.org/job/HBase-Trunk_matrix/jdk=JDK%201.8%20(latest),label=(Hadoop%20&&%20!H5)/ws/hbase-archetypes/hbase-shaded-client-project/target/hbase-shaded-client-project-3.0.0-SNAPSHOT.jar>
to /home/jenkins/.m2/repository/org/apache/hbase/hbase-shaded-client-project/3.0.0-SNAPSHOT/hbase-shaded-client-project-3.0.0-SNAPSHOT.jar
[INFO] Installing <https://builds.apache.org/job/HBase-Trunk_matrix/jdk=JDK%201.8%20(latest),label=(Hadoop%20&&%20!H5)/4560/artifact/hbase-archetypes/hbase-shaded-client-project/pom.xml>
to /home/jenkins/.m2/repository/org/apache/hbase/hbase-shaded-client-project/3.0.0-SNAPSHOT/hbase-shaded-client-project-3.0.0-SNAPSHOT.pom
[INFO] Installing <https://builds.apache.org/job/HBase-Trunk_matrix/jdk=JDK%201.8%20(latest),label=(Hadoop%20&&%20!H5)/ws/hbase-archetypes/hbase-shaded-client-project/target/hbase-shaded-client-project-3.0.0-SNAPSHOT-tests.jar>
to /home/jenkins/.m2/repository/org/apache/hbase/hbase-shaded-client-project/3.0.0-SNAPSHOT/hbase-shaded-client-project-3.0.0-SNAPSHOT-tests.jar
[INFO]                                                                         
[INFO] ------------------------------------------------------------------------
[INFO] Building Apache HBase - Archetype builder 3.0.0-SNAPSHOT
[INFO] ------------------------------------------------------------------------
[INFO] 
[INFO] --- build-helper-maven-plugin:3.0.0:bsh-property (negate-license-bundles-property)
@ hbase-archetype-builder ---
[INFO] 
[INFO] --- maven-enforcer-plugin:3.0.0-M1:enforce (hadoop-profile-min-maven-min-java-banned-xerces)
@ hbase-archetype-builder ---
[INFO] 
[INFO] --- maven-enforcer-plugin:3.0.0-M1:enforce (banned-jsr305) @ hbase-archetype-builder
---
[INFO] 
[INFO] --- maven-enforcer-plugin:3.0.0-M1:enforce (banned-scala) @ hbase-archetype-builder
---
[INFO] 
[INFO] --- maven-enforcer-plugin:3.0.0-M1:enforce (banned-hbase-spark) @ hbase-archetype-builder
---
[INFO] 
[INFO] --- buildnumber-maven-plugin:1.4:create-timestamp (default) @ hbase-archetype-builder
---
[INFO] 
[INFO] --- maven-remote-resources-plugin:1.5:process (process-resource-bundles) @ hbase-archetype-builder
---
[INFO] 
[INFO] --- maven-resources-plugin:2.7:copy-resources (hbase-client__copy-src-to-build-archetype-subdir)
@ hbase-archetype-builder ---
[INFO] Using 'UTF-8' encoding to copy filtered resources.
[INFO] Copying 4 resources
[INFO] 
[INFO] --- maven-resources-plugin:2.7:copy-resources (hbase-client__copy-pom-to-temp-for-xslt-processing)
@ hbase-archetype-builder ---
[INFO] Using 'UTF-8' encoding to copy filtered resources.
[INFO] Copying 1 resource
[INFO] 
[INFO] --- maven-resources-plugin:2.7:copy-resources (hbase-shaded-client__copy-src-to-build-archetype-subdir)
@ hbase-archetype-builder ---
[INFO] Using 'UTF-8' encoding to copy filtered resources.
[INFO] Copying 4 resources
[INFO] 
[INFO] --- maven-resources-plugin:2.7:copy-resources (hbase-shaded-client__copy-pom-to-temp-for-xslt-processing)
@ hbase-archetype-builder ---
[INFO] Using 'UTF-8' encoding to copy filtered resources.
[INFO] Copying 1 resource
[INFO] 
[INFO] --- maven-enforcer-plugin:3.0.0-M1:enforce (check-aggregate-license) @ hbase-archetype-builder
---
[INFO] Skipping Rule Enforcement.
[INFO] 
[INFO] --- xml-maven-plugin:1.0.1:transform (modify-exemplar-pom-files-via-xslt) @ hbase-archetype-builder
---
Warning: org.apache.xerces.parsers.SAXParser: Feature 'http://javax.xml.XMLConstants/feature/secure-processing'
is not recognized.
Warning: org.apache.xerces.parsers.SAXParser: Property 'http://javax.xml.XMLConstants/property/accessExternalDTD'
is not recognized.
Warning: org.apache.xerces.parsers.SAXParser: Property 'http://www.oracle.com/xml/jaxp/properties/entityExpansionLimit'
is not recognized.
[INFO] Transforming file: <https://builds.apache.org/job/HBase-Trunk_matrix/jdk=JDK%201.8%20(latest),label=(Hadoop%20&&%20!H5)/4560/artifact/hbase-archetypes/hbase-archetype-builder/../hbase-client-project/target/temp/pom.xml>
[INFO] Transformed 1 file(s).
[INFO] Transforming file: <https://builds.apache.org/job/HBase-Trunk_matrix/jdk=JDK%201.8%20(latest),label=(Hadoop%20&&%20!H5)/4560/artifact/hbase-archetypes/hbase-archetype-builder/../hbase-shaded-client-project/target/temp/pom.xml>
[INFO] Transformed 1 file(s).
[INFO] 
[INFO] --- maven-antrun-plugin:1.8:run (make-scripts-executable) @ hbase-archetype-builder
---
[INFO] No Ant target defined - SKIPPED
[INFO] 
[INFO] --- maven-antrun-plugin:1.8:run (run-createArchetypes-script) @ hbase-archetype-builder
---
[INFO] No Ant target defined - SKIPPED
[INFO] 
[INFO] --- maven-resources-plugin:2.7:copy-resources (hbase-client-ARCHETYPE__copy-pom-to-temp-for-xslt-processing)
@ hbase-archetype-builder ---
[INFO] Using 'UTF-8' encoding to copy filtered resources.
[INFO] skip non existing resourceDirectory <https://builds.apache.org/job/HBase-Trunk_matrix/jdk=JDK%201.8%20(latest),label=(Hadoop%20&&%20!H5)/ws/hbase-archetypes/hbase-archetype-builder/../hbase-client-project/target/build-archetype/target/generated-sources/archetype>
[INFO] 
[INFO] --- maven-resources-plugin:2.7:copy-resources (hbase-shaded-client-ARCHETYPE__copy-pom-to-temp-for-xslt-processing)
@ hbase-archetype-builder ---
[INFO] Using 'UTF-8' encoding to copy filtered resources.
[INFO] skip non existing resourceDirectory <https://builds.apache.org/job/HBase-Trunk_matrix/jdk=JDK%201.8%20(latest),label=(Hadoop%20&&%20!H5)/ws/hbase-archetypes/hbase-archetype-builder/../hbase-shaded-client-project/target/build-archetype/target/generated-sources/archetype>
[INFO] 
[INFO] --- xml-maven-plugin:1.0.1:transform (modify-archetype-pom-files-via-xslt) @ hbase-archetype-builder
---
[WARNING] The directory <https://builds.apache.org/job/HBase-Trunk_matrix/jdk=JDK%201.8%20(latest),label=(Hadoop%20&&%20!H5)/ws/hbase-archetypes/hbase-archetype-builder/../hbase-client-project/target/temp-arch,>
which is a base directory of a ValidationSet or TransformationSet, does not exist.
[WARNING] No files found for transformation by stylesheet modify_archetype_pom.xsl
[WARNING] The directory <https://builds.apache.org/job/HBase-Trunk_matrix/jdk=JDK%201.8%20(latest),label=(Hadoop%20&&%20!H5)/ws/hbase-archetypes/hbase-archetype-builder/../hbase-shaded-client-project/target/temp-arch,>
which is a base directory of a ValidationSet or TransformationSet, does not exist.
[WARNING] No files found for transformation by stylesheet modify_archetype_pom.xsl
[INFO] 
[INFO] --- maven-install-plugin:2.5.2:install (default-install) @ hbase-archetype-builder
---
[INFO] Installing <https://builds.apache.org/job/HBase-Trunk_matrix/jdk=JDK%201.8%20(latest),label=(Hadoop%20&&%20!H5)/4560/artifact/hbase-archetypes/hbase-archetype-builder/pom.xml>
to /home/jenkins/.m2/repository/org/apache/hbase/hbase-archetype-builder/3.0.0-SNAPSHOT/hbase-archetype-builder-3.0.0-SNAPSHOT.pom
[INFO] 
[INFO] --- maven-antrun-plugin:1.8:run (run-installArchetypes-script) @ hbase-archetype-builder
---
[INFO] No Ant target defined - SKIPPED
[INFO] ------------------------------------------------------------------------
[INFO] Reactor Summary:
[INFO] 
[INFO] Apache HBase ...................................... SUCCESS [2.200s]
[INFO] Apache HBase - Checkstyle ......................... SUCCESS [0.599s]
[INFO] Apache HBase - Build Support ...................... SUCCESS [0.081s]
[INFO] Apache HBase - Error Prone Rules .................. SUCCESS [0.229s]
[INFO] Apache HBase - Annotations ........................ SUCCESS [0.596s]
[INFO] Apache HBase - Build Configuration ................ SUCCESS [0.079s]
[INFO] Apache HBase - Shaded Protocol .................... SUCCESS [24.901s]
[INFO] Apache HBase - Common ............................. SUCCESS [2:16.948s]
[INFO] Apache HBase - Metrics API ........................ SUCCESS [2.304s]
[INFO] Apache HBase - Hadoop Compatibility ............... SUCCESS [14.089s]
[INFO] Apache HBase - Metrics Implementation ............. SUCCESS [10.253s]
[INFO] Apache HBase - Hadoop Two Compatibility ........... SUCCESS [17.893s]
[INFO] Apache HBase - Protocol ........................... SUCCESS [7.381s]
[INFO] Apache HBase - Client ............................. SUCCESS [3:00.637s]
[INFO] Apache HBase - Zookeeper .......................... SUCCESS [29.797s]
[INFO] Apache HBase - Replication ........................ SUCCESS [15.071s]
[INFO] Apache HBase - Resource Bundle .................... SUCCESS [0.156s]
[INFO] Apache HBase - HTTP ............................... SUCCESS [33.178s]
[INFO] Apache HBase - Procedure .......................... SUCCESS [2:34.651s]
[INFO] Apache HBase - Server ............................. SUCCESS [2:27:02.621s]
[INFO] Apache HBase - MapReduce .......................... SUCCESS [14:57.426s]
[INFO] Apache HBase - Testing Util ....................... SUCCESS [2.564s]
[INFO] Apache HBase - Thrift ............................. SUCCESS [2:00.832s]
[INFO] Apache HBase - RSGroup ............................ SUCCESS [4:35.217s]
[INFO] Apache HBase - Shell .............................. FAILURE [10:09.721s]
[INFO] Apache HBase - Coprocessor Endpoint ............... SUCCESS [3:49.290s]
[INFO] Apache HBase - Backup ............................. SUCCESS [16:10.348s]
[INFO] Apache HBase - Integration Tests .................. SUCCESS [31.601s]
[INFO] Apache HBase - Examples ........................... SUCCESS [1:13.090s]
[INFO] Apache HBase - Rest ............................... SUCCESS [4:28.153s]
[INFO] Apache HBase - External Block Cache ............... SUCCESS [2.049s]
[INFO] Apache HBase - Spark .............................. SUCCESS [3:56.582s]
[INFO] Apache HBase - Spark Integration Tests ............ SUCCESS [2.830s]
[INFO] Apache HBase - Assembly ........................... SKIPPED
[INFO] Apache HBase - Shaded ............................. SUCCESS [0.199s]
[INFO] Apache HBase - Shaded - Client .................... SUCCESS [1.123s]
[INFO] Apache HBase - Shaded - MapReduce ................. SUCCESS [1.712s]
[INFO] Apache HBase Shaded Packaging Invariants .......... SUCCESS [1.728s]
[INFO] Apache HBase - Archetypes ......................... SUCCESS [0.040s]
[INFO] Apache HBase - Exemplar for hbase-client archetype  SUCCESS [41.763s]
[INFO] Apache HBase - Exemplar for hbase-shaded-client archetype  SUCCESS [42.627s]
[INFO] Apache HBase - Archetype builder .................. SUCCESS [0.389s]
[INFO] ------------------------------------------------------------------------
[INFO] BUILD FAILURE
[INFO] ------------------------------------------------------------------------
[INFO] Total time: 3:41:04.423s
[INFO] Finished at: Sat Feb 10 13:28:11 UTC 2018
[INFO] Final Memory: 220M/6581M
[INFO] ------------------------------------------------------------------------
[ERROR] Failed to execute goal org.apache.maven.plugins:maven-surefire-plugin:2.20.1:test
(secondPartTestsExecution) on project hbase-shell: There are test failures.
[ERROR] 
[ERROR] Please refer to <https://builds.apache.org/job/HBase-Trunk_matrix/jdk=JDK%201.8%20(latest),label=(Hadoop%20&&%20!H5)/ws/hbase-shell/target/surefire-reports>
for the individual test results.
[ERROR] Please refer to dump files (if any exist) [date]-jvmRun[N].dump, [date].dumpstream
and [date]-jvmRun[N].dumpstream.
[ERROR] -> [Help 1]
[ERROR] 
[ERROR] To see the full stack trace of the errors, re-run Maven with the -e switch.
[ERROR] Re-run Maven using the -X switch to enable full debug logging.
[ERROR] 
[ERROR] For more information about the errors and possible solutions, please read the following
articles:
[ERROR] [Help 1] http://cwiki.apache.org/confluence/display/MAVEN/MojoFailureException
[ERROR] 
[ERROR] After correcting the problems, you can resume the build with the command
[ERROR]   mvn <goals> -rf :hbase-shell
Build step 'Invoke top-level Maven targets' marked build as failure
Performing Post build task...
Match found for :.* : True
Logical operation result is TRUE
Running script  : # Run zombie detector script
./dev-support/zombie-detector.sh --jenkins ${BUILD_ID}
[11c72c70] $ /bin/bash -xe /tmp/jenkins2824688803668649841.sh
+ ./dev-support/zombie-detector.sh --jenkins 4560
Sat Feb 10 13:28:14 UTC 2018 We're ok: there is no zombie test


    {color:green}+1 zombies{color}. No zombie tests found running at the end of the build.
POST BUILD TASK : SUCCESS
END OF POST BUILD TASK : 0
Archiving artifacts
Recording test results
[FINDBUGS] Skipping publisher since build result is FAILURE
[CHECKSTYLE] Skipping publisher since build result is FAILURE

Mime
View raw message