hbase-builds mailing list archives

Site index · List index
Message view « Date » · « Thread »
Top « Date » · « Thread »
From Apache Jenkins Server <jenk...@builds.apache.org>
Subject Build failed in Jenkins: HBase-Trunk_matrix » JDK 1.8 (latest),(Hadoop && !H5) #4526
Date Sun, 04 Feb 2018 20:24:33 GMT
See <https://builds.apache.org/job/HBase-Trunk_matrix/jdk=JDK%201.8%20(latest),label=(Hadoop%20&&%20!H5)/4526/display/redirect>

------------------------------------------
[...truncated 1.39 MB...]
[INFO] 
[INFO] --- maven-enforcer-plugin:3.0.0-M1:enforce (hadoop-profile-min-maven-min-java-banned-xerces)
@ hbase-shaded-client ---
[INFO] 
[INFO] --- maven-enforcer-plugin:3.0.0-M1:enforce (banned-jsr305) @ hbase-shaded-client ---
[INFO] 
[INFO] --- maven-enforcer-plugin:3.0.0-M1:enforce (banned-scala) @ hbase-shaded-client ---
[INFO] 
[INFO] --- maven-enforcer-plugin:3.0.0-M1:enforce (banned-hbase-spark) @ hbase-shaded-client
---
[INFO] 
[INFO] --- buildnumber-maven-plugin:1.4:create-timestamp (default) @ hbase-shaded-client ---
[INFO] 
[INFO] --- maven-remote-resources-plugin:1.5:process (process-resource-bundles) @ hbase-shaded-client
---
[INFO] 
[INFO] --- maven-remote-resources-plugin:1.5:process (aggregate-licenses) @ hbase-shaded-client
---
[INFO] 
[INFO] --- maven-resources-plugin:2.7:resources (default-resources) @ hbase-shaded-client
---
[INFO] Using 'UTF-8' encoding to copy filtered resources.
[INFO] skip non existing resourceDirectory <https://builds.apache.org/job/HBase-Trunk_matrix/jdk=JDK%201.8%20(latest),label=(Hadoop%20&&%20!H5)/ws/hbase-shaded/hbase-shaded-client/src/main/resources>
[INFO] Copying 3 resources
[INFO] Copying 3 resources
[INFO] 
[INFO] --- maven-enforcer-plugin:3.0.0-M1:enforce (check-aggregate-license) @ hbase-shaded-client
---
[INFO] 
[INFO] --- maven-compiler-plugin:3.6.1:compile (default-compile) @ hbase-shaded-client ---
[INFO] No sources to compile
[INFO] 
[INFO] --- maven-resources-plugin:2.7:testResources (default-testResources) @ hbase-shaded-client
---
[INFO] Not copying test resources
[INFO] 
[INFO] --- maven-compiler-plugin:3.6.1:testCompile (default-testCompile) @ hbase-shaded-client
---
[INFO] Not compiling test sources
[INFO] 
[INFO] --- maven-surefire-plugin:2.20.1:test (default-test) @ hbase-shaded-client ---
[INFO] No tests to run.
[INFO] 
[INFO] --- maven-surefire-plugin:2.20.1:test (secondPartTestsExecution) @ hbase-shaded-client
---
[INFO] No tests to run.
[INFO] 
[INFO] --- maven-jar-plugin:3.0.0:test-jar (default) @ hbase-shaded-client ---
[INFO] Skipping packaging of the test-jar
[INFO] 
[INFO] --- maven-jar-plugin:3.0.0:jar (default-jar) @ hbase-shaded-client ---
[INFO] Building jar: <https://builds.apache.org/job/HBase-Trunk_matrix/jdk=JDK%201.8%20(latest),label=(Hadoop%20&&%20!H5)/ws/hbase-shaded/hbase-shaded-client/target/hbase-shaded-client-3.0.0-SNAPSHOT.jar>
[INFO] 
[INFO] --- maven-install-plugin:2.5.2:install (default-install) @ hbase-shaded-client ---
[INFO] Installing <https://builds.apache.org/job/HBase-Trunk_matrix/jdk=JDK%201.8%20(latest),label=(Hadoop%20&&%20!H5)/ws/hbase-shaded/hbase-shaded-client/target/hbase-shaded-client-3.0.0-SNAPSHOT.jar>
to /home/jenkins/.m2/repository/org/apache/hbase/hbase-shaded-client/3.0.0-SNAPSHOT/hbase-shaded-client-3.0.0-SNAPSHOT.jar
[INFO] Installing <https://builds.apache.org/job/HBase-Trunk_matrix/jdk=JDK%201.8%20(latest),label=(Hadoop%20&&%20!H5)/4526/artifact/hbase-shaded/hbase-shaded-client/pom.xml>
to /home/jenkins/.m2/repository/org/apache/hbase/hbase-shaded-client/3.0.0-SNAPSHOT/hbase-shaded-client-3.0.0-SNAPSHOT.pom
[INFO]                                                                         
[INFO] ------------------------------------------------------------------------
[INFO] Skipping Apache HBase - Shaded - MapReduce
[INFO] This project has been banned from the build due to previous failures.
[INFO] ------------------------------------------------------------------------
[INFO]                                                                         
[INFO] ------------------------------------------------------------------------
[INFO] Skipping Apache HBase Shaded Packaging Invariants
[INFO] This project has been banned from the build due to previous failures.
[INFO] ------------------------------------------------------------------------
[INFO]                                                                         
[INFO] ------------------------------------------------------------------------
[INFO] Building Apache HBase - Archetypes 3.0.0-SNAPSHOT
[INFO] ------------------------------------------------------------------------
[INFO] 
[INFO] --- build-helper-maven-plugin:3.0.0:bsh-property (negate-license-bundles-property)
@ hbase-archetypes ---
[INFO] 
[INFO] --- maven-enforcer-plugin:3.0.0-M1:enforce (hadoop-profile-min-maven-min-java-banned-xerces)
@ hbase-archetypes ---
[INFO] 
[INFO] --- maven-enforcer-plugin:3.0.0-M1:enforce (banned-jsr305) @ hbase-archetypes ---
[INFO] 
[INFO] --- maven-enforcer-plugin:3.0.0-M1:enforce (banned-scala) @ hbase-archetypes ---
[INFO] 
[INFO] --- maven-enforcer-plugin:3.0.0-M1:enforce (banned-hbase-spark) @ hbase-archetypes
---
[INFO] 
[INFO] --- buildnumber-maven-plugin:1.4:create-timestamp (default) @ hbase-archetypes ---
[INFO] 
[INFO] --- maven-remote-resources-plugin:1.5:process (process-resource-bundles) @ hbase-archetypes
---
[INFO] 
[INFO] --- maven-enforcer-plugin:3.0.0-M1:enforce (check-aggregate-license) @ hbase-archetypes
---
[INFO] Skipping Rule Enforcement.
[INFO] 
[INFO] --- findbugs-maven-plugin:3.0.0:findbugs (default) @ hbase-archetypes ---
[INFO] 
[INFO] --- maven-install-plugin:2.5.2:install (default-install) @ hbase-archetypes ---
[INFO] Installing <https://builds.apache.org/job/HBase-Trunk_matrix/jdk=JDK%201.8%20(latest),label=(Hadoop%20&&%20!H5)/4526/artifact/hbase-archetypes/pom.xml>
to /home/jenkins/.m2/repository/org/apache/hbase/hbase-archetypes/3.0.0-SNAPSHOT/hbase-archetypes-3.0.0-SNAPSHOT.pom
[INFO]                                                                         
[INFO] ------------------------------------------------------------------------
[INFO] Skipping Apache HBase - Exemplar for hbase-client archetype
[INFO] This project has been banned from the build due to previous failures.
[INFO] ------------------------------------------------------------------------
[INFO]                                                                         
[INFO] ------------------------------------------------------------------------
[INFO] Skipping Apache HBase - Exemplar for hbase-shaded-client archetype
[INFO] This project has been banned from the build due to previous failures.
[INFO] ------------------------------------------------------------------------
[INFO]                                                                         
[INFO] ------------------------------------------------------------------------
[INFO] Building Apache HBase - Archetype builder 3.0.0-SNAPSHOT
[INFO] ------------------------------------------------------------------------
[INFO] 
[INFO] --- build-helper-maven-plugin:3.0.0:bsh-property (negate-license-bundles-property)
@ hbase-archetype-builder ---
[INFO] 
[INFO] --- maven-enforcer-plugin:3.0.0-M1:enforce (hadoop-profile-min-maven-min-java-banned-xerces)
@ hbase-archetype-builder ---
[INFO] 
[INFO] --- maven-enforcer-plugin:3.0.0-M1:enforce (banned-jsr305) @ hbase-archetype-builder
---
[INFO] 
[INFO] --- maven-enforcer-plugin:3.0.0-M1:enforce (banned-scala) @ hbase-archetype-builder
---
[INFO] 
[INFO] --- maven-enforcer-plugin:3.0.0-M1:enforce (banned-hbase-spark) @ hbase-archetype-builder
---
[INFO] 
[INFO] --- buildnumber-maven-plugin:1.4:create-timestamp (default) @ hbase-archetype-builder
---
[INFO] 
[INFO] --- maven-remote-resources-plugin:1.5:process (process-resource-bundles) @ hbase-archetype-builder
---
[INFO] 
[INFO] --- maven-resources-plugin:2.7:copy-resources (hbase-client__copy-src-to-build-archetype-subdir)
@ hbase-archetype-builder ---
[INFO] Using 'UTF-8' encoding to copy filtered resources.
[INFO] Copying 4 resources
[INFO] 
[INFO] --- maven-resources-plugin:2.7:copy-resources (hbase-client__copy-pom-to-temp-for-xslt-processing)
@ hbase-archetype-builder ---
[INFO] Using 'UTF-8' encoding to copy filtered resources.
[INFO] Copying 1 resource
[INFO] 
[INFO] --- maven-resources-plugin:2.7:copy-resources (hbase-shaded-client__copy-src-to-build-archetype-subdir)
@ hbase-archetype-builder ---
[INFO] Using 'UTF-8' encoding to copy filtered resources.
[INFO] Copying 4 resources
[INFO] 
[INFO] --- maven-resources-plugin:2.7:copy-resources (hbase-shaded-client__copy-pom-to-temp-for-xslt-processing)
@ hbase-archetype-builder ---
[INFO] Using 'UTF-8' encoding to copy filtered resources.
[INFO] Copying 1 resource
[INFO] 
[INFO] --- maven-enforcer-plugin:3.0.0-M1:enforce (check-aggregate-license) @ hbase-archetype-builder
---
[INFO] Skipping Rule Enforcement.
[INFO] 
[INFO] --- xml-maven-plugin:1.0.1:transform (modify-exemplar-pom-files-via-xslt) @ hbase-archetype-builder
---
Warning: org.apache.xerces.parsers.SAXParser: Feature 'http://javax.xml.XMLConstants/feature/secure-processing'
is not recognized.
Warning: org.apache.xerces.parsers.SAXParser: Property 'http://javax.xml.XMLConstants/property/accessExternalDTD'
is not recognized.
Warning: org.apache.xerces.parsers.SAXParser: Property 'http://www.oracle.com/xml/jaxp/properties/entityExpansionLimit'
is not recognized.
[INFO] Transforming file: <https://builds.apache.org/job/HBase-Trunk_matrix/jdk=JDK%201.8%20(latest),label=(Hadoop%20&&%20!H5)/4526/artifact/hbase-archetypes/hbase-archetype-builder/../hbase-client-project/target/temp/pom.xml>
[INFO] Transformed 1 file(s).
[INFO] Transforming file: <https://builds.apache.org/job/HBase-Trunk_matrix/jdk=JDK%201.8%20(latest),label=(Hadoop%20&&%20!H5)/4526/artifact/hbase-archetypes/hbase-archetype-builder/../hbase-shaded-client-project/target/temp/pom.xml>
[INFO] Transformed 1 file(s).
[INFO] 
[INFO] --- maven-antrun-plugin:1.8:run (make-scripts-executable) @ hbase-archetype-builder
---
[INFO] No Ant target defined - SKIPPED
[INFO] 
[INFO] --- maven-antrun-plugin:1.8:run (run-createArchetypes-script) @ hbase-archetype-builder
---
[INFO] No Ant target defined - SKIPPED
[INFO] 
[INFO] --- maven-resources-plugin:2.7:copy-resources (hbase-client-ARCHETYPE__copy-pom-to-temp-for-xslt-processing)
@ hbase-archetype-builder ---
[INFO] Using 'UTF-8' encoding to copy filtered resources.
[INFO] skip non existing resourceDirectory <https://builds.apache.org/job/HBase-Trunk_matrix/jdk=JDK%201.8%20(latest),label=(Hadoop%20&&%20!H5)/ws/hbase-archetypes/hbase-archetype-builder/../hbase-client-project/target/build-archetype/target/generated-sources/archetype>
[INFO] 
[INFO] --- maven-resources-plugin:2.7:copy-resources (hbase-shaded-client-ARCHETYPE__copy-pom-to-temp-for-xslt-processing)
@ hbase-archetype-builder ---
[INFO] Using 'UTF-8' encoding to copy filtered resources.
[INFO] skip non existing resourceDirectory <https://builds.apache.org/job/HBase-Trunk_matrix/jdk=JDK%201.8%20(latest),label=(Hadoop%20&&%20!H5)/ws/hbase-archetypes/hbase-archetype-builder/../hbase-shaded-client-project/target/build-archetype/target/generated-sources/archetype>
[INFO] 
[INFO] --- xml-maven-plugin:1.0.1:transform (modify-archetype-pom-files-via-xslt) @ hbase-archetype-builder
---
[WARNING] The directory <https://builds.apache.org/job/HBase-Trunk_matrix/jdk=JDK%201.8%20(latest),label=(Hadoop%20&&%20!H5)/ws/hbase-archetypes/hbase-archetype-builder/../hbase-client-project/target/temp-arch,>
which is a base directory of a ValidationSet or TransformationSet, does not exist.
[WARNING] No files found for transformation by stylesheet modify_archetype_pom.xsl
[WARNING] The directory <https://builds.apache.org/job/HBase-Trunk_matrix/jdk=JDK%201.8%20(latest),label=(Hadoop%20&&%20!H5)/ws/hbase-archetypes/hbase-archetype-builder/../hbase-shaded-client-project/target/temp-arch,>
which is a base directory of a ValidationSet or TransformationSet, does not exist.
[WARNING] No files found for transformation by stylesheet modify_archetype_pom.xsl
[INFO] 
[INFO] --- maven-install-plugin:2.5.2:install (default-install) @ hbase-archetype-builder
---
[INFO] Installing <https://builds.apache.org/job/HBase-Trunk_matrix/jdk=JDK%201.8%20(latest),label=(Hadoop%20&&%20!H5)/4526/artifact/hbase-archetypes/hbase-archetype-builder/pom.xml>
to /home/jenkins/.m2/repository/org/apache/hbase/hbase-archetype-builder/3.0.0-SNAPSHOT/hbase-archetype-builder-3.0.0-SNAPSHOT.pom
[INFO] 
[INFO] --- maven-antrun-plugin:1.8:run (run-installArchetypes-script) @ hbase-archetype-builder
---
[INFO] No Ant target defined - SKIPPED
[INFO] ------------------------------------------------------------------------
[INFO] Reactor Summary:
[INFO] 
[INFO] Apache HBase ...................................... SUCCESS [2.001s]
[INFO] Apache HBase - Checkstyle ......................... SUCCESS [0.533s]
[INFO] Apache HBase - Build Support ...................... SUCCESS [0.076s]
[INFO] Apache HBase - Error Prone Rules .................. SUCCESS [0.197s]
[INFO] Apache HBase - Annotations ........................ SUCCESS [0.433s]
[INFO] Apache HBase - Build Configuration ................ SUCCESS [0.071s]
[INFO] Apache HBase - Shaded Protocol .................... SUCCESS [23.462s]
[INFO] Apache HBase - Common ............................. SUCCESS [2:24.319s]
[INFO] Apache HBase - Metrics API ........................ SUCCESS [2.187s]
[INFO] Apache HBase - Hadoop Compatibility ............... SUCCESS [14.616s]
[INFO] Apache HBase - Metrics Implementation ............. SUCCESS [9.456s]
[INFO] Apache HBase - Hadoop Two Compatibility ........... SUCCESS [18.196s]
[INFO] Apache HBase - Protocol ........................... SUCCESS [6.512s]
[INFO] Apache HBase - Client ............................. SUCCESS [2:47.708s]
[INFO] Apache HBase - Zookeeper .......................... SUCCESS [29.709s]
[INFO] Apache HBase - Replication ........................ SUCCESS [8.432s]
[INFO] Apache HBase - Resource Bundle .................... SUCCESS [0.154s]
[INFO] Apache HBase - HTTP ............................... SUCCESS [36.248s]
[INFO] Apache HBase - Procedure .......................... SUCCESS [2:26.043s]
[INFO] Apache HBase - Server ............................. FAILURE [2:25:38.082s]
[INFO] Apache HBase - MapReduce .......................... SKIPPED
[INFO] Apache HBase - Testing Util ....................... SKIPPED
[INFO] Apache HBase - Thrift ............................. SKIPPED
[INFO] Apache HBase - RSGroup ............................ SKIPPED
[INFO] Apache HBase - Shell .............................. SKIPPED
[INFO] Apache HBase - Coprocessor Endpoint ............... SKIPPED
[INFO] Apache HBase - Backup ............................. SKIPPED
[INFO] Apache HBase - Integration Tests .................. SKIPPED
[INFO] Apache HBase - Examples ........................... SKIPPED
[INFO] Apache HBase - Rest ............................... SKIPPED
[INFO] Apache HBase - External Block Cache ............... SKIPPED
[INFO] Apache HBase - Spark .............................. SKIPPED
[INFO] Apache HBase - Spark Integration Tests ............ SKIPPED
[INFO] Apache HBase - Assembly ........................... SKIPPED
[INFO] Apache HBase - Shaded ............................. SUCCESS [0.227s]
[INFO] Apache HBase - Shaded - Client .................... SUCCESS [1.068s]
[INFO] Apache HBase - Shaded - MapReduce ................. SKIPPED
[INFO] Apache HBase Shaded Packaging Invariants .......... SKIPPED
[INFO] Apache HBase - Archetypes ......................... SUCCESS [0.045s]
[INFO] Apache HBase - Exemplar for hbase-client archetype  SKIPPED
[INFO] Apache HBase - Exemplar for hbase-shaded-client archetype  SKIPPED
[INFO] Apache HBase - Archetype builder .................. SUCCESS [0.386s]
[INFO] ------------------------------------------------------------------------
[INFO] BUILD FAILURE
[INFO] ------------------------------------------------------------------------
[INFO] Total time: 2:35:51.595s
[INFO] Finished at: Sun Feb 04 20:20:36 UTC 2018
[INFO] Final Memory: 103M/5543M
[INFO] ------------------------------------------------------------------------
[ERROR] Failed to execute goal org.apache.maven.plugins:maven-surefire-plugin:2.20.1:test
(secondPartTestsExecution) on project hbase-server: There are test failures.
[ERROR] 
[ERROR] Please refer to <https://builds.apache.org/job/HBase-Trunk_matrix/jdk=JDK%201.8%20(latest),label=(Hadoop%20&&%20!H5)/ws/hbase-server/target/surefire-reports>
for the individual test results.
[ERROR] Please refer to dump files (if any exist) [date]-jvmRun[N].dump, [date].dumpstream
and [date]-jvmRun[N].dumpstream.
[ERROR] -> [Help 1]
[ERROR] 
[ERROR] To see the full stack trace of the errors, re-run Maven with the -e switch.
[ERROR] Re-run Maven using the -X switch to enable full debug logging.
[ERROR] 
[ERROR] For more information about the errors and possible solutions, please read the following
articles:
[ERROR] [Help 1] http://cwiki.apache.org/confluence/display/MAVEN/MojoFailureException
[ERROR] 
[ERROR] After correcting the problems, you can resume the build with the command
[ERROR]   mvn <goals> -rf :hbase-server
Build step 'Invoke top-level Maven targets' marked build as failure
Performing Post build task...
Match found for :.* : True
Logical operation result is TRUE
Running script  : # Run zombie detector script
./dev-support/zombie-detector.sh --jenkins ${BUILD_ID}
[11c72c70] $ /bin/bash -xe /tmp/jenkins3646357897111977159.sh
+ ./dev-support/zombie-detector.sh --jenkins 4526
Sun Feb  4 20:20:38 UTC 2018 We're ok: there is no zombie test


    {color:green}+1 zombies{color}. No zombie tests found running at the end of the build.
POST BUILD TASK : SUCCESS
END OF POST BUILD TASK : 0
Archiving artifacts
Recording test results
[FINDBUGS] Skipping publisher since build result is FAILURE
[CHECKSTYLE] Skipping publisher since build result is FAILURE

Mime
View raw message