hbase-builds mailing list archives

Site index · List index
Message view « Date » · « Thread »
Top « Date » · « Thread »
From Apache Jenkins Server <jenk...@builds.apache.org>
Subject Build failed in Jenkins: HBase-1.3-IT » IntegrationTestAcidGuarantees,JDK 1.8 (latest),Hadoop #529
Date Wed, 13 Mar 2019 02:41:12 GMT
See <https://builds.apache.org/job/HBase-1.3-IT/it.test=IntegrationTestAcidGuarantees,jdk=JDK%201.8%20(latest),label=Hadoop/529/display/redirect?page=changes>

Changes:

[achouhan] HBASE-22045 Mutable range histogram reports incorrect outliers

------------------------------------------
[...truncated 112.16 KB...]
[INFO] 
[INFO] --- maven-enforcer-plugin:3.0.0-M1:enforce (hadoop-profile-min-maven-min-java-banned-xerces)
@ hbase-hadoop-compat ---
[INFO] 
[INFO] --- maven-enforcer-plugin:3.0.0-M1:enforce (banned-jsr305) @ hbase-hadoop-compat ---
[INFO] 
[INFO] --- buildnumber-maven-plugin:1.3:create-timestamp (default) @ hbase-hadoop-compat ---
[INFO] 
[INFO] --- maven-remote-resources-plugin:1.5:process (default) @ hbase-hadoop-compat ---
[INFO] 
[INFO] --- maven-resources-plugin:2.6:resources (default-resources) @ hbase-hadoop-compat
---
[INFO] Using 'UTF-8' encoding to copy filtered resources.
[INFO] skip non existing resourceDirectory <https://builds.apache.org/job/HBase-1.3-IT/it.test=IntegrationTestAcidGuarantees,jdk=JDK%201.8%20(latest),label=Hadoop/ws/hbase-hadoop-compat/src/main/resources>
[INFO] Copying 3 resources
[INFO] 
[INFO] --- maven-enforcer-plugin:3.0.0-M1:enforce (check-aggregate-license) @ hbase-hadoop-compat
---
[INFO] Skipping Rule Enforcement.
[INFO] 
[INFO] --- maven-compiler-plugin:2.5.1:compile (default-compile) @ hbase-hadoop-compat ---
[INFO] Compiling 39 source files to <https://builds.apache.org/job/HBase-1.3-IT/it.test=IntegrationTestAcidGuarantees,jdk=JDK%201.8%20(latest),label=Hadoop/ws/hbase-hadoop-compat/target/classes>
[INFO] 
[INFO] --- maven-resources-plugin:2.6:testResources (default-testResources) @ hbase-hadoop-compat
---
[INFO] Using 'UTF-8' encoding to copy filtered resources.
[INFO] Copying 1 resource
[INFO] Copying 3 resources
[INFO] 
[INFO] --- maven-compiler-plugin:2.5.1:testCompile (default-testCompile) @ hbase-hadoop-compat
---
[INFO] Compiling 11 source files to <https://builds.apache.org/job/HBase-1.3-IT/it.test=IntegrationTestAcidGuarantees,jdk=JDK%201.8%20(latest),label=Hadoop/ws/hbase-hadoop-compat/target/test-classes>
[INFO] 
[INFO] --- maven-surefire-plugin:2.20.1:test (default-test) @ hbase-hadoop-compat ---
[INFO] 
[INFO] --- maven-surefire-plugin:2.20.1:test (secondPartTestsExecution) @ hbase-hadoop-compat
---
[INFO] Tests are skipped.
[INFO] 
[INFO] --- maven-source-plugin:2.2.1:jar-no-fork (attach-sources) @ hbase-hadoop-compat ---
[INFO] Building jar: <https://builds.apache.org/job/HBase-1.3-IT/it.test=IntegrationTestAcidGuarantees,jdk=JDK%201.8%20(latest),label=Hadoop/ws/hbase-hadoop-compat/target/hbase-hadoop-compat-1.3.4-SNAPSHOT-sources.jar>
[INFO] 
[INFO] --- maven-jar-plugin:2.4:test-jar (default) @ hbase-hadoop-compat ---
[INFO] Building jar: <https://builds.apache.org/job/HBase-1.3-IT/it.test=IntegrationTestAcidGuarantees,jdk=JDK%201.8%20(latest),label=Hadoop/ws/hbase-hadoop-compat/target/hbase-hadoop-compat-1.3.4-SNAPSHOT-tests.jar>
[INFO] 
[INFO] --- maven-jar-plugin:2.4:jar (default-jar) @ hbase-hadoop-compat ---
[INFO] Building jar: <https://builds.apache.org/job/HBase-1.3-IT/it.test=IntegrationTestAcidGuarantees,jdk=JDK%201.8%20(latest),label=Hadoop/ws/hbase-hadoop-compat/target/hbase-hadoop-compat-1.3.4-SNAPSHOT.jar>
[INFO] 
[INFO] --- build-helper-maven-plugin:1.9.1:bsh-property (negate-license-bundles-property)
@ hbase-hadoop-compat ---
[INFO] 
[INFO] --- build-helper-maven-plugin:1.9.1:regex-property (create-license-file-path-property)
@ hbase-hadoop-compat ---
[INFO] No match to regex '\\' found in '<https://builds.apache.org/job/HBase-1.3-IT/it.test=IntegrationTestAcidGuarantees,jdk=JDK%201.8%20(latest),label=Hadoop/ws/hbase-hadoop-compat/target/maven-shared-archive-resources/META-INF/LICENSE'.>
The initial value '<https://builds.apache.org/job/HBase-1.3-IT/it.test=IntegrationTestAcidGuarantees,jdk=JDK%201.8%20(latest),label=Hadoop/ws/hbase-hadoop-compat/target/maven-shared-archive-resources/META-INF/LICENSE'>
is left as-is...
[INFO] 
[INFO] --- maven-enforcer-plugin:3.0.0-M1:enforce (hadoop-profile-min-maven-min-java-banned-xerces)
@ hbase-hadoop-compat ---
[INFO] 
[INFO] --- maven-enforcer-plugin:3.0.0-M1:enforce (banned-jsr305) @ hbase-hadoop-compat ---
[INFO] 
[INFO] --- buildnumber-maven-plugin:1.3:create-timestamp (default) @ hbase-hadoop-compat ---
[INFO] 
[INFO] --- maven-remote-resources-plugin:1.5:process (default) @ hbase-hadoop-compat ---
[INFO] 
[INFO] --- maven-resources-plugin:2.6:resources (default-resources) @ hbase-hadoop-compat
---
[INFO] Using 'UTF-8' encoding to copy filtered resources.
[INFO] skip non existing resourceDirectory <https://builds.apache.org/job/HBase-1.3-IT/it.test=IntegrationTestAcidGuarantees,jdk=JDK%201.8%20(latest),label=Hadoop/ws/hbase-hadoop-compat/src/main/resources>
[INFO] Copying 3 resources
[INFO] Copying 3 resources
[INFO] 
[INFO] --- maven-enforcer-plugin:3.0.0-M1:enforce (check-aggregate-license) @ hbase-hadoop-compat
---
[INFO] Skipping Rule Enforcement.
[INFO] 
[INFO] --- maven-compiler-plugin:2.5.1:compile (default-compile) @ hbase-hadoop-compat ---
[INFO] Nothing to compile - all classes are up to date
[INFO] 
[INFO] --- maven-resources-plugin:2.6:testResources (default-testResources) @ hbase-hadoop-compat
---
[INFO] Using 'UTF-8' encoding to copy filtered resources.
[INFO] Copying 1 resource
[INFO] Copying 3 resources
[INFO] Copying 3 resources
[INFO] 
[INFO] --- maven-compiler-plugin:2.5.1:testCompile (default-testCompile) @ hbase-hadoop-compat
---
[INFO] Nothing to compile - all classes are up to date
[INFO] 
[INFO] --- maven-surefire-plugin:2.20.1:test (default-test) @ hbase-hadoop-compat ---
[INFO] Skipping execution of surefire because it has already been run for this configuration
[INFO] 
[INFO] --- maven-surefire-plugin:2.20.1:test (secondPartTestsExecution) @ hbase-hadoop-compat
---
[INFO] Tests are skipped.
[INFO] 
[INFO] --- maven-source-plugin:2.2.1:jar-no-fork (attach-sources) @ hbase-hadoop-compat ---
[WARNING] Artifact org.apache.hbase:hbase-hadoop-compat:java-source:sources:1.3.4-SNAPSHOT
already attached to project, ignoring duplicate
[INFO] 
[INFO] --- maven-jar-plugin:2.4:test-jar (default) @ hbase-hadoop-compat ---
[WARNING] Artifact org.apache.hbase:hbase-hadoop-compat:test-jar:tests:1.3.4-SNAPSHOT already
attached to project, ignoring duplicate
[INFO] 
[INFO] --- maven-jar-plugin:2.4:jar (default-jar) @ hbase-hadoop-compat ---
[INFO]                                                                         
[INFO] ------------------------------------------------------------------------
[INFO] Building Apache HBase - Hadoop Two Compatibility 1.3.4-SNAPSHOT
[INFO] ------------------------------------------------------------------------
[INFO] 
[INFO] --- maven-clean-plugin:2.5:clean (default-clean) @ hbase-hadoop2-compat ---
[INFO] Deleting <https://builds.apache.org/job/HBase-1.3-IT/it.test=IntegrationTestAcidGuarantees,jdk=JDK%201.8%20(latest),label=Hadoop/ws/hbase-hadoop2-compat/target>
[INFO] 
[INFO] --- build-helper-maven-plugin:1.9.1:bsh-property (negate-license-bundles-property)
@ hbase-hadoop2-compat ---
[INFO] 
[INFO] --- build-helper-maven-plugin:1.9.1:regex-property (create-license-file-path-property)
@ hbase-hadoop2-compat ---
[INFO] No match to regex '\\' found in '<https://builds.apache.org/job/HBase-1.3-IT/it.test=IntegrationTestAcidGuarantees,jdk=JDK%201.8%20(latest),label=Hadoop/ws/hbase-hadoop2-compat/target/maven-shared-archive-resources/META-INF/LICENSE'.>
The initial value '<https://builds.apache.org/job/HBase-1.3-IT/it.test=IntegrationTestAcidGuarantees,jdk=JDK%201.8%20(latest),label=Hadoop/ws/hbase-hadoop2-compat/target/maven-shared-archive-resources/META-INF/LICENSE'>
is left as-is...
[INFO] 
[INFO] --- maven-enforcer-plugin:3.0.0-M1:enforce (hadoop-profile-min-maven-min-java-banned-xerces)
@ hbase-hadoop2-compat ---
[INFO] 
[INFO] --- maven-enforcer-plugin:3.0.0-M1:enforce (banned-jsr305) @ hbase-hadoop2-compat ---
[INFO] 
[INFO] --- buildnumber-maven-plugin:1.3:create-timestamp (default) @ hbase-hadoop2-compat
---
[INFO] 
[INFO] --- maven-remote-resources-plugin:1.5:process (default) @ hbase-hadoop2-compat ---
[INFO] 
[INFO] --- maven-resources-plugin:2.6:resources (default-resources) @ hbase-hadoop2-compat
---
[INFO] Using 'UTF-8' encoding to copy filtered resources.
[INFO] Copying 18 resources
[INFO] Copying 3 resources
[INFO] 
[INFO] --- maven-enforcer-plugin:3.0.0-M1:enforce (check-aggregate-license) @ hbase-hadoop2-compat
---
[INFO] Skipping Rule Enforcement.
[INFO] 
[INFO] --- maven-compiler-plugin:2.5.1:compile (default-compile) @ hbase-hadoop2-compat ---
[INFO] Compiling 45 source files to <https://builds.apache.org/job/HBase-1.3-IT/it.test=IntegrationTestAcidGuarantees,jdk=JDK%201.8%20(latest),label=Hadoop/ws/hbase-hadoop2-compat/target/classes>
[INFO] -------------------------------------------------------------
[ERROR] COMPILATION ERROR : 
[INFO] -------------------------------------------------------------
[ERROR] <https://builds.apache.org/job/HBase-1.3-IT/it.test=IntegrationTestAcidGuarantees,jdk=JDK%201.8%20(latest),label=Hadoop/ws/hbase-hadoop2-compat/src/main/java/org/apache/hadoop/metrics2/lib/MutableRangeHistogram.java>:[83,15]
error: cannot find symbol
[INFO] 1 error
[INFO] -------------------------------------------------------------
[INFO] ------------------------------------------------------------------------
[INFO] Reactor Summary:
[INFO] 
[INFO] Apache HBase ...................................... SUCCESS [2.564s]
[INFO] Apache HBase - Checkstyle ......................... SUCCESS [1.128s]
[INFO] Apache HBase - Resource Bundle .................... SUCCESS [0.304s]
[INFO] Apache HBase - Annotations ........................ SUCCESS [1.976s]
[INFO] Apache HBase - Protocol ........................... SUCCESS [13.123s]
[INFO] Apache HBase - Common ............................. SUCCESS [8.685s]
[INFO] Apache HBase - Procedure .......................... SUCCESS [1.566s]
[INFO] Apache HBase - Client ............................. SUCCESS [6.948s]
[INFO] Apache HBase - Hadoop Compatibility ............... SUCCESS [0.860s]
[INFO] Apache HBase - Hadoop Two Compatibility ........... FAILURE [0.727s]
[INFO] Apache HBase - Prefix Tree ........................ SKIPPED
[INFO] Apache HBase - Server ............................. SKIPPED
[INFO] Apache HBase - Testing Util ....................... SKIPPED
[INFO] Apache HBase - Thrift ............................. SKIPPED
[INFO] Apache HBase - Rest ............................... SKIPPED
[INFO] Apache HBase - Shell .............................. SKIPPED
[INFO] Apache HBase - Integration Tests .................. SKIPPED
[INFO] Apache HBase - Examples ........................... SKIPPED
[INFO] Apache HBase - External Block Cache ............... SKIPPED
[INFO] Apache HBase - Assembly ........................... SKIPPED
[INFO] Apache HBase - Shaded ............................. SKIPPED
[INFO] Apache HBase - Shaded - Client .................... SKIPPED
[INFO] Apache HBase - Shaded - Server .................... SKIPPED
[INFO] Apache HBase Shaded Packaging Invariants .......... SKIPPED
[INFO] Apache HBase - Archetypes ......................... SKIPPED
[INFO] Apache HBase - Exemplar for hbase-client archetype  SKIPPED
[INFO] Apache HBase - Exemplar for hbase-shaded-client archetype  SKIPPED
[INFO] Apache HBase - Archetype builder .................. SKIPPED
[INFO] ------------------------------------------------------------------------
[INFO] BUILD FAILURE
[INFO] ------------------------------------------------------------------------
[INFO] Total time: 39.900s
[INFO] Finished at: Wed Mar 13 02:41:06 UTC 2019
[INFO] Final Memory: 92M/2246M
[INFO] ------------------------------------------------------------------------
[ERROR] Failed to execute goal org.apache.maven.plugins:maven-compiler-plugin:2.5.1:compile
(default-compile) on project hbase-hadoop2-compat: Compilation failure
[ERROR] <https://builds.apache.org/job/HBase-1.3-IT/it.test=IntegrationTestAcidGuarantees,jdk=JDK%201.8%20(latest),label=Hadoop/ws/hbase-hadoop2-compat/src/main/java/org/apache/hadoop/metrics2/lib/MutableRangeHistogram.java>:[83,15]
error: cannot find symbol
[ERROR] -> [Help 1]
[ERROR] 
[ERROR] To see the full stack trace of the errors, re-run Maven with the -e switch.
[ERROR] Re-run Maven using the -X switch to enable full debug logging.
[ERROR] 
[ERROR] For more information about the errors and possible solutions, please read the following
articles:
[ERROR] [Help 1] http://cwiki.apache.org/confluence/display/MAVEN/MojoFailureException
[ERROR] 
[ERROR] After correcting the problems, you can resume the build with the command
[ERROR]   mvn <goals> -rf :hbase-hadoop2-compat
Build step 'Invoke top-level Maven targets' marked build as failure
Performing Post build task...
Match found for :.* : True
Logical operation result is TRUE
Running script  : # Post-build task script. TODO: Check this in and have all builds reference
check-in.
pwd && ls
# NOTE!!!! The below code has been copied and pasted from ./dev-tools/run-test.sh
# Do not change here without syncing there and vice-versa.
ZOMBIE_TESTS_COUNT=`jps -v | grep surefirebooter | grep -e '-Dhbase.test' | wc -l`
if [[ $ZOMBIE_TESTS_COUNT != 0 ]] ; then
 echo "Suspicious java process found - waiting 30s to see if there are just slow to stop"
 sleep 30
 ZOMBIE_TESTS_COUNT=`jps -v | grep surefirebooter | grep -e '-Dhbase.test' | wc -l`
 if [[ $ZOMBIE_TESTS_COUNT != 0 ]] ; then
   echo " {color:red}There appear to be $ZOMBIE_TESTS_COUNT zombie tests{color}, they should
have been killed by surefire but survived"
   jps -v | grep surefirebooter | grep -e '-Dhbase.test'
   jps -v | grep surefirebooter | grep -e '-Dhbase.test' | cut -d ' ' -f 1 | xargs -n 1 jstack
   # Exit with error
   exit 1
 else
   echo "We're ok: there is no zombie test, but some tests took some time to stop"
 fi
else
  echo "We're ok: there is no zombie test"
fi
[0407dd4a] $ /bin/bash -xe /tmp/jenkins625174929888249120.sh
+ pwd
<https://builds.apache.org/job/HBase-1.3-IT/it.test=IntegrationTestAcidGuarantees,jdk=JDK%201.8%20(latest),label=Hadoop/ws/>
+ ls
bin
CHANGES.txt
conf
dev-support
hbase-annotations
hbase-archetypes
hbase-assembly
hbase-checkstyle
hbase-client
hbase-common
hbase-examples
hbase-external-blockcache
hbase-hadoop2-compat
hbase-hadoop-compat
hbase-it
hbase-native-client
hbase-prefix-tree
hbase-procedure
hbase-protocol
hbase-resource-bundle
hbase-rest
hbase-server
hbase-shaded
hbase-shell
hbase-testing-util
hbase-thrift
LICENSE.txt
NOTICE.txt
pom.xml
README.txt
src
target
++ jps -v
++ grep surefirebooter
++ wc -l
++ grep -e -Dhbase.test
+ ZOMBIE_TESTS_COUNT=0
+ [[ 0 != 0 ]]
+ echo 'We'\''re ok: there is no zombie test'
We're ok: there is no zombie test
POST BUILD TASK : SUCCESS
END OF POST BUILD TASK : 0
Archiving artifacts
[Fast Archiver] Compressed 5.62 MB of artifacts by 99.5% relative to #528

Mime
View raw message