hbase-builds mailing list archives

Site index · List index
Message view « Date » · « Thread »
Top « Date » · « Thread »
From Apache Jenkins Server <jenk...@builds.apache.org>
Subject Build failed in Jenkins: HBase-1.2-IT » IntegrationTestAcidGuarantees,JDK 1.7 (latest),Hadoop #1220
Date Tue, 16 Apr 2019 23:31:03 GMT
See <https://builds.apache.org/job/HBase-1.2-IT/it.test=IntegrationTestAcidGuarantees,jdk=JDK%201.7%20(latest),label=Hadoop/1220/display/redirect?page=changes>

Changes:

[apurtell] HBASE-22235 OperationStatus.{SUCCESS|FAILURE|NOT_RUN} are not visible to

------------------------------------------
[...truncated 244.95 KB...]
[INFO] Copying 3 resources
[INFO] 
[INFO] --- maven-compiler-plugin:2.5.1:testCompile (default-testCompile) @ hbase-it ---
[INFO] Compiling 92 source files to <https://builds.apache.org/job/HBase-1.2-IT/it.test=IntegrationTestAcidGuarantees,jdk=JDK%201.7%20(latest),label=Hadoop/ws/hbase-it/target/test-classes>
[INFO] 
[INFO] --- maven-surefire-plugin:2.20.1:test (default-test) @ hbase-it ---
[INFO] 
[INFO] --- maven-surefire-plugin:2.20.1:test (secondPartTestsExecution) @ hbase-it ---
[INFO] Tests are skipped.
[INFO] 
[INFO] --- maven-jar-plugin:2.4:test-jar (default) @ hbase-it ---
[INFO] Building jar: <https://builds.apache.org/job/HBase-1.2-IT/it.test=IntegrationTestAcidGuarantees,jdk=JDK%201.7%20(latest),label=Hadoop/ws/hbase-it/target/hbase-it-1.2.12-tests.jar>
[INFO] 
[INFO] --- maven-jar-plugin:2.4:jar (default-jar) @ hbase-it ---
[INFO] Building jar: <https://builds.apache.org/job/HBase-1.2-IT/it.test=IntegrationTestAcidGuarantees,jdk=JDK%201.7%20(latest),label=Hadoop/ws/hbase-it/target/hbase-it-1.2.12.jar>
[INFO] 
[INFO] --- build-helper-maven-plugin:1.9.1:bsh-property (negate-license-bundles-property)
@ hbase-it ---
[INFO] 
[INFO] --- build-helper-maven-plugin:1.9.1:regex-property (create-license-file-path-property)
@ hbase-it ---
[INFO] No match to regex '\\' found in '<https://builds.apache.org/job/HBase-1.2-IT/it.test=IntegrationTestAcidGuarantees,jdk=JDK%201.7%20(latest),label=Hadoop/ws/hbase-it/target/maven-shared-archive-resources/META-INF/LICENSE'.>
The initial value '<https://builds.apache.org/job/HBase-1.2-IT/it.test=IntegrationTestAcidGuarantees,jdk=JDK%201.7%20(latest),label=Hadoop/ws/hbase-it/target/maven-shared-archive-resources/META-INF/LICENSE'>
is left as-is...
[INFO] 
[INFO] --- maven-enforcer-plugin:3.0.0-M1:enforce (hadoop-profile-min-maven-min-java-banned-xerces)
@ hbase-it ---
[INFO] 
[INFO] --- maven-enforcer-plugin:3.0.0-M1:enforce (banned-jsr305) @ hbase-it ---
[INFO] 
[INFO] --- buildnumber-maven-plugin:1.3:create-timestamp (default) @ hbase-it ---
[INFO] 
[INFO] --- maven-remote-resources-plugin:1.5:process (default) @ hbase-it ---
[INFO] 
[INFO] --- maven-resources-plugin:2.6:resources (default-resources) @ hbase-it ---
[INFO] Using 'UTF-8' encoding to copy filtered resources.
[INFO] skip non existing resourceDirectory <https://builds.apache.org/job/HBase-1.2-IT/it.test=IntegrationTestAcidGuarantees,jdk=JDK%201.7%20(latest),label=Hadoop/ws/hbase-it/src/main/resources>
[INFO] Copying 3 resources
[INFO] Copying 3 resources
[INFO] 
[INFO] --- maven-enforcer-plugin:3.0.0-M1:enforce (check-aggregate-license) @ hbase-it ---
[INFO] Skipping Rule Enforcement.
[INFO] 
[INFO] --- maven-compiler-plugin:2.5.1:compile (default-compile) @ hbase-it ---
[INFO] No sources to compile
[INFO] 
[INFO] --- maven-dependency-plugin:3.0.1:build-classpath (create-mrapp-generated-classpath)
@ hbase-it ---
[INFO] Skipped writing classpath file '<https://builds.apache.org/job/HBase-1.2-IT/it.test=IntegrationTestAcidGuarantees,jdk=JDK%201.7%20(latest),label=Hadoop/ws/hbase-it/target/test-classes/mrapp-generated-classpath'.>
 No changes found.
[INFO] 
[INFO] --- maven-resources-plugin:2.6:testResources (default-testResources) @ hbase-it ---
[INFO] Using 'UTF-8' encoding to copy filtered resources.
[INFO] Copying 14 resources
[INFO] Copying 3 resources
[INFO] Copying 3 resources
[INFO] 
[INFO] --- maven-compiler-plugin:2.5.1:testCompile (default-testCompile) @ hbase-it ---
[INFO] Nothing to compile - all classes are up to date
[INFO] 
[INFO] --- maven-surefire-plugin:2.20.1:test (default-test) @ hbase-it ---
[INFO] Skipping execution of surefire because it has already been run for this configuration
[INFO] 
[INFO] --- maven-surefire-plugin:2.20.1:test (secondPartTestsExecution) @ hbase-it ---
[INFO] Tests are skipped.
[INFO] 
[INFO] --- maven-jar-plugin:2.4:test-jar (default) @ hbase-it ---
[INFO] Building jar: <https://builds.apache.org/job/HBase-1.2-IT/it.test=IntegrationTestAcidGuarantees,jdk=JDK%201.7%20(latest),label=Hadoop/ws/hbase-it/target/hbase-it-1.2.12-tests.jar>
[WARNING] Artifact org.apache.hbase:hbase-it:test-jar:tests:1.2.12 already attached to project,
ignoring duplicate
[INFO] 
[INFO] --- maven-jar-plugin:2.4:jar (default-jar) @ hbase-it ---
[INFO] Building jar: <https://builds.apache.org/job/HBase-1.2-IT/it.test=IntegrationTestAcidGuarantees,jdk=JDK%201.7%20(latest),label=Hadoop/ws/hbase-it/target/hbase-it-1.2.12.jar>
[INFO] 
[INFO] --- maven-failsafe-plugin:2.20.1:integration-test (integration-test) @ hbase-it ---
[WARNING] The parameter forkMode is deprecated since version 2.14. Use forkCount and reuseForks
instead.
[INFO] 
[INFO] -------------------------------------------------------
[INFO]  T E S T S
[INFO] -------------------------------------------------------
[WARNING] Corrupted STDOUT by directly writing to native stream in forked JVM 1. See FAQ web
page and the dump file <https://builds.apache.org/job/HBase-1.2-IT/it.test=IntegrationTestAcidGuarantees,jdk=JDK%201.7%20(latest),label=Hadoop/1220/artifact/hbase-it/target/failsafe-reports/2019-04-16T23-29-33_858-jvmRun1.dumpstream>
[INFO] Running org.apache.hadoop.hbase.IntegrationTestAcidGuarantees
[INFO] 
[INFO] Results:
[INFO] 
[INFO] Tests run: 0, Failures: 0, Errors: 0, Skipped: 0
[INFO] 
[INFO] 
[INFO] --- maven-failsafe-plugin:2.20.1:verify (verify) @ hbase-it ---
[INFO] ------------------------------------------------------------------------
[INFO] Reactor Summary:
[INFO] 
[INFO] Apache HBase ...................................... SUCCESS [3.523s]
[INFO] Apache HBase - Checkstyle ......................... SUCCESS [2.197s]
[INFO] Apache HBase - Resource Bundle .................... SUCCESS [0.602s]
[INFO] Apache HBase - Annotations ........................ SUCCESS [3.096s]
[INFO] Apache HBase - Protocol ........................... SUCCESS [17.609s]
[INFO] Apache HBase - Common ............................. SUCCESS [10.781s]
[INFO] Apache HBase - Procedure .......................... SUCCESS [3.055s]
[INFO] Apache HBase - Client ............................. SUCCESS [6.454s]
[INFO] Apache HBase - Hadoop Compatibility ............... SUCCESS [0.565s]
[INFO] Apache HBase - Hadoop Two Compatibility ........... SUCCESS [1.972s]
[INFO] Apache HBase - Prefix Tree ........................ SUCCESS [1.837s]
[INFO] Apache HBase - Server ............................. SUCCESS [35.041s]
[INFO] Apache HBase - Testing Util ....................... SUCCESS [2.174s]
[INFO] Apache HBase - Thrift ............................. SUCCESS [6.907s]
[INFO] Apache HBase - Rest ............................... SUCCESS [4.348s]
[INFO] Apache HBase - Shell .............................. SUCCESS [1.545s]
[INFO] Apache HBase - Integration Tests .................. FAILURE [1:27.112s]
[INFO] Apache HBase - Examples ........................... SKIPPED
[INFO] Apache HBase - External Block Cache ............... SKIPPED
[INFO] Apache HBase - Assembly ........................... SKIPPED
[INFO] Apache HBase - Shaded ............................. SKIPPED
[INFO] Apache HBase - Shaded - Client .................... SKIPPED
[INFO] Apache HBase - Shaded - Server .................... SKIPPED
[INFO] Apache HBase Shaded Packaging Invariants .......... SKIPPED
[INFO] ------------------------------------------------------------------------
[INFO] BUILD FAILURE
[INFO] ------------------------------------------------------------------------
[INFO] Total time: 3:13.210s
[INFO] Finished at: Tue Apr 16 23:30:57 UTC 2019
[INFO] Final Memory: 178M/3233M
[INFO] ------------------------------------------------------------------------
[ERROR] Failed to execute goal org.apache.maven.plugins:maven-failsafe-plugin:2.20.1:verify
(verify) on project hbase-it: There are test failures.
[ERROR] 
[ERROR] Please refer to <https://builds.apache.org/job/HBase-1.2-IT/it.test=IntegrationTestAcidGuarantees,jdk=JDK%201.7%20(latest),label=Hadoop/ws/hbase-it/target/failsafe-reports>
for the individual test results.
[ERROR] Please refer to dump files (if any exist) [date]-jvmRun[N].dump, [date].dumpstream
and [date]-jvmRun[N].dumpstream.
[ERROR] org.apache.maven.surefire.booter.SurefireBooterForkException: ExecutionException The
forked VM terminated without properly saying goodbye. VM crash or System.exit called?
[ERROR] Command was /bin/sh -c cd <https://builds.apache.org/job/HBase-1.2-IT/it.test=IntegrationTestAcidGuarantees,jdk=JDK%201.7%20(latest),label=Hadoop/ws/hbase-it>
&& /usr/local/asfpackages/java/jdk1.7.0_80/jre/bin/java -enableassertions -Xmx4g -XX:MaxPermSize=512m
-Djava.security.egd=file:/dev/./urandom -XX:+CMSClassUnloadingEnabled -verbose:gc -XX:+PrintCommandLineFlags
-XX:+PrintFlagsFinal -jar <https://builds.apache.org/job/HBase-1.2-IT/it.test=IntegrationTestAcidGuarantees,jdk=JDK%201.7%20(latest),label=Hadoop/ws/hbase-it/target/surefire/surefirebooter6152018265471077172.jar>
<https://builds.apache.org/job/HBase-1.2-IT/it.test=IntegrationTestAcidGuarantees,jdk=JDK%201.7%20(latest),label=Hadoop/ws/hbase-it/target/surefire>
2019-04-16T23-29-33_858-jvmRun1 surefire6210366893663606022tmp surefire_07804440042873757987tmp
[ERROR] Error occurred in starting fork, check output in log
[ERROR] Process Exit Code: 137
[ERROR] Crashed tests:
[ERROR] org.apache.hadoop.hbase.IntegrationTestAcidGuarantees
[ERROR] at org.apache.maven.plugin.surefire.booterclient.ForkStarter.awaitResultsDone(ForkStarter.java:496)
[ERROR] at org.apache.maven.plugin.surefire.booterclient.ForkStarter.runSuitesForkPerTestSet(ForkStarter.java:443)
[ERROR] at org.apache.maven.plugin.surefire.booterclient.ForkStarter.run(ForkStarter.java:295)
[ERROR] at org.apache.maven.plugin.surefire.booterclient.ForkStarter.run(ForkStarter.java:246)
[ERROR] at org.apache.maven.plugin.surefire.AbstractSurefireMojo.executeProvider(AbstractSurefireMojo.java:1124)
[ERROR] at org.apache.maven.plugin.surefire.AbstractSurefireMojo.executeAfterPreconditionsChecked(AbstractSurefireMojo.java:954)
[ERROR] at org.apache.maven.plugin.surefire.AbstractSurefireMojo.execute(AbstractSurefireMojo.java:832)
[ERROR] at org.apache.maven.plugin.DefaultBuildPluginManager.executeMojo(DefaultBuildPluginManager.java:101)
[ERROR] at org.apache.maven.lifecycle.internal.MojoExecutor.execute(MojoExecutor.java:209)
[ERROR] at org.apache.maven.lifecycle.internal.MojoExecutor.execute(MojoExecutor.java:153)
[ERROR] at org.apache.maven.lifecycle.internal.MojoExecutor.execute(MojoExecutor.java:145)
[ERROR] at org.apache.maven.lifecycle.internal.LifecycleModuleBuilder.buildProject(LifecycleModuleBuilder.java:84)
[ERROR] at org.apache.maven.lifecycle.internal.LifecycleModuleBuilder.buildProject(LifecycleModuleBuilder.java:59)
[ERROR] at org.apache.maven.lifecycle.internal.LifecycleStarter.singleThreadedBuild(LifecycleStarter.java:183)
[ERROR] at org.apache.maven.lifecycle.internal.LifecycleStarter.execute(LifecycleStarter.java:161)
[ERROR] at org.apache.maven.DefaultMaven.doExecute(DefaultMaven.java:320)
[ERROR] at org.apache.maven.DefaultMaven.execute(DefaultMaven.java:156)
[ERROR] at org.apache.maven.cli.MavenCli.execute(MavenCli.java:537)
[ERROR] at org.apache.maven.cli.MavenCli.doMain(MavenCli.java:196)
[ERROR] at org.apache.maven.cli.MavenCli.main(MavenCli.java:141)
[ERROR] at sun.reflect.NativeMethodAccessorImpl.invoke0(Native Method)
[ERROR] at sun.reflect.NativeMethodAccessorImpl.invoke(NativeMethodAccessorImpl.java:57)
[ERROR] at sun.reflect.DelegatingMethodAccessorImpl.invoke(DelegatingMethodAccessorImpl.java:43)
[ERROR] at java.lang.reflect.Method.invoke(Method.java:606)
[ERROR] at org.codehaus.plexus.classworlds.launcher.Launcher.launchEnhanced(Launcher.java:290)
[ERROR] at org.codehaus.plexus.classworlds.launcher.Launcher.launch(Launcher.java:230)
[ERROR] at org.codehaus.plexus.classworlds.launcher.Launcher.mainWithExitCode(Launcher.java:409)
[ERROR] at org.codehaus.plexus.classworlds.launcher.Launcher.main(Launcher.java:352)
[ERROR] Caused by: org.apache.maven.surefire.booter.SurefireBooterForkException: The forked
VM terminated without properly saying goodbye. VM crash or System.exit called?
[ERROR] Command was /bin/sh -c cd <https://builds.apache.org/job/HBase-1.2-IT/it.test=IntegrationTestAcidGuarantees,jdk=JDK%201.7%20(latest),label=Hadoop/ws/hbase-it>
&& /usr/local/asfpackages/java/jdk1.7.0_80/jre/bin/java -enableassertions -Xmx4g -XX:MaxPermSize=512m
-Djava.security.egd=file:/dev/./urandom -XX:+CMSClassUnloadingEnabled -verbose:gc -XX:+PrintCommandLineFlags
-XX:+PrintFlagsFinal -jar <https://builds.apache.org/job/HBase-1.2-IT/it.test=IntegrationTestAcidGuarantees,jdk=JDK%201.7%20(latest),label=Hadoop/ws/hbase-it/target/surefire/surefirebooter6152018265471077172.jar>
<https://builds.apache.org/job/HBase-1.2-IT/it.test=IntegrationTestAcidGuarantees,jdk=JDK%201.7%20(latest),label=Hadoop/ws/hbase-it/target/surefire>
2019-04-16T23-29-33_858-jvmRun1 surefire6210366893663606022tmp surefire_07804440042873757987tmp
[ERROR] Error occurred in starting fork, check output in log
[ERROR] Process Exit Code: 137
[ERROR] Crashed tests:
[ERROR] org.apache.hadoop.hbase.IntegrationTestAcidGuarantees
[ERROR] at org.apache.maven.plugin.surefire.booterclient.ForkStarter.fork(ForkStarter.java:686)
[ERROR] at org.apache.maven.plugin.surefire.booterclient.ForkStarter.fork(ForkStarter.java:535)
[ERROR] at org.apache.maven.plugin.surefire.booterclient.ForkStarter.access$700(ForkStarter.java:116)
[ERROR] at org.apache.maven.plugin.surefire.booterclient.ForkStarter$2.call(ForkStarter.java:431)
[ERROR] at org.apache.maven.plugin.surefire.booterclient.ForkStarter$2.call(ForkStarter.java:408)
[ERROR] at java.util.concurrent.FutureTask.run(FutureTask.java:262)
[ERROR] at java.util.concurrent.ThreadPoolExecutor.runWorker(ThreadPoolExecutor.java:1145)
[ERROR] at java.util.concurrent.ThreadPoolExecutor$Worker.run(ThreadPoolExecutor.java:615)
[ERROR] at java.lang.Thread.run(Thread.java:745)
[ERROR] -> [Help 1]
[ERROR] 
[ERROR] To see the full stack trace of the errors, re-run Maven with the -e switch.
[ERROR] Re-run Maven using the -X switch to enable full debug logging.
[ERROR] 
[ERROR] For more information about the errors and possible solutions, please read the following
articles:
[ERROR] [Help 1] http://cwiki.apache.org/confluence/display/MAVEN/MojoExecutionException
[ERROR] 
[ERROR] After correcting the problems, you can resume the build with the command
[ERROR]   mvn <goals> -rf :hbase-it
Build step 'Invoke top-level Maven targets' marked build as failure
Performing Post build task...
Match found for :.* : True
Logical operation result is TRUE
Running script  : # Post-build task script. TODO: Check this in and have all builds reference
check-in.
pwd && ls
# NOTE!!!! The below code has been copied and pasted from ./dev-tools/run-test.sh
# Do not change here without syncing there and vice-versa.
ZOMBIE_TESTS_COUNT=`jps -v | grep surefirebooter | grep -e '-Dhbase.test' | wc -l`
if [[ $ZOMBIE_TESTS_COUNT != 0 ]] ; then
 echo "Suspicious java process found - waiting 30s to see if there are just slow to stop"
 sleep 30
 ZOMBIE_TESTS_COUNT=`jps -v | grep surefirebooter | grep -e '-Dhbase.test' | wc -l`
 if [[ $ZOMBIE_TESTS_COUNT != 0 ]] ; then
   echo " {color:red}There appear to be $ZOMBIE_TESTS_COUNT zombie tests{color}, they should
have been killed by surefire but survived"
   jps -v | grep surefirebooter | grep -e '-Dhbase.test'
   jps -v | grep surefirebooter | grep -e '-Dhbase.test' | cut -d ' ' -f 1 | xargs -n 1 jstack
   # Exit with error
   exit 1
 else
   echo "We're ok: there is no zombie test, but some tests took some time to stop"
 fi
else
  echo "We're ok: there is no zombie test"
fi
[468d432e] $ /bin/bash -xe /tmp/jenkins7241516213039141605.sh
+ pwd
<https://builds.apache.org/job/HBase-1.2-IT/it.test=IntegrationTestAcidGuarantees,jdk=JDK%201.7%20(latest),label=Hadoop/ws/>
+ ls
bin
CHANGES.txt
conf
dev-support
hbase-annotations
hbase-assembly
hbase-checkstyle
hbase-client
hbase-common
hbase-examples
hbase-external-blockcache
hbase-hadoop2-compat
hbase-hadoop-compat
hbase-it
hbase-native-client
hbase-prefix-tree
hbase-procedure
hbase-protocol
hbase-resource-bundle
hbase-rest
hbase-server
hbase-shaded
hbase-shell
hbase-testing-util
hbase-thrift
LICENSE.txt
NOTICE.txt
pom.xml
README.txt
src
target
++ jps -v
++ grep surefirebooter
++ grep -e -Dhbase.test
++ wc -l
+ ZOMBIE_TESTS_COUNT=0
+ [[ 0 != 0 ]]
+ echo 'We'\''re ok: there is no zombie test'
We're ok: there is no zombie test
POST BUILD TASK : SUCCESS
END OF POST BUILD TASK : 0
Archiving artifacts

Mime
View raw message