hbase-builds mailing list archives

Site index · List index
Message view « Date » · « Thread »
Top « Date » · « Thread »
From Apache Jenkins Server <jenk...@builds.apache.org>
Subject Build failed in Jenkins: HBase-1.3-IT » IntegrationTestBigLinkedList,JDK 1.8 (latest),Hadoop #556
Date Mon, 13 May 2019 22:45:41 GMT
See <https://builds.apache.org/job/HBase-1.3-IT/it.test=IntegrationTestBigLinkedList,jdk=JDK%201.8%20(latest),label=Hadoop/556/display/redirect?page=changes>

Changes:

[xucang] HBASE-22378. HBase Canary fails with TableNotFoundException when table

------------------------------------------
[...truncated 242.45 KB...]
[INFO] Building Apache HBase - Integration Tests 1.3.4
[INFO] ------------------------------------------------------------------------
[INFO] 
[INFO] --- maven-clean-plugin:2.5:clean (default-clean) @ hbase-it ---
[INFO] Deleting <https://builds.apache.org/job/HBase-1.3-IT/it.test=IntegrationTestBigLinkedList,jdk=JDK%201.8%20(latest),label=Hadoop/ws/hbase-it/target>
[INFO] 
[INFO] --- build-helper-maven-plugin:1.9.1:bsh-property (negate-license-bundles-property)
@ hbase-it ---
[INFO] 
[INFO] --- build-helper-maven-plugin:1.9.1:regex-property (create-license-file-path-property)
@ hbase-it ---
[INFO] No match to regex '\\' found in '<https://builds.apache.org/job/HBase-1.3-IT/it.test=IntegrationTestBigLinkedList,jdk=JDK%201.8%20(latest),label=Hadoop/ws/hbase-it/target/maven-shared-archive-resources/META-INF/LICENSE'.>
The initial value '<https://builds.apache.org/job/HBase-1.3-IT/it.test=IntegrationTestBigLinkedList,jdk=JDK%201.8%20(latest),label=Hadoop/ws/hbase-it/target/maven-shared-archive-resources/META-INF/LICENSE'>
is left as-is...
[INFO] 
[INFO] --- maven-enforcer-plugin:3.0.0-M1:enforce (hadoop-profile-min-maven-min-java-banned-xerces)
@ hbase-it ---
[INFO] 
[INFO] --- maven-enforcer-plugin:3.0.0-M1:enforce (banned-jsr305) @ hbase-it ---
[INFO] 
[INFO] --- buildnumber-maven-plugin:1.3:create-timestamp (default) @ hbase-it ---
[INFO] 
[INFO] --- maven-remote-resources-plugin:1.5:process (default) @ hbase-it ---
[INFO] 
[INFO] --- maven-resources-plugin:2.6:resources (default-resources) @ hbase-it ---
[INFO] Using 'UTF-8' encoding to copy filtered resources.
[INFO] skip non existing resourceDirectory <https://builds.apache.org/job/HBase-1.3-IT/it.test=IntegrationTestBigLinkedList,jdk=JDK%201.8%20(latest),label=Hadoop/ws/hbase-it/src/main/resources>
[INFO] Copying 3 resources
[INFO] 
[INFO] --- maven-enforcer-plugin:3.0.0-M1:enforce (check-aggregate-license) @ hbase-it ---
[INFO] Skipping Rule Enforcement.
[INFO] 
[INFO] --- maven-compiler-plugin:2.5.1:compile (default-compile) @ hbase-it ---
[INFO] No sources to compile
[INFO] 
[INFO] --- maven-dependency-plugin:3.0.1:build-classpath (create-mrapp-generated-classpath)
@ hbase-it ---
[INFO] Wrote classpath file '<https://builds.apache.org/job/HBase-1.3-IT/it.test=IntegrationTestBigLinkedList,jdk=JDK%201.8%20(latest),label=Hadoop/ws/hbase-it/target/test-classes/mrapp-generated-classpath'.>
[INFO] 
[INFO] --- maven-resources-plugin:2.6:testResources (default-testResources) @ hbase-it ---
[INFO] Using 'UTF-8' encoding to copy filtered resources.
[INFO] Copying 14 resources
[INFO] Copying 3 resources
[INFO] 
[INFO] --- maven-compiler-plugin:2.5.1:testCompile (default-testCompile) @ hbase-it ---
[INFO] Compiling 92 source files to <https://builds.apache.org/job/HBase-1.3-IT/it.test=IntegrationTestBigLinkedList,jdk=JDK%201.8%20(latest),label=Hadoop/ws/hbase-it/target/test-classes>
[INFO] 
[INFO] --- maven-surefire-plugin:2.20.1:test (default-test) @ hbase-it ---
[INFO] 
[INFO] --- maven-surefire-plugin:2.20.1:test (secondPartTestsExecution) @ hbase-it ---
[INFO] Tests are skipped.
[INFO] 
[INFO] --- maven-jar-plugin:2.4:test-jar (default) @ hbase-it ---
[INFO] Building jar: <https://builds.apache.org/job/HBase-1.3-IT/it.test=IntegrationTestBigLinkedList,jdk=JDK%201.8%20(latest),label=Hadoop/ws/hbase-it/target/hbase-it-1.3.4-tests.jar>
[INFO] 
[INFO] --- maven-jar-plugin:2.4:jar (default-jar) @ hbase-it ---
[INFO] Building jar: <https://builds.apache.org/job/HBase-1.3-IT/it.test=IntegrationTestBigLinkedList,jdk=JDK%201.8%20(latest),label=Hadoop/ws/hbase-it/target/hbase-it-1.3.4.jar>
[INFO] 
[INFO] --- build-helper-maven-plugin:1.9.1:bsh-property (negate-license-bundles-property)
@ hbase-it ---
[INFO] 
[INFO] --- build-helper-maven-plugin:1.9.1:regex-property (create-license-file-path-property)
@ hbase-it ---
[INFO] No match to regex '\\' found in '<https://builds.apache.org/job/HBase-1.3-IT/it.test=IntegrationTestBigLinkedList,jdk=JDK%201.8%20(latest),label=Hadoop/ws/hbase-it/target/maven-shared-archive-resources/META-INF/LICENSE'.>
The initial value '<https://builds.apache.org/job/HBase-1.3-IT/it.test=IntegrationTestBigLinkedList,jdk=JDK%201.8%20(latest),label=Hadoop/ws/hbase-it/target/maven-shared-archive-resources/META-INF/LICENSE'>
is left as-is...
[INFO] 
[INFO] --- maven-enforcer-plugin:3.0.0-M1:enforce (hadoop-profile-min-maven-min-java-banned-xerces)
@ hbase-it ---
[INFO] 
[INFO] --- maven-enforcer-plugin:3.0.0-M1:enforce (banned-jsr305) @ hbase-it ---
[INFO] 
[INFO] --- buildnumber-maven-plugin:1.3:create-timestamp (default) @ hbase-it ---
[INFO] 
[INFO] --- maven-remote-resources-plugin:1.5:process (default) @ hbase-it ---
[INFO] 
[INFO] --- maven-resources-plugin:2.6:resources (default-resources) @ hbase-it ---
[INFO] Using 'UTF-8' encoding to copy filtered resources.
[INFO] skip non existing resourceDirectory <https://builds.apache.org/job/HBase-1.3-IT/it.test=IntegrationTestBigLinkedList,jdk=JDK%201.8%20(latest),label=Hadoop/ws/hbase-it/src/main/resources>
[INFO] Copying 3 resources
[INFO] Copying 3 resources
[INFO] 
[INFO] --- maven-enforcer-plugin:3.0.0-M1:enforce (check-aggregate-license) @ hbase-it ---
[INFO] Skipping Rule Enforcement.
[INFO] 
[INFO] --- maven-compiler-plugin:2.5.1:compile (default-compile) @ hbase-it ---
[INFO] No sources to compile
[INFO] 
[INFO] --- maven-dependency-plugin:3.0.1:build-classpath (create-mrapp-generated-classpath)
@ hbase-it ---
[INFO] Skipped writing classpath file '<https://builds.apache.org/job/HBase-1.3-IT/it.test=IntegrationTestBigLinkedList,jdk=JDK%201.8%20(latest),label=Hadoop/ws/hbase-it/target/test-classes/mrapp-generated-classpath'.>
 No changes found.
[INFO] 
[INFO] --- maven-resources-plugin:2.6:testResources (default-testResources) @ hbase-it ---
[INFO] Using 'UTF-8' encoding to copy filtered resources.
[INFO] Copying 14 resources
[INFO] Copying 3 resources
[INFO] Copying 3 resources
[INFO] 
[INFO] --- maven-compiler-plugin:2.5.1:testCompile (default-testCompile) @ hbase-it ---
[INFO] Nothing to compile - all classes are up to date
[INFO] 
[INFO] --- maven-surefire-plugin:2.20.1:test (default-test) @ hbase-it ---
[INFO] Skipping execution of surefire because it has already been run for this configuration
[INFO] 
[INFO] --- maven-surefire-plugin:2.20.1:test (secondPartTestsExecution) @ hbase-it ---
[INFO] Tests are skipped.
[INFO] 
[INFO] --- maven-jar-plugin:2.4:test-jar (default) @ hbase-it ---
[INFO] Building jar: <https://builds.apache.org/job/HBase-1.3-IT/it.test=IntegrationTestBigLinkedList,jdk=JDK%201.8%20(latest),label=Hadoop/ws/hbase-it/target/hbase-it-1.3.4-tests.jar>
[WARNING] Artifact org.apache.hbase:hbase-it:test-jar:tests:1.3.4 already attached to project,
ignoring duplicate
[INFO] 
[INFO] --- maven-jar-plugin:2.4:jar (default-jar) @ hbase-it ---
[INFO] Building jar: <https://builds.apache.org/job/HBase-1.3-IT/it.test=IntegrationTestBigLinkedList,jdk=JDK%201.8%20(latest),label=Hadoop/ws/hbase-it/target/hbase-it-1.3.4.jar>
[INFO] 
[INFO] --- maven-failsafe-plugin:2.20.1:integration-test (integration-test) @ hbase-it ---
[WARNING] The parameter forkMode is deprecated since version 2.14. Use forkCount and reuseForks
instead.
[INFO] 
[INFO] -------------------------------------------------------
[INFO]  T E S T S
[INFO] -------------------------------------------------------
[WARNING] Corrupted STDOUT by directly writing to native stream in forked JVM 1. See FAQ web
page and the dump file <https://builds.apache.org/job/HBase-1.3-IT/it.test=IntegrationTestBigLinkedList,jdk=JDK%201.8%20(latest),label=Hadoop/556/artifact/hbase-it/target/failsafe-reports/2019-05-13T22-42-29_257-jvmRun1.dumpstream>
[INFO] Running org.apache.hadoop.hbase.test.IntegrationTestBigLinkedList
[ERROR] Tests run: 1, Failures: 0, Errors: 1, Skipped: 0, Time elapsed: 183.554 s <<<
FAILURE! - in org.apache.hadoop.hbase.test.IntegrationTestBigLinkedList
[ERROR] testContinuousIngest(org.apache.hadoop.hbase.test.IntegrationTestBigLinkedList)  Time
elapsed: 183.361 s  <<< ERROR!
java.lang.NullPointerException
	at org.apache.hadoop.hbase.test.IntegrationTestBigLinkedList.testContinuousIngest(IntegrationTestBigLinkedList.java:1809)

[INFO] 
[INFO] Results:
[INFO] 
[ERROR] Errors: 
[ERROR]   IntegrationTestBigLinkedList.testContinuousIngest:1809 » NullPointer
[INFO] 
[ERROR] Tests run: 1, Failures: 0, Errors: 1, Skipped: 0
[INFO] 
[INFO] 
[INFO] --- maven-failsafe-plugin:2.20.1:verify (verify) @ hbase-it ---
[INFO] ------------------------------------------------------------------------
[INFO] Reactor Summary:
[INFO] 
[INFO] Apache HBase ...................................... SUCCESS [5.396s]
[INFO] Apache HBase - Checkstyle ......................... SUCCESS [1.204s]
[INFO] Apache HBase - Resource Bundle .................... SUCCESS [0.312s]
[INFO] Apache HBase - Annotations ........................ SUCCESS [1.306s]
[INFO] Apache HBase - Protocol ........................... SUCCESS [14.996s]
[INFO] Apache HBase - Common ............................. SUCCESS [12.133s]
[INFO] Apache HBase - Procedure .......................... SUCCESS [1.728s]
[INFO] Apache HBase - Client ............................. SUCCESS [8.429s]
[INFO] Apache HBase - Hadoop Compatibility ............... SUCCESS [0.584s]
[INFO] Apache HBase - Hadoop Two Compatibility ........... SUCCESS [1.967s]
[INFO] Apache HBase - Prefix Tree ........................ SUCCESS [1.872s]
[INFO] Apache HBase - Server ............................. SUCCESS [42.943s]
[INFO] Apache HBase - Testing Util ....................... SUCCESS [2.080s]
[INFO] Apache HBase - Thrift ............................. SUCCESS [7.098s]
[INFO] Apache HBase - Rest ............................... SUCCESS [4.051s]
[INFO] Apache HBase - Shell .............................. SUCCESS [1.658s]
[INFO] Apache HBase - Integration Tests .................. FAILURE [3:09.827s]
[INFO] Apache HBase - Examples ........................... SKIPPED
[INFO] Apache HBase - External Block Cache ............... SKIPPED
[INFO] Apache HBase - Assembly ........................... SKIPPED
[INFO] Apache HBase - Shaded ............................. SKIPPED
[INFO] Apache HBase - Shaded - Client .................... SKIPPED
[INFO] Apache HBase - Shaded - Server .................... SKIPPED
[INFO] Apache HBase Shaded Packaging Invariants .......... SKIPPED
[INFO] Apache HBase - Archetypes ......................... SKIPPED
[INFO] Apache HBase - Exemplar for hbase-client archetype  SKIPPED
[INFO] Apache HBase - Exemplar for hbase-shaded-client archetype  SKIPPED
[INFO] Apache HBase - Archetype builder .................. SKIPPED
[INFO] ------------------------------------------------------------------------
[INFO] BUILD FAILURE
[INFO] ------------------------------------------------------------------------
[INFO] Total time: 4:59.985s
[INFO] Finished at: Mon May 13 22:45:34 UTC 2019
[INFO] Final Memory: 183M/3214M
[INFO] ------------------------------------------------------------------------
[ERROR] Failed to execute goal org.apache.maven.plugins:maven-failsafe-plugin:2.20.1:verify
(verify) on project hbase-it: There are test failures.
[ERROR] 
[ERROR] Please refer to <https://builds.apache.org/job/HBase-1.3-IT/it.test=IntegrationTestBigLinkedList,jdk=JDK%201.8%20(latest),label=Hadoop/ws/hbase-it/target/failsafe-reports>
for the individual test results.
[ERROR] Please refer to dump files (if any exist) [date]-jvmRun[N].dump, [date].dumpstream
and [date]-jvmRun[N].dumpstream.
[ERROR] -> [Help 1]
[ERROR] 
[ERROR] To see the full stack trace of the errors, re-run Maven with the -e switch.
[ERROR] Re-run Maven using the -X switch to enable full debug logging.
[ERROR] 
[ERROR] For more information about the errors and possible solutions, please read the following
articles:
[ERROR] [Help 1] http://cwiki.apache.org/confluence/display/MAVEN/MojoFailureException
[ERROR] 
[ERROR] After correcting the problems, you can resume the build with the command
[ERROR]   mvn <goals> -rf :hbase-it
Build step 'Invoke top-level Maven targets' marked build as failure
Performing Post build task...
Match found for :.* : True
Logical operation result is TRUE
Running script  : # Post-build task script. TODO: Check this in and have all builds reference
check-in.
pwd && ls
# NOTE!!!! The below code has been copied and pasted from ./dev-tools/run-test.sh
# Do not change here without syncing there and vice-versa.
ZOMBIE_TESTS_COUNT=`jps -v | grep surefirebooter | grep -e '-Dhbase.test' | wc -l`
if [[ $ZOMBIE_TESTS_COUNT != 0 ]] ; then
 echo "Suspicious java process found - waiting 30s to see if there are just slow to stop"
 sleep 30
 ZOMBIE_TESTS_COUNT=`jps -v | grep surefirebooter | grep -e '-Dhbase.test' | wc -l`
 if [[ $ZOMBIE_TESTS_COUNT != 0 ]] ; then
   echo " {color:red}There appear to be $ZOMBIE_TESTS_COUNT zombie tests{color}, they should
have been killed by surefire but survived"
   jps -v | grep surefirebooter | grep -e '-Dhbase.test'
   jps -v | grep surefirebooter | grep -e '-Dhbase.test' | cut -d ' ' -f 1 | xargs -n 1 jstack
   # Exit with error
   exit 1
 else
   echo "We're ok: there is no zombie test, but some tests took some time to stop"
 fi
else
  echo "We're ok: there is no zombie test"
fi
[6a208e71] $ /bin/bash -xe /tmp/jenkins9199729879623288914.sh
+ pwd
<https://builds.apache.org/job/HBase-1.3-IT/it.test=IntegrationTestBigLinkedList,jdk=JDK%201.8%20(latest),label=Hadoop/ws/>
+ ls
bin
CHANGES.txt
conf
dev-support
hbase-annotations
hbase-archetypes
hbase-assembly
hbase-checkstyle
hbase-client
hbase-common
hbase-examples
hbase-external-blockcache
hbase-hadoop2-compat
hbase-hadoop-compat
hbase-it
hbase-native-client
hbase-prefix-tree
hbase-procedure
hbase-protocol
hbase-resource-bundle
hbase-rest
hbase-server
hbase-shaded
hbase-shell
hbase-testing-util
hbase-thrift
LICENSE.txt
NOTICE.txt
pom.xml
README.txt
src
target
++ jps -v
++ grep surefirebooter
++ wc -l
++ grep -e -Dhbase.test
+ ZOMBIE_TESTS_COUNT=0
+ [[ 0 != 0 ]]
+ echo 'We'\''re ok: there is no zombie test'
We're ok: there is no zombie test
POST BUILD TASK : SUCCESS
END OF POST BUILD TASK : 0
Archiving artifacts

Mime
View raw message