hbase-builds mailing list archives

Site index · List index
Message view « Date » · « Thread »
Top « Date » · « Thread »
From Apache Jenkins Server <jenk...@builds.apache.org>
Subject Build failed in Jenkins: HBase-1.3-IT » IntegrationTestBigLinkedList,JDK 1.7 (latest),Hadoop #576
Date Wed, 05 Jun 2019 22:42:22 GMT
See <https://builds.apache.org/job/HBase-1.3-IT/it.test=IntegrationTestBigLinkedList,jdk=JDK%201.7%20(latest),label=Hadoop/576/display/redirect?page=changes>

Changes:

[apurtell] HBASE-22540 [Memstore] Correct counters in MemStoreChunkPool

[apurtell] Update CHANGES.txt for 1.3.5RC0

------------------------------------------
[...truncated 580.84 KB...]
Downloaded: https://repository.jboss.org/nexus/content/groups/public-jboss/org/mortbay/jetty/jetty-sslengine/6.1.26/jetty-sslengine-6.1.26.jar
(19 KB at 104.8 KB/sec)
Downloading: https://repository.jboss.org/nexus/content/groups/public-jboss/com/lmax/disruptor/3.3.0/disruptor-3.3.0.jar
Downloaded: https://repository.jboss.org/nexus/content/groups/public-jboss/org/jamon/jamon-runtime/2.4.1/jamon-runtime-2.4.1.jar
(24 KB at 89.1 KB/sec)
Downloading: https://repository.jboss.org/nexus/content/groups/public-jboss/net/sf/ehcache/ehcache-core/2.4.4/ehcache-core-2.4.4.jar
Downloaded: https://repository.jboss.org/nexus/content/groups/public-jboss/org/mortbay/jetty/servlet-api-2.5/6.1.14/servlet-api-2.5-6.1.14.jar
(130 KB at 448.8 KB/sec)
Downloading: https://repository.jboss.org/nexus/content/groups/public-jboss/bouncycastle/bcprov-jdk15/140/bcprov-jdk15-140.jar
Downloaded: https://repository.jboss.org/nexus/content/groups/public-jboss/org/mortbay/jetty/jsp-api-2.1/6.1.14/jsp-api-2.1-6.1.14.jar
(132 KB at 433.4 KB/sec)
Downloading: https://repository.jboss.org/nexus/content/groups/public-jboss/org/bouncycastle/bcprov-jdk16/1.46/bcprov-jdk16-1.46.jar
Downloaded: https://repository.jboss.org/nexus/content/groups/public-jboss/com/lmax/disruptor/3.3.0/disruptor-3.3.0.jar
(78 KB at 359.8 KB/sec)
Downloading: https://repository.jboss.org/nexus/content/groups/public-jboss/com/sun/jersey/jersey-client/1.9/jersey-client-1.9.jar
Downloaded: https://repository.jboss.org/nexus/content/groups/public-jboss/com/sun/jersey/jersey-client/1.9/jersey-client-1.9.jar
(128 KB at 379.2 KB/sec)
Downloading: https://repository.jboss.org/nexus/content/groups/public-jboss/org/fusesource/leveldbjni/leveldbjni-all/1.8/leveldbjni-all-1.8.jar
Downloaded: https://repository.jboss.org/nexus/content/groups/public-jboss/org/mortbay/jetty/jsp-2.1/6.1.14/jsp-2.1-6.1.14.jar
(1001 KB at 1257.1 KB/sec)
Downloading: https://repository.jboss.org/nexus/content/groups/public-jboss/io/netty/netty/3.6.2.Final/netty-3.6.2.Final.jar
Downloaded: https://repository.jboss.org/nexus/content/groups/public-jboss/net/sf/ehcache/ehcache-core/2.4.4/ehcache-core-2.4.4.jar
(986 KB at 1190.6 KB/sec)
Downloaded: https://repository.jboss.org/nexus/content/groups/public-jboss/bouncycastle/bcprov-jdk15/140/bcprov-jdk15-140.jar
(1557 KB at 1384.4 KB/sec)
Downloaded: https://repository.jboss.org/nexus/content/groups/public-jboss/org/fusesource/leveldbjni/leveldbjni-all/1.8/leveldbjni-all-1.8.jar
(1022 KB at 1227.4 KB/sec)
Downloaded: https://repository.jboss.org/nexus/content/groups/public-jboss/org/bouncycastle/bcprov-jdk16/1.46/bcprov-jdk16-1.46.jar
(1833 KB at 1316.5 KB/sec)
Downloaded: https://repository.jboss.org/nexus/content/groups/public-jboss/io/netty/netty/3.6.2.Final/netty-3.6.2.Final.jar
(1172 KB at 1274.7 KB/sec)
[INFO] 
[INFO] --- maven-clean-plugin:2.5:clean (default-clean) @ hbase-server ---
[INFO] 
[INFO] --- build-helper-maven-plugin:1.9.1:bsh-property (negate-license-bundles-property)
@ hbase-server ---
[INFO] 
[INFO] --- build-helper-maven-plugin:1.9.1:regex-property (create-license-file-path-property)
@ hbase-server ---
[INFO] No match to regex '\\' found in '<https://builds.apache.org/job/HBase-1.3-IT/it.test=IntegrationTestBigLinkedList,jdk=JDK%201.7%20(latest),label=Hadoop/ws/hbase-server/target/maven-shared-archive-resources/META-INF/LICENSE'.>
The initial value '<https://builds.apache.org/job/HBase-1.3-IT/it.test=IntegrationTestBigLinkedList,jdk=JDK%201.7%20(latest),label=Hadoop/ws/hbase-server/target/maven-shared-archive-resources/META-INF/LICENSE'>
is left as-is...
[INFO] 
[INFO] --- maven-enforcer-plugin:3.0.0-M1:enforce (hadoop-profile-min-maven-min-java-banned-xerces)
@ hbase-server ---
[INFO] 
[INFO] --- maven-enforcer-plugin:3.0.0-M1:enforce (banned-jsr305) @ hbase-server ---
[INFO] 
[INFO] --- buildnumber-maven-plugin:1.3:create-timestamp (default) @ hbase-server ---
[INFO] 
[INFO] --- build-helper-maven-plugin:1.9.1:add-source (jspcSource-packageInfo-source) @ hbase-server
---
[INFO] Source directory: <https://builds.apache.org/job/HBase-1.3-IT/it.test=IntegrationTestBigLinkedList,jdk=JDK%201.7%20(latest),label=Hadoop/ws/hbase-server/target/generated-jamon>
added.
[INFO] Source directory: <https://builds.apache.org/job/HBase-1.3-IT/it.test=IntegrationTestBigLinkedList,jdk=JDK%201.7%20(latest),label=Hadoop/ws/hbase-server/target/generated-sources/java>
added.
[INFO] 
[INFO] --- jamon-maven-plugin:2.4.1:translate (default) @ hbase-server ---
Downloading: http://repository.apache.org/snapshots/org/jamon/jamon-processor/2.4.1/jamon-processor-2.4.1.pom
Downloading: http://repo.maven.apache.org/maven2/org/jamon/jamon-processor/2.4.1/jamon-processor-2.4.1.pom
Downloaded: http://repo.maven.apache.org/maven2/org/jamon/jamon-processor/2.4.1/jamon-processor-2.4.1.pom
(3 KB at 173.9 KB/sec)
Downloading: http://repository.apache.org/snapshots/org/jamon/jamon-runtime/2.4.0/jamon-runtime-2.4.0.pom
Downloading: http://repo.maven.apache.org/maven2/org/jamon/jamon-runtime/2.4.0/jamon-runtime-2.4.0.pom
Downloaded: http://repo.maven.apache.org/maven2/org/jamon/jamon-runtime/2.4.0/jamon-runtime-2.4.0.pom
(2 KB at 110.7 KB/sec)
Downloading: http://repository.apache.org/snapshots/org/jamon/jamon-api/2.3.0/jamon-api-2.3.0.pom
Downloading: http://repo.maven.apache.org/maven2/org/jamon/jamon-api/2.3.0/jamon-api-2.3.0.pom
Downloaded: http://repo.maven.apache.org/maven2/org/jamon/jamon-api/2.3.0/jamon-api-2.3.0.pom
(2 KB at 80.4 KB/sec)
Downloading: http://repository.apache.org/snapshots/org/jamon/jamon-project/1.0.1/jamon-project-1.0.1.pom
Downloading: http://repo.maven.apache.org/maven2/org/jamon/jamon-project/1.0.1/jamon-project-1.0.1.pom
Downloaded: http://repo.maven.apache.org/maven2/org/jamon/jamon-project/1.0.1/jamon-project-1.0.1.pom
(9 KB at 456.5 KB/sec)
Downloading: http://repository.apache.org/snapshots/org/codehaus/plexus/plexus-compiler-api/1.8.1/plexus-compiler-api-1.8.1.pom
Downloading: http://repo.maven.apache.org/maven2/org/codehaus/plexus/plexus-compiler-api/1.8.1/plexus-compiler-api-1.8.1.pom
Downloaded: http://repo.maven.apache.org/maven2/org/codehaus/plexus/plexus-compiler-api/1.8.1/plexus-compiler-api-1.8.1.pom
(805 B at 49.1 KB/sec)
Downloading: http://repository.apache.org/snapshots/org/codehaus/plexus/plexus-compiler/1.8.1/plexus-compiler-1.8.1.pom
Downloading: http://repo.maven.apache.org/maven2/org/codehaus/plexus/plexus-compiler/1.8.1/plexus-compiler-1.8.1.pom
Downloaded: http://repo.maven.apache.org/maven2/org/codehaus/plexus/plexus-compiler/1.8.1/plexus-compiler-1.8.1.pom
(4 KB at 226.4 KB/sec)
Downloading: http://repository.apache.org/snapshots/org/jamon/jamon-processor/2.4.1/jamon-processor-2.4.1.jar
Downloading: http://repository.apache.org/snapshots/org/jamon/jamon-runtime/2.4.0/jamon-runtime-2.4.0.jar
Downloading: http://repository.apache.org/snapshots/org/jamon/jamon-api/2.3.0/jamon-api-2.3.0.jar
Downloading: http://repository.apache.org/snapshots/org/codehaus/plexus/plexus-compiler-api/1.8.1/plexus-compiler-api-1.8.1.jar
Downloading: http://repository.apache.org/snapshots/org/codehaus/plexus/plexus-utils/1.5.5/plexus-utils-1.5.5.jar
Downloading: http://repo.maven.apache.org/maven2/org/jamon/jamon-processor/2.4.1/jamon-processor-2.4.1.jar
Downloading: http://repo.maven.apache.org/maven2/org/jamon/jamon-runtime/2.4.0/jamon-runtime-2.4.0.jar
Downloading: http://repo.maven.apache.org/maven2/org/jamon/jamon-api/2.3.0/jamon-api-2.3.0.jar
Downloading: http://repo.maven.apache.org/maven2/org/codehaus/plexus/plexus-compiler-api/1.8.1/plexus-compiler-api-1.8.1.jar
Downloading: http://repo.maven.apache.org/maven2/org/codehaus/plexus/plexus-utils/1.5.5/plexus-utils-1.5.5.jar
Downloaded: http://repo.maven.apache.org/maven2/org/jamon/jamon-runtime/2.4.0/jamon-runtime-2.4.0.jar
(25 KB at 1430.0 KB/sec)
Downloaded: http://repo.maven.apache.org/maven2/org/jamon/jamon-api/2.3.0/jamon-api-2.3.0.jar
(5 KB at 280.8 KB/sec)
Downloaded: http://repo.maven.apache.org/maven2/org/codehaus/plexus/plexus-compiler-api/1.8.1/plexus-compiler-api-1.8.1.jar
(20 KB at 1218.3 KB/sec)
Downloaded: http://repo.maven.apache.org/maven2/org/codehaus/plexus/plexus-utils/1.5.5/plexus-utils-1.5.5.jar
(246 KB at 10668.9 KB/sec)
Downloaded: http://repo.maven.apache.org/maven2/org/jamon/jamon-processor/2.4.1/jamon-processor-2.4.1.jar
(281 KB at 10391.6 KB/sec)
[INFO] Translating 10 templates from <https://builds.apache.org/job/HBase-1.3-IT/it.test=IntegrationTestBigLinkedList,jdk=JDK%201.7%20(latest),label=Hadoop/ws/hbase-server/src/main/jamon>
to <https://builds.apache.org/job/HBase-1.3-IT/it.test=IntegrationTestBigLinkedList,jdk=JDK%201.7%20(latest),label=Hadoop/ws/hbase-server/target/generated-jamon>
[INFO] 
[INFO] --- maven-antrun-plugin:1.6:run (generate) @ hbase-server ---
[INFO] Executing tasks

main:
    [mkdir] Created dir: <https://builds.apache.org/job/HBase-1.3-IT/it.test=IntegrationTestBigLinkedList,jdk=JDK%201.7%20(latest),label=Hadoop/ws/hbase-server/target/hbase-webapps>
     [copy] Copying 20 files to <https://builds.apache.org/job/HBase-1.3-IT/it.test=IntegrationTestBigLinkedList,jdk=JDK%201.7%20(latest),label=Hadoop/ws/hbase-server/target/hbase-webapps>
log4j:WARN No appenders could be found for logger (org.mortbay.log).
log4j:WARN Please initialize the log4j system properly.
log4j:WARN See http://logging.apache.org/log4j/1.2/faq.html#noconfig for more info.
    [mkdir] Created dir: <https://builds.apache.org/job/HBase-1.3-IT/it.test=IntegrationTestBigLinkedList,jdk=JDK%201.7%20(latest),label=Hadoop/ws/hbase-server/target/hbase-webapps/master/WEB-INF>
    [mkdir] Created dir: <https://builds.apache.org/job/HBase-1.3-IT/it.test=IntegrationTestBigLinkedList,jdk=JDK%201.7%20(latest),label=Hadoop/ws/hbase-server/target/hbase-webapps/regionserver/WEB-INF>
[INFO] Executed tasks
[INFO] 
[INFO] --- maven-remote-resources-plugin:1.5:process (default) @ hbase-server ---
[INFO] 
[INFO] --- maven-resources-plugin:2.6:resources (default-resources) @ hbase-server ---
[INFO] Using 'UTF-8' encoding to copy filtered resources.
[INFO] Copying 22 resources
[INFO] Copying 2 resources
[INFO] 
[INFO] --- maven-enforcer-plugin:3.0.0-M1:enforce (check-aggregate-license) @ hbase-server
---
[INFO] Skipping Rule Enforcement.
[INFO] 
[INFO] --- maven-compiler-plugin:2.5.1:compile (default-compile) @ hbase-server ---
[INFO] Compiling 843 source files to <https://builds.apache.org/job/HBase-1.3-IT/it.test=IntegrationTestBigLinkedList,jdk=JDK%201.7%20(latest),label=Hadoop/ws/hbase-server/target/classes>
[WARNING] warning: unknown enum constant When.UNKNOWN
  reason: class file for javax.annotation.meta.When not found
<https://builds.apache.org/job/HBase-1.3-IT/it.test=IntegrationTestBigLinkedList,jdk=JDK%201.7%20(latest),label=Hadoop/ws/hbase-server/target/generated-jamon/org/apache/hadoop/hbase/tmpl/master/MasterStatusTmpl.java>:[378,13]
Signal is internal proprietary API and may be removed in a future release
[WARNING] <https://builds.apache.org/job/HBase-1.3-IT/it.test=IntegrationTestBigLinkedList,jdk=JDK%201.7%20(latest),label=Hadoop/ws/hbase-server/target/generated-jamon/org/apache/hadoop/hbase/tmpl/master/MasterStatusTmpl.java>:[378,37]
SignalHandler is internal proprietary API and may be removed in a future release
[WARNING] <https://builds.apache.org/job/HBase-1.3-IT/it.test=IntegrationTestBigLinkedList,jdk=JDK%201.7%20(latest),label=Hadoop/ws/hbase-server/src/main/java/org/apache/hadoop/hbase/regionserver/HRegionServer.java>:[617,24]
Signal is internal proprietary API and may be removed in a future release
[WARNING] <https://builds.apache.org/job/HBase-1.3-IT/it.test=IntegrationTestBigLinkedList,jdk=JDK%201.7%20(latest),label=Hadoop/ws/hbase-server/src/main/java/org/apache/hadoop/hbase/regionserver/HRegionServer.java>:[617,43]
SignalHandler is internal proprietary API and may be removed in a future release
[WARNING] <https://builds.apache.org/job/HBase-1.3-IT/it.test=IntegrationTestBigLinkedList,jdk=JDK%201.7%20(latest),label=Hadoop/ws/hbase-server/src/main/java/org/apache/hadoop/hbase/regionserver/HRegionServer.java>:[619,27]
Signal is internal proprietary API and may be removed in a future release
[WARNING] <https://builds.apache.org/job/HBase-1.3-IT/it.test=IntegrationTestBigLinkedList,jdk=JDK%201.7%20(latest),label=Hadoop/ws/hbase-server/src/main/java/org/apache/hadoop/hbase/regionserver/HRegionServer.java>:[617,6]
Signal is internal proprietary API and may be removed in a future release
[INFO] 
[INFO] --- maven-dependency-plugin:3.0.1:build-classpath (create-mrapp-generated-classpath)
@ hbase-server ---
[INFO] Wrote classpath file '<https://builds.apache.org/job/HBase-1.3-IT/it.test=IntegrationTestBigLinkedList,jdk=JDK%201.7%20(latest),label=Hadoop/ws/hbase-server/target/test-classes/mrapp-generated-classpath'.>
[INFO] 
[INFO] --- maven-resources-plugin:2.6:testResources (default-testResources) @ hbase-server
---
[INFO] Using 'UTF-8' encoding to copy filtered resources.
[INFO] Copying 1 resource to META-INF/
[INFO] Copying 16 resources
[INFO] 
[INFO] --- maven-compiler-plugin:2.5.1:testCompile (default-testCompile) @ hbase-server ---
[INFO] Compiling 813 source files to <https://builds.apache.org/job/HBase-1.3-IT/it.test=IntegrationTestBigLinkedList,jdk=JDK%201.7%20(latest),label=Hadoop/ws/hbase-server/target/test-classes>
[INFO] -------------------------------------------------------------
[ERROR] COMPILATION ERROR : 
[INFO] -------------------------------------------------------------
[ERROR] warning: unknown enum constant When.UNKNOWN
  reason: class file for javax.annotation.meta.When not found
<https://builds.apache.org/job/HBase-1.3-IT/it.test=IntegrationTestBigLinkedList,jdk=JDK%201.7%20(latest),label=Hadoop/ws/hbase-server/src/test/java/org/apache/hadoop/hbase/util/TestHBaseFsck.java>:[3167,15]
error: cannot find symbol
[INFO] 1 error
[INFO] -------------------------------------------------------------
[INFO] ------------------------------------------------------------------------
[INFO] Reactor Summary:
[INFO] 
[INFO] Apache HBase ...................................... SUCCESS [1:12.575s]
[INFO] Apache HBase - Checkstyle ......................... SUCCESS [7.624s]
[INFO] Apache HBase - Resource Bundle .................... SUCCESS [0.419s]
[INFO] Apache HBase - Annotations ........................ SUCCESS [1.161s]
[INFO] Apache HBase - Protocol ........................... SUCCESS [17.267s]
[INFO] Apache HBase - Common ............................. SUCCESS [1:14.144s]
[INFO] Apache HBase - Procedure .......................... SUCCESS [1.620s]
[INFO] Apache HBase - Client ............................. SUCCESS [12.424s]
[INFO] Apache HBase - Hadoop Compatibility ............... SUCCESS [2.286s]
[INFO] Apache HBase - Hadoop Two Compatibility ........... SUCCESS [11.512s]
[INFO] Apache HBase - Prefix Tree ........................ SUCCESS [1.241s]
[INFO] Apache HBase - Server ............................. FAILURE [1:07.092s]
[INFO] Apache HBase - Testing Util ....................... SKIPPED
[INFO] Apache HBase - Thrift ............................. SKIPPED
[INFO] Apache HBase - Rest ............................... SKIPPED
[INFO] Apache HBase - Shell .............................. SKIPPED
[INFO] Apache HBase - Integration Tests .................. SKIPPED
[INFO] Apache HBase - Examples ........................... SKIPPED
[INFO] Apache HBase - External Block Cache ............... SKIPPED
[INFO] Apache HBase - Assembly ........................... SKIPPED
[INFO] Apache HBase - Shaded ............................. SKIPPED
[INFO] Apache HBase - Shaded - Client .................... SKIPPED
[INFO] Apache HBase - Shaded - Server .................... SKIPPED
[INFO] Apache HBase Shaded Packaging Invariants .......... SKIPPED
[INFO] Apache HBase - Archetypes ......................... SKIPPED
[INFO] Apache HBase - Exemplar for hbase-client archetype  SKIPPED
[INFO] Apache HBase - Exemplar for hbase-shaded-client archetype  SKIPPED
[INFO] Apache HBase - Archetype builder .................. SKIPPED
[INFO] ------------------------------------------------------------------------
[INFO] BUILD FAILURE
[INFO] ------------------------------------------------------------------------
[INFO] Total time: 4:57.611s
[INFO] Finished at: Wed Jun 05 22:42:19 UTC 2019
[INFO] Final Memory: 99M/1383M
[INFO] ------------------------------------------------------------------------
[ERROR] Failed to execute goal org.apache.maven.plugins:maven-compiler-plugin:2.5.1:testCompile
(default-testCompile) on project hbase-server: Compilation failure
[ERROR] warning: unknown enum constant When.UNKNOWN
[ERROR] reason: class file for javax.annotation.meta.When not found
[ERROR] <https://builds.apache.org/job/HBase-1.3-IT/it.test=IntegrationTestBigLinkedList,jdk=JDK%201.7%20(latest),label=Hadoop/ws/hbase-server/src/test/java/org/apache/hadoop/hbase/util/TestHBaseFsck.java>:[3167,15]
error: cannot find symbol
[ERROR] -> [Help 1]
[ERROR] 
[ERROR] To see the full stack trace of the errors, re-run Maven with the -e switch.
[ERROR] Re-run Maven using the -X switch to enable full debug logging.
[ERROR] 
[ERROR] For more information about the errors and possible solutions, please read the following
articles:
[ERROR] [Help 1] http://cwiki.apache.org/confluence/display/MAVEN/MojoFailureException
[ERROR] 
[ERROR] After correcting the problems, you can resume the build with the command
[ERROR]   mvn <goals> -rf :hbase-server
Build step 'Invoke top-level Maven targets' marked build as failure
Performing Post build task...
Match found for :.* : True
Logical operation result is TRUE
Running script  : # Post-build task script. TODO: Check this in and have all builds reference
check-in.
pwd && ls
# NOTE!!!! The below code has been copied and pasted from ./dev-tools/run-test.sh
# Do not change here without syncing there and vice-versa.
ZOMBIE_TESTS_COUNT=`jps -v | grep surefirebooter | grep -e '-Dhbase.test' | wc -l`
if [[ $ZOMBIE_TESTS_COUNT != 0 ]] ; then
 echo "Suspicious java process found - waiting 30s to see if there are just slow to stop"
 sleep 30
 ZOMBIE_TESTS_COUNT=`jps -v | grep surefirebooter | grep -e '-Dhbase.test' | wc -l`
 if [[ $ZOMBIE_TESTS_COUNT != 0 ]] ; then
   echo " {color:red}There appear to be $ZOMBIE_TESTS_COUNT zombie tests{color}, they should
have been killed by surefire but survived"
   jps -v | grep surefirebooter | grep -e '-Dhbase.test'
   jps -v | grep surefirebooter | grep -e '-Dhbase.test' | cut -d ' ' -f 1 | xargs -n 1 jstack
   # Exit with error
   exit 1
 else
   echo "We're ok: there is no zombie test, but some tests took some time to stop"
 fi
else
  echo "We're ok: there is no zombie test"
fi
[495466b0] $ /bin/bash -xe /tmp/jenkins2382986064126710468.sh
+ pwd
<https://builds.apache.org/job/HBase-1.3-IT/it.test=IntegrationTestBigLinkedList,jdk=JDK%201.7%20(latest),label=Hadoop/ws/>
+ ls
bin
CHANGES.txt
conf
dev-support
hbase-annotations
hbase-archetypes
hbase-assembly
hbase-checkstyle
hbase-client
hbase-common
hbase-examples
hbase-external-blockcache
hbase-hadoop2-compat
hbase-hadoop-compat
hbase-it
hbase-native-client
hbase-prefix-tree
hbase-procedure
hbase-protocol
hbase-resource-bundle
hbase-rest
hbase-server
hbase-shaded
hbase-shell
hbase-testing-util
hbase-thrift
LICENSE.txt
NOTICE.txt
pom.xml
README.txt
src
target
++ jps -v
++ grep surefirebooter
++ grep -e -Dhbase.test
++ wc -l
+ ZOMBIE_TESTS_COUNT=0
+ [[ 0 != 0 ]]
+ echo 'We'\''re ok: there is no zombie test'
We're ok: there is no zombie test
POST BUILD TASK : SUCCESS
END OF POST BUILD TASK : 0
Archiving artifacts

Mime
View raw message