hbase-builds mailing list archives

Site index · List index
Message view « Date » · « Thread »
Top « Date » · « Thread »
From Apache Jenkins Server <jenk...@builds.apache.org>
Subject Build failed in Jenkins: HBase-1.3-IT » IntegrationTestBigLinkedList,JDK 1.7 (latest),Hadoop #673
Date Fri, 17 Jan 2020 14:24:41 GMT
See <https://builds.apache.org/job/HBase-1.3-IT/it.test=IntegrationTestBigLinkedList,jdk=JDK%201.7%20(latest),label=Hadoop/673/display/redirect?page=changes>

Changes:

[psomogyi] HBASE-23698 Switch central repo to https (#1053)


------------------------------------------
Started by upstream project "HBase-1.3-IT" build number 673
originally caused by:
 Started by an SCM change
Running as SYSTEM
[EnvInject] - Loading node environment variables.
Building remotely on H17 (Hadoop) in workspace <https://builds.apache.org/job/HBase-1.3-IT/it.test=IntegrationTestBigLinkedList,jdk=JDK%201.7%20(latest),label=Hadoop/ws/>
No credentials specified
Cloning the remote Git repository
Cloning repository https://gitbox.apache.org/repos/asf/hbase.git
 > git init <https://builds.apache.org/job/HBase-1.3-IT/it.test=IntegrationTestBigLinkedList,jdk=JDK%201.7%20(latest),label=Hadoop/ws/>
# timeout=10
Fetching upstream changes from https://gitbox.apache.org/repos/asf/hbase.git
 > git --version # timeout=10
 > git fetch --tags --progress -- https://gitbox.apache.org/repos/asf/hbase.git +refs/heads/*:refs/remotes/origin/*
 > git config remote.origin.url https://gitbox.apache.org/repos/asf/hbase.git # timeout=10
 > git config --add remote.origin.fetch +refs/heads/*:refs/remotes/origin/* # timeout=10
 > git config remote.origin.url https://gitbox.apache.org/repos/asf/hbase.git # timeout=10
Fetching upstream changes from https://gitbox.apache.org/repos/asf/hbase.git
 > git fetch --tags --progress -- https://gitbox.apache.org/repos/asf/hbase.git +refs/heads/*:refs/remotes/origin/*
Checking out Revision 3860cbc2c6531ab39a179daa488b932960add2a2 (refs/remotes/origin/branch-1.3)
 > git config core.sparsecheckout # timeout=10
 > git checkout -f 3860cbc2c6531ab39a179daa488b932960add2a2
Commit message: "HBASE-23698 Switch central repo to https (#1053)"
 > git rev-list --no-walk 7ac0eb9f033be4e0f9ff56cd4679a5b07b3a2594 # timeout=10
[495466b0] $ /bin/bash -xe /tmp/jenkins5207336948700698518.sh
+ which java
/home/jenkins/tools/java/latest1.7/bin/java
+ java -version
java version "1.7.0_80"
Java(TM) SE Runtime Environment (build 1.7.0_80-b15)
Java HotSpot(TM) 64-Bit Server VM (build 24.80-b11, mixed mode)
+ ulimit -a
core file size          (blocks, -c) 0
data seg size           (kbytes, -d) unlimited
scheduling priority             (-e) 0
file size               (blocks, -f) unlimited
pending signals                 (-i) 386349
max locked memory       (kbytes, -l) 16384
max memory size         (kbytes, -m) unlimited
open files                      (-n) 60000
pipe size            (512 bytes, -p) 8
POSIX message queues     (bytes, -q) 819200
real-time priority              (-r) 0
stack size              (kbytes, -s) 8192
cpu time               (seconds, -t) unlimited
max user processes              (-u) 10240
virtual memory          (kbytes, -v) unlimited
file locks                      (-x) unlimited
+ rm -rf /tmp/hbase-jenkins/hbase
[495466b0] $ /home/jenkins/tools/maven/apache-maven-3.0.5/bin/mvn "-Djdk=JDK 1.7 (latest)"
-Dit.test=IntegrationTestBigLinkedList -Dlabel=Hadoop -Dmaven.repo.local=<https://builds.apache.org/job/HBase-1.3-IT/it.test=IntegrationTestBigLinkedList,jdk=JDK%201.7%20(latest),label=Hadoop/ws/.repository>
-Dtest=NoUnitTests clean package verify --batch-mode
[INFO] Scanning for projects...
Downloading: https://repository.apache.org/content/repositories/releases/org/apache/apache/12/apache-12.pom
Downloaded: https://repository.apache.org/content/repositories/releases/org/apache/apache/12/apache-12.pom
(16 KB at 13.0 KB/sec)
Downloading: http://repository.apache.org/snapshots/org/apache/felix/maven-bundle-plugin/2.5.3/maven-bundle-plugin-2.5.3.pom
Downloading: https://repo.maven.apache.org/maven2/org/apache/felix/maven-bundle-plugin/2.5.3/maven-bundle-plugin-2.5.3.pom
[ERROR] The build could not read 1 project -> [Help 1]
[ERROR]   
[ERROR]   The project org.apache.hbase:hbase:1.3.7-SNAPSHOT (<https://builds.apache.org/job/HBase-1.3-IT/it.test=IntegrationTestBigLinkedList,jdk=JDK%201.7%20(latest),label=Hadoop/ws/pom.xml)>
has 1 error
[ERROR]     Unresolveable build extension: Plugin org.apache.felix:maven-bundle-plugin:2.5.3
or one of its dependencies could not be resolved: Failed to collect dependencies for org.apache.felix:maven-bundle-plugin:jar:2.5.3
(): Failed to read artifact descriptor for org.apache.felix:maven-bundle-plugin:jar:2.5.3:
Could not transfer artifact org.apache.felix:maven-bundle-plugin:pom:2.5.3 from/to central
(https://repo.maven.apache.org/maven2): peer not authenticated -> [Help 2]
[ERROR] 
[ERROR] To see the full stack trace of the errors, re-run Maven with the -e switch.
[ERROR] Re-run Maven using the -X switch to enable full debug logging.
[ERROR] 
[ERROR] For more information about the errors and possible solutions, please read the following
articles:
[ERROR] [Help 1] http://cwiki.apache.org/confluence/display/MAVEN/ProjectBuildingException
[ERROR] [Help 2] http://cwiki.apache.org/confluence/display/MAVEN/PluginResolutionException
Build step 'Invoke top-level Maven targets' marked build as failure
Performing Post build task...
Match found for :.* : True
Logical operation result is TRUE
Running script  : # Post-build task script. TODO: Check this in and have all builds reference
check-in.
pwd && ls
# NOTE!!!! The below code has been copied and pasted from ./dev-tools/run-test.sh
# Do not change here without syncing there and vice-versa.
ZOMBIE_TESTS_COUNT=`jps -v | grep surefirebooter | grep -e '-Dhbase.test' | wc -l`
if [[ $ZOMBIE_TESTS_COUNT != 0 ]] ; then
 echo "Suspicious java process found - waiting 30s to see if there are just slow to stop"
 sleep 30
 ZOMBIE_TESTS_COUNT=`jps -v | grep surefirebooter | grep -e '-Dhbase.test' | wc -l`
 if [[ $ZOMBIE_TESTS_COUNT != 0 ]] ; then
   echo " {color:red}There appear to be $ZOMBIE_TESTS_COUNT zombie tests{color}, they should
have been killed by surefire but survived"
   jps -v | grep surefirebooter | grep -e '-Dhbase.test'
   jps -v | grep surefirebooter | grep -e '-Dhbase.test' | cut -d ' ' -f 1 | xargs -n 1 jstack
   # Exit with error
   exit 1
 else
   echo "We're ok: there is no zombie test, but some tests took some time to stop"
 fi
else
  echo "We're ok: there is no zombie test"
fi
[495466b0] $ /bin/bash -xe /tmp/jenkins600636848049113757.sh
+ pwd
<https://builds.apache.org/job/HBase-1.3-IT/it.test=IntegrationTestBigLinkedList,jdk=JDK%201.7%20(latest),label=Hadoop/ws/>
+ ls
bin
CHANGES.txt
conf
dev-support
hbase-annotations
hbase-archetypes
hbase-assembly
hbase-checkstyle
hbase-client
hbase-common
hbase-examples
hbase-external-blockcache
hbase-hadoop2-compat
hbase-hadoop-compat
hbase-hbtop
hbase-it
hbase-native-client
hbase-prefix-tree
hbase-procedure
hbase-protocol
hbase-resource-bundle
hbase-rest
hbase-server
hbase-shaded
hbase-shell
hbase-testing-util
hbase-thrift
LICENSE.txt
NOTICE.txt
pom.xml
README.txt
src
++ jps -v
++ grep surefirebooter
++ grep -e -Dhbase.test
++ wc -l
+ ZOMBIE_TESTS_COUNT=0
+ [[ 0 != 0 ]]
+ echo 'We'\''re ok: there is no zombie test'
We're ok: there is no zombie test
POST BUILD TASK : SUCCESS
END OF POST BUILD TASK : 0
Archiving artifacts

Mime
View raw message