hbase-user mailing list archives

Site index · List index
Message view « Date » · « Thread »
Top « Date » · « Thread »
From "DavdShao" <1336318...@qq.com>
Subject Failure to compile package hbase-operator-tools
Date Mon, 14 Oct 2019 07:49:42 GMT
hi guys,
&nbsp; &nbsp; When I compiled the toolkit downloaded from gitup, the display failed.
&nbsp; &nbsp;&nbsp;My commands are as follows´╝Ü
&nbsp; &nbsp; git&nbsp; clone&nbsp; https://github.com/apache/hbase-operator-tools.git
&nbsp; &nbsp; cd hbase-operator-tools
&nbsp; &nbsp; vi pom.xml (Modify HBase version configuration)
&nbsp; &nbsp; mvn clean package


But after the "mvn clean ..." command is executed, the error is reported as follows


"&nbsp; INFO] Apache HBase Operator Tools ........................ SUCCESS [&nbsp;
3.644 s]
[INFO] Apache HBase - HBCK2 ............................... FAILURE [&nbsp; 6.522 s]
[INFO] Apache HBase Operator Tools - Assembly ............. SKIPPED
[INFO] ------------------------------------------------------------------------
[INFO] BUILD FAILURE
[INFO] ------------------------------------------------------------------------
[INFO] Total time:&nbsp; 10.347 s
[INFO] Finished at: 2019-10-14T15:29:27+08:00
[INFO] ------------------------------------------------------------------------
[ERROR] Failed to execute goal org.apache.maven.plugins:maven-compiler-plugin:3.6.1:compile
(default-compile) on project hbase-hbck2: Compilation failure: Compilation failure:&nbsp;
[ERROR] /home/cdcshaod/packages/hbase-operator-tools/hbase-hbck2/src/main/java/org/apache/hbase/HBCK2.java:[49,38]
cannot find symbol
[ERROR]&nbsp; &nbsp;symbol:&nbsp; &nbsp;class Hbck
[ERROR]&nbsp; &nbsp;location: package org.apache.hadoop.hbase.client
[ERROR] /home/cdcshaod/packages/hbase-operator-tools/hbase-hbck2/src/main/java/org/apache/hbase/HBCK2.java:[138,28]
cannot find symbol
[ERROR]&nbsp; &nbsp;symbol:&nbsp; &nbsp;class Hbck
[ERROR]&nbsp; &nbsp;location: class org.apache.hbase.HBCK2
[ERROR] /home/cdcshaod/packages/hbase-operator-tools/hbase-hbck2/src/main/java/org/apache/hbase/HBCK2.java:[267,22]
cannot find symbol
[ERROR]&nbsp; &nbsp;symbol:&nbsp; &nbsp;class Hbck
[ERROR]&nbsp; &nbsp;location: class org.apache.hbase.HBCK2
[ERROR] /home/cdcshaod/packages/hbase-operator-tools/hbase-hbck2/src/main/java/org/apache/hbase/HBCK2.java:[284,24]
cannot find symbol
[ERROR]&nbsp; &nbsp;symbol:&nbsp; &nbsp;class Hbck
[ERROR]&nbsp; &nbsp;location: class org.apache.hbase.HBCK2
[ERROR] /home/cdcshaod/packages/hbase-operator-tools/hbase-hbck2/src/main/java/org/apache/hbase/HBCK2.java:[341,33]
cannot find symbol
[ERROR]&nbsp; &nbsp;symbol:&nbsp; &nbsp;class Hbck
[ERROR]&nbsp; &nbsp;location: class org.apache.hbase.HBCK2
[ERROR] -&gt; [Help 1]
[ERROR]&nbsp;
[ERROR] To see the full stack trace of the errors, re-run Maven with the -e switch.
[ERROR] Re-run Maven using the -X switch to enable full debug logging.
[ERROR]&nbsp;
[ERROR] For more information about the errors and possible solutions, please read the following
articles:
[ERROR] [Help 1] http://cwiki.apache.org/confluence/display/MAVEN/MojoFailureException
[ERROR]&nbsp;
[ERROR] After correcting the problems, you can resume the build with the command
[ERROR]&nbsp; &nbsp;mvn <goals&gt; -rf :hbase-hbck2&nbsp; &nbsp; &nbsp;
&nbsp;"


I wonder if you have ever encountered such a mistake.






DavidShao


&nbsp; &nbsp;&nbsp;
Mime
  • Unnamed multipart/alternative (inline, 8-Bit, 0 bytes)
View raw message