hive-issues mailing list archives

Site index · List index
Message view « Date » · « Thread »
Top « Date » · « Thread »
From "Hive QA (JIRA)" <j...@apache.org>
Subject [jira] [Commented] (HIVE-9073) NPE when using custom windowing UDAFs
Date Wed, 01 Apr 2015 01:51:54 GMT

    [ https://issues.apache.org/jira/browse/HIVE-9073?page=com.atlassian.jira.plugin.system.issuetabpanels:comment-tabpanel&focusedCommentId=14389861#comment-14389861
] 

Hive QA commented on HIVE-9073:
-------------------------------



{color:red}Overall{color}: -1 at least one tests failed

Here are the results of testing the latest attachment:
https://issues.apache.org/jira/secure/attachment/12708489/HIVE-9073.3.patch

{color:red}ERROR:{color} -1 due to 13 failed/errored test(s), 8643 tests executed
*Failed tests:*
{noformat}
TestMinimrCliDriver-bucketmapjoin6.q-constprog_partitioner.q-infer_bucket_sort_dyn_part.q-and-1-more
- did not produce a TEST-*.xml file
TestMinimrCliDriver-external_table_with_space_in_location_path.q-infer_bucket_sort_merge.q-auto_sortmerge_join_16.q-and-1-more
- did not produce a TEST-*.xml file
TestMinimrCliDriver-groupby2.q-import_exported_table.q-bucketizedhiveinputformat.q-and-1-more
- did not produce a TEST-*.xml file
TestMinimrCliDriver-index_bitmap3.q-stats_counter_partitioned.q-temp_table_external.q-and-1-more
- did not produce a TEST-*.xml file
TestMinimrCliDriver-infer_bucket_sort_map_operators.q-join1.q-bucketmapjoin7.q-and-1-more
- did not produce a TEST-*.xml file
TestMinimrCliDriver-infer_bucket_sort_num_buckets.q-disable_merge_for_bucketing.q-uber_reduce.q-and-1-more
- did not produce a TEST-*.xml file
TestMinimrCliDriver-infer_bucket_sort_reducers_power_two.q-scriptfile1.q-scriptfile1_win.q-and-1-more
- did not produce a TEST-*.xml file
TestMinimrCliDriver-leftsemijoin_mr.q-load_hdfs_file_with_space_in_the_name.q-root_dir_external_table.q-and-1-more
- did not produce a TEST-*.xml file
TestMinimrCliDriver-list_bucket_dml_10.q-bucket_num_reducers.q-bucket6.q-and-1-more - did
not produce a TEST-*.xml file
TestMinimrCliDriver-load_fs2.q-file_with_header_footer.q-ql_rewrite_gbtoidx_cbo_1.q-and-1-more
- did not produce a TEST-*.xml file
TestMinimrCliDriver-parallel_orderby.q-reduce_deduplicate.q-ql_rewrite_gbtoidx_cbo_2.q-and-1-more
- did not produce a TEST-*.xml file
TestMinimrCliDriver-ql_rewrite_gbtoidx.q-smb_mapjoin_8.q - did not produce a TEST-*.xml file
TestMinimrCliDriver-schemeAuthority2.q-bucket4.q-input16_cc.q-and-1-more - did not produce
a TEST-*.xml file
{noformat}

Test results: http://ec2-174-129-184-35.compute-1.amazonaws.com/jenkins/job/PreCommit-HIVE-TRUNK-Build/3227/testReport
Console output: http://ec2-174-129-184-35.compute-1.amazonaws.com/jenkins/job/PreCommit-HIVE-TRUNK-Build/3227/console
Test logs: http://ec2-174-129-184-35.compute-1.amazonaws.com/logs/PreCommit-HIVE-TRUNK-Build-3227/

Messages:
{noformat}
Executing org.apache.hive.ptest.execution.PrepPhase
Executing org.apache.hive.ptest.execution.ExecutionPhase
Executing org.apache.hive.ptest.execution.ReportingPhase
Tests exited with: TestsFailedException: 13 tests failed
{noformat}

This message is automatically generated.

ATTACHMENT ID: 12708489 - PreCommit-HIVE-TRUNK-Build

> NPE when using custom windowing UDAFs
> -------------------------------------
>
>                 Key: HIVE-9073
>                 URL: https://issues.apache.org/jira/browse/HIVE-9073
>             Project: Hive
>          Issue Type: Bug
>          Components: UDF
>            Reporter: Jason Dere
>            Assignee: Jason Dere
>         Attachments: HIVE-9073.1.patch, HIVE-9073.2.patch, HIVE-9073.2.patch, HIVE-9073.3.patch
>
>
> From the hive-user email group:
> {noformat}
> While executing a simple select query using a custom windowing UDAF I created I am constantly
running into this error.
>  
> Error: java.lang.RuntimeException: Error in configuring object
>         at org.apache.hadoop.util.ReflectionUtils.setJobConf(ReflectionUtils.java:109)
>         at org.apache.hadoop.util.ReflectionUtils.setConf(ReflectionUtils.java:75)
>         at org.apache.hadoop.util.ReflectionUtils.newInstance(ReflectionUtils.java:133)
>         at org.apache.hadoop.mapred.ReduceTask.runOldReducer(ReduceTask.java:409)
>         at org.apache.hadoop.mapred.ReduceTask.run(ReduceTask.java:392)
>         at org.apache.hadoop.mapred.YarnChild$2.run(YarnChild.java:168)
>         at java.security.AccessController.doPrivileged(Native Method)
>         at javax.security.auth.Subject.doAs(Subject.java:415)
>         at org.apache.hadoop.security.UserGroupInformation.doAs(UserGroupInformation.java:1594)
>         at org.apache.hadoop.mapred.YarnChild.main(YarnChild.java:163)
> Caused by: java.lang.reflect.InvocationTargetException
>         at sun.reflect.NativeMethodAccessorImpl.invoke0(Native Method)
>         at sun.reflect.NativeMethodAccessorImpl.invoke(NativeMethodAccessorImpl.java:57)
>         at sun.reflect.DelegatingMethodAccessorImpl.invoke(DelegatingMethodAccessorImpl.java:43)
>         at java.lang.reflect.Method.invoke(Method.java:606)
>         at org.apache.hadoop.util.ReflectionUtils.setJobConf(ReflectionUtils.java:106)
>         ... 9 more
> Caused by: java.lang.RuntimeException: Reduce operator initialization failed
>         at org.apache.hadoop.hive.ql.exec.mr.ExecReducer.configure(ExecReducer.java:173)
>         ... 14 more
> Caused by: java.lang.NullPointerException
>         at org.apache.hadoop.hive.ql.exec.FunctionRegistry.getFunctionInfo(FunctionRegistry.java:647)
>         at org.apache.hadoop.hive.ql.exec.FunctionRegistry.getWindowFunctionInfo(FunctionRegistry.java:1875)
>         at org.apache.hadoop.hive.ql.udf.ptf.WindowingTableFunction.streamingPossible(WindowingTableFunction.java:150)
>         at org.apache.hadoop.hive.ql.udf.ptf.WindowingTableFunction.setCanAcceptInputAsStream(WindowingTableFunction.java:221)
>         at org.apache.hadoop.hive.ql.udf.ptf.WindowingTableFunction.initializeStreaming(WindowingTableFunction.java:266)
>         at org.apache.hadoop.hive.ql.exec.PTFOperator$PTFInvocation.initializeStreaming(PTFOperator.java:292)
>         at org.apache.hadoop.hive.ql.exec.PTFOperator.initializeOp(PTFOperator.java:86)
>         at org.apache.hadoop.hive.ql.exec.Operator.initialize(Operator.java:376)
>         at org.apache.hadoop.hive.ql.exec.Operator.initialize(Operator.java:460)
>         at org.apache.hadoop.hive.ql.exec.Operator.initializeChildren(Operator.java:416)
>         at org.apache.hadoop.hive.ql.exec.ExtractOperator.initializeOp(ExtractOperator.java:40)
>         at org.apache.hadoop.hive.ql.exec.Operator.initialize(Operator.java:376)
>         at org.apache.hadoop.hive.ql.exec.mr.ExecReducer.configure(ExecReducer.java:166)
>         ... 14 more
>  
> Just wanted to check if any of you have faced this earlier. Also when I try to run the
Custom UDAF on another server it works fine. The only difference I can see it that the hive
version I am using on my local machine is 0.13.1 where it is working and on the other machine
it is 0.13.0 where I see the above mentioned error. I am not sure if this was a bug which
was fixed in the later release but I just wanted to confirm the same.
> {noformat}



--
This message was sent by Atlassian JIRA
(v6.3.4#6332)

Mime
View raw message