hive-issues mailing list archives

Site index · List index
Message view « Date » · « Thread »
Top « Date » · « Thread »
From "Hive QA (JIRA)" <j...@apache.org>
Subject [jira] [Commented] (HIVE-10514) Fix MiniCliDriver tests failure
Date Tue, 28 Apr 2015 21:49:06 GMT

    [ https://issues.apache.org/jira/browse/HIVE-10514?page=com.atlassian.jira.plugin.system.issuetabpanels:comment-tabpanel&focusedCommentId=14518158#comment-14518158
] 

Hive QA commented on HIVE-10514:
--------------------------------



{color:red}Overall{color}: -1 at least one tests failed

Here are the results of testing the latest attachment:
https://issues.apache.org/jira/secure/attachment/12728744/HIVE-10514.2.patch

{color:red}ERROR:{color} -1 due to 2 failed/errored test(s), 8872 tests executed
*Failed tests:*
{noformat}
TestCustomAuthentication - did not produce a TEST-*.xml file
org.apache.hive.jdbc.TestSSL.testSSLConnectionWithProperty
{noformat}

Test results: http://ec2-174-129-184-35.compute-1.amazonaws.com/jenkins/job/PreCommit-HIVE-TRUNK-Build/3631/testReport
Console output: http://ec2-174-129-184-35.compute-1.amazonaws.com/jenkins/job/PreCommit-HIVE-TRUNK-Build/3631/console
Test logs: http://ec2-174-129-184-35.compute-1.amazonaws.com/logs/PreCommit-HIVE-TRUNK-Build-3631/

Messages:
{noformat}
Executing org.apache.hive.ptest.execution.PrepPhase
Executing org.apache.hive.ptest.execution.ExecutionPhase
Executing org.apache.hive.ptest.execution.ReportingPhase
Tests exited with: TestsFailedException: 2 tests failed
{noformat}

This message is automatically generated.

ATTACHMENT ID: 12728744 - PreCommit-HIVE-TRUNK-Build

> Fix MiniCliDriver tests failure
> -------------------------------
>
>                 Key: HIVE-10514
>                 URL: https://issues.apache.org/jira/browse/HIVE-10514
>             Project: Hive
>          Issue Type: Bug
>          Components: Testing Infrastructure
>            Reporter: Szehon Ho
>            Assignee: Hari Sankar Sivarama Subramaniyan
>         Attachments: HIVE-10514.1.patch, HIVE-10514.2.patch
>
>
> The MinimrCliDriver tests always fail to run.
> This can be reproduced by the following, run the command:
> {noformat}
> mvn -B test -Phadoop-2 -Dtest=TestMinimrCliDriver -Dminimr.query.files=infer_bucket_sort_map_operators.q,join1.q,bucketmapjoin7.q,udf_using.q
> {noformat}
> And the following exception comes:
> {noformat}
> [ERROR] Failed to execute goal org.apache.maven.plugins:maven-compiler-plugin:3.1:testCompile
(default-testCompile) on project hive-it-qfile: Compilation failure
> [ERROR] /Users/szehon/repos/apache-hive-git/hive/itests/qtest/target/generated-test-sources/java/org/apache/hadoop/hive/cli/TestCliDriver.java:[100,22]
code too large
> {noformat}



--
This message was sent by Atlassian JIRA
(v6.3.4#6332)

Mime
View raw message