hive-issues mailing list archives

Site index · List index
Message view « Date » · « Thread »
Top « Date » · « Thread »
From "Hive QA (JIRA)" <j...@apache.org>
Subject [jira] [Commented] (HIVE-11642) LLAP: make sure tests pass #3
Date Wed, 26 Aug 2015 07:37:45 GMT

    [ https://issues.apache.org/jira/browse/HIVE-11642?page=com.atlassian.jira.plugin.system.issuetabpanels:comment-tabpanel&focusedCommentId=14712658#comment-14712658
] 

Hive QA commented on HIVE-11642:
--------------------------------



{color:red}Overall{color}: -1 no tests executed

Here are the results of testing the latest attachment:
https://issues.apache.org/jira/secure/attachment/12752363/HIVE-11642.01.patch

Test results: http://ec2-174-129-184-35.compute-1.amazonaws.com/jenkins/job/PreCommit-HIVE-TRUNK-Build/5072/testReport
Console output: http://ec2-174-129-184-35.compute-1.amazonaws.com/jenkins/job/PreCommit-HIVE-TRUNK-Build/5072/console
Test logs: http://ec2-174-129-184-35.compute-1.amazonaws.com/logs/PreCommit-HIVE-TRUNK-Build-5072/

Messages:
{noformat}
**** This message was trimmed, see log for full details ****
[INFO] Using 'UTF-8' encoding to copy filtered resources.
[INFO] skip non existing resourceDirectory /data/hive-ptest/working/apache-github-source-source/shims/scheduler/src/main/resources
[INFO] Copying 3 resources
[INFO] 
[INFO] --- maven-antrun-plugin:1.7:run (define-classpath) @ hive-shims-scheduler ---
[INFO] Executing tasks

main:
[INFO] Executed tasks
[INFO] 
[INFO] --- maven-compiler-plugin:3.1:compile (default-compile) @ hive-shims-scheduler ---
[INFO] Compiling 1 source file to /data/hive-ptest/working/apache-github-source-source/shims/scheduler/target/classes
[INFO] 
[INFO] --- maven-resources-plugin:2.6:testResources (default-testResources) @ hive-shims-scheduler
---
[INFO] Using 'UTF-8' encoding to copy filtered resources.
[INFO] skip non existing resourceDirectory /data/hive-ptest/working/apache-github-source-source/shims/scheduler/src/test/resources
[INFO] Copying 3 resources
[INFO] 
[INFO] --- maven-antrun-plugin:1.7:run (setup-test-dirs) @ hive-shims-scheduler ---
[INFO] Executing tasks

main:
    [mkdir] Created dir: /data/hive-ptest/working/apache-github-source-source/shims/scheduler/target/tmp
    [mkdir] Created dir: /data/hive-ptest/working/apache-github-source-source/shims/scheduler/target/warehouse
    [mkdir] Created dir: /data/hive-ptest/working/apache-github-source-source/shims/scheduler/target/tmp/conf
     [copy] Copying 10 files to /data/hive-ptest/working/apache-github-source-source/shims/scheduler/target/tmp/conf
[INFO] Executed tasks
[INFO] 
[INFO] --- maven-compiler-plugin:3.1:testCompile (default-testCompile) @ hive-shims-scheduler
---
[INFO] No sources to compile
[INFO] 
[INFO] --- maven-surefire-plugin:2.16:test (default-test) @ hive-shims-scheduler ---
[INFO] Tests are skipped.
[INFO] 
[INFO] --- maven-jar-plugin:2.2:jar (default-jar) @ hive-shims-scheduler ---
[INFO] Building jar: /data/hive-ptest/working/apache-github-source-source/shims/scheduler/target/hive-shims-scheduler-2.0.0-SNAPSHOT.jar
[INFO] 
[INFO] --- maven-site-plugin:3.3:attach-descriptor (attach-descriptor) @ hive-shims-scheduler
---
[INFO] 
[INFO] --- maven-install-plugin:2.4:install (default-install) @ hive-shims-scheduler ---
[INFO] Installing /data/hive-ptest/working/apache-github-source-source/shims/scheduler/target/hive-shims-scheduler-2.0.0-SNAPSHOT.jar
to /home/hiveptest/.m2/repository/org/apache/hive/shims/hive-shims-scheduler/2.0.0-SNAPSHOT/hive-shims-scheduler-2.0.0-SNAPSHOT.jar
[INFO] Installing /data/hive-ptest/working/apache-github-source-source/shims/scheduler/pom.xml
to /home/hiveptest/.m2/repository/org/apache/hive/shims/hive-shims-scheduler/2.0.0-SNAPSHOT/hive-shims-scheduler-2.0.0-SNAPSHOT.pom
[INFO]                                                                         
[INFO] ------------------------------------------------------------------------
[INFO] Building Hive Shims 2.0.0-SNAPSHOT
[INFO] ------------------------------------------------------------------------
[INFO] 
[INFO] --- maven-clean-plugin:2.5:clean (default-clean) @ hive-shims ---
[INFO] Deleting /data/hive-ptest/working/apache-github-source-source/shims/aggregator/target
[INFO] Deleting /data/hive-ptest/working/apache-github-source-source/shims/aggregator (includes
= [datanucleus.log, derby.log], excludes = [])
[INFO] 
[INFO] --- maven-enforcer-plugin:1.3.1:enforce (enforce-no-snapshots) @ hive-shims ---
[INFO] 
[INFO] --- maven-remote-resources-plugin:1.5:process (default) @ hive-shims ---
[INFO] 
[INFO] --- maven-resources-plugin:2.6:resources (default-resources) @ hive-shims ---
[INFO] Using 'UTF-8' encoding to copy filtered resources.
[INFO] skip non existing resourceDirectory /data/hive-ptest/working/apache-github-source-source/shims/aggregator/src/main/resources
[INFO] Copying 3 resources
[INFO] 
[INFO] --- maven-antrun-plugin:1.7:run (define-classpath) @ hive-shims ---
[INFO] Executing tasks

main:
[INFO] Executed tasks
[INFO] 
[INFO] --- maven-compiler-plugin:3.1:compile (default-compile) @ hive-shims ---
[INFO] No sources to compile
[INFO] 
[INFO] --- maven-resources-plugin:2.6:testResources (default-testResources) @ hive-shims ---
[INFO] Using 'UTF-8' encoding to copy filtered resources.
[INFO] skip non existing resourceDirectory /data/hive-ptest/working/apache-github-source-source/shims/aggregator/src/test/resources
[INFO] Copying 3 resources
[INFO] 
[INFO] --- maven-antrun-plugin:1.7:run (setup-test-dirs) @ hive-shims ---
[INFO] Executing tasks

main:
    [mkdir] Created dir: /data/hive-ptest/working/apache-github-source-source/shims/aggregator/target/tmp
    [mkdir] Created dir: /data/hive-ptest/working/apache-github-source-source/shims/aggregator/target/warehouse
    [mkdir] Created dir: /data/hive-ptest/working/apache-github-source-source/shims/aggregator/target/tmp/conf
     [copy] Copying 10 files to /data/hive-ptest/working/apache-github-source-source/shims/aggregator/target/tmp/conf
[INFO] Executed tasks
[INFO] 
[INFO] --- maven-compiler-plugin:3.1:testCompile (default-testCompile) @ hive-shims ---
[INFO] No sources to compile
[INFO] 
[INFO] --- maven-surefire-plugin:2.16:test (default-test) @ hive-shims ---
[INFO] Tests are skipped.
[INFO] 
[INFO] --- maven-jar-plugin:2.2:jar (default-jar) @ hive-shims ---
[INFO] Building jar: /data/hive-ptest/working/apache-github-source-source/shims/aggregator/target/hive-shims-2.0.0-SNAPSHOT.jar
[INFO] 
[INFO] --- maven-site-plugin:3.3:attach-descriptor (attach-descriptor) @ hive-shims ---
[INFO] 
[INFO] --- maven-install-plugin:2.4:install (default-install) @ hive-shims ---
[INFO] Installing /data/hive-ptest/working/apache-github-source-source/shims/aggregator/target/hive-shims-2.0.0-SNAPSHOT.jar
to /home/hiveptest/.m2/repository/org/apache/hive/hive-shims/2.0.0-SNAPSHOT/hive-shims-2.0.0-SNAPSHOT.jar
[INFO] Installing /data/hive-ptest/working/apache-github-source-source/shims/aggregator/pom.xml
to /home/hiveptest/.m2/repository/org/apache/hive/hive-shims/2.0.0-SNAPSHOT/hive-shims-2.0.0-SNAPSHOT.pom
[INFO]                                                                         
[INFO] ------------------------------------------------------------------------
[INFO] Building Hive Storage API 2.0.0-SNAPSHOT
[INFO] ------------------------------------------------------------------------
[INFO] 
[INFO] --- maven-clean-plugin:2.5:clean (default-clean) @ hive-storage-api ---
[INFO] Deleting /data/hive-ptest/working/apache-github-source-source/storage-api/target
[INFO] Deleting /data/hive-ptest/working/apache-github-source-source/storage-api (includes
= [datanucleus.log, derby.log], excludes = [])
[INFO] 
[INFO] --- maven-enforcer-plugin:1.3.1:enforce (enforce-no-snapshots) @ hive-storage-api ---
[INFO] 
[INFO] --- maven-remote-resources-plugin:1.5:process (default) @ hive-storage-api ---
[INFO] 
[INFO] --- maven-resources-plugin:2.6:resources (default-resources) @ hive-storage-api ---
[INFO] Using 'UTF-8' encoding to copy filtered resources.
[INFO] skip non existing resourceDirectory /data/hive-ptest/working/apache-github-source-source/storage-api/src/main/resources
[INFO] Copying 3 resources
[INFO] 
[INFO] --- maven-antrun-plugin:1.7:run (define-classpath) @ hive-storage-api ---
[INFO] Executing tasks

main:
[INFO] Executed tasks
[INFO] 
[INFO] --- maven-compiler-plugin:3.1:compile (default-compile) @ hive-storage-api ---
[INFO] Compiling 20 source files to /data/hive-ptest/working/apache-github-source-source/storage-api/target/classes
[INFO] -------------------------------------------------------------
[ERROR] COMPILATION ERROR : 
[INFO] -------------------------------------------------------------
[ERROR] /data/hive-ptest/working/apache-github-source-source/storage-api/src/java/org/apache/hadoop/hive/common/io/DiskRangeList.java:[23,37]
package com.google.common.annotations does not exist
[ERROR] /data/hive-ptest/working/apache-github-source-source/storage-api/src/java/org/apache/hadoop/hive/common/io/DiskRangeList.java:[121,4]
cannot find symbol
  symbol:   class VisibleForTesting
  location: class org.apache.hadoop.hive.common.io.DiskRangeList
[ERROR] /data/hive-ptest/working/apache-github-source-source/storage-api/src/java/org/apache/hadoop/hive/common/io/DiskRangeList.java:[142,4]
cannot find symbol
  symbol:   class VisibleForTesting
  location: class org.apache.hadoop.hive.common.io.DiskRangeList
[INFO] 3 errors 
[INFO] -------------------------------------------------------------
[INFO] ------------------------------------------------------------------------
[INFO] Reactor Summary:
[INFO] 
[INFO] Hive .............................................. SUCCESS [12.742s]
[INFO] Hive Shims Common ................................. SUCCESS [14.675s]
[INFO] Hive Shims 0.20S .................................. SUCCESS [4.072s]
[INFO] Hive Shims 0.23 ................................... SUCCESS [3:13.646s]
[INFO] Hive Shims Scheduler .............................. SUCCESS [2.468s]
[INFO] Hive Shims ........................................ SUCCESS [2.914s]
[INFO] Hive Storage API .................................. FAILURE [2.101s]
[INFO] Hive Common ....................................... SKIPPED
[INFO] Hive Serde ........................................ SKIPPED
[INFO] Hive Metastore .................................... SKIPPED
[INFO] Hive Ant Utilities ................................ SKIPPED
[INFO] Hive Llap Client .................................. SKIPPED
[INFO] Spark Remote Client ............................... SKIPPED
[INFO] Hive Query Language ............................... SKIPPED
[INFO] Hive Service ...................................... SKIPPED
[INFO] Hive Accumulo Handler ............................. SKIPPED
[INFO] Hive JDBC ......................................... SKIPPED
[INFO] Hive Beeline ...................................... SKIPPED
[INFO] Hive CLI .......................................... SKIPPED
[INFO] Hive Contrib ...................................... SKIPPED
[INFO] Hive HBase Handler ................................ SKIPPED
[INFO] Hive HCatalog ..................................... SKIPPED
[INFO] Hive HCatalog Core ................................ SKIPPED
[INFO] Hive HCatalog Pig Adapter ......................... SKIPPED
[INFO] Hive HCatalog Server Extensions ................... SKIPPED
[INFO] Hive HCatalog Webhcat Java Client ................. SKIPPED
[INFO] Hive HCatalog Webhcat ............................. SKIPPED
[INFO] Hive HCatalog Streaming ........................... SKIPPED
[INFO] Hive HPL/SQL ...................................... SKIPPED
[INFO] Hive HWI .......................................... SKIPPED
[INFO] Hive ODBC ......................................... SKIPPED
[INFO] Hive Shims Aggregator ............................. SKIPPED
[INFO] Hive TestUtils .................................... SKIPPED
[INFO] Hive Packaging .................................... SKIPPED
[INFO] ------------------------------------------------------------------------
[INFO] BUILD FAILURE
[INFO] ------------------------------------------------------------------------
[INFO] Total time: 3:55.858s
[INFO] Finished at: Wed Aug 26 03:37:42 EDT 2015
[INFO] Final Memory: 48M/115M
[INFO] ------------------------------------------------------------------------
[ERROR] Failed to execute goal org.apache.maven.plugins:maven-compiler-plugin:3.1:compile
(default-compile) on project hive-storage-api: Compilation failure: Compilation failure:
[ERROR] /data/hive-ptest/working/apache-github-source-source/storage-api/src/java/org/apache/hadoop/hive/common/io/DiskRangeList.java:[23,37]
package com.google.common.annotations does not exist
[ERROR] /data/hive-ptest/working/apache-github-source-source/storage-api/src/java/org/apache/hadoop/hive/common/io/DiskRangeList.java:[121,4]
cannot find symbol
[ERROR] symbol:   class VisibleForTesting
[ERROR] location: class org.apache.hadoop.hive.common.io.DiskRangeList
[ERROR] /data/hive-ptest/working/apache-github-source-source/storage-api/src/java/org/apache/hadoop/hive/common/io/DiskRangeList.java:[142,4]
cannot find symbol
[ERROR] symbol:   class VisibleForTesting
[ERROR] location: class org.apache.hadoop.hive.common.io.DiskRangeList
[ERROR] -> [Help 1]
[ERROR] 
[ERROR] To see the full stack trace of the errors, re-run Maven with the -e switch.
[ERROR] Re-run Maven using the -X switch to enable full debug logging.
[ERROR] 
[ERROR] For more information about the errors and possible solutions, please read the following
articles:
[ERROR] [Help 1] http://cwiki.apache.org/confluence/display/MAVEN/MojoFailureException
[ERROR] 
[ERROR] After correcting the problems, you can resume the build with the command
[ERROR]   mvn <goals> -rf :hive-storage-api
+ exit 1
'
{noformat}

This message is automatically generated.

ATTACHMENT ID: 12752363 - PreCommit-HIVE-TRUNK-Build

> LLAP: make sure tests pass #3
> -----------------------------
>
>                 Key: HIVE-11642
>                 URL: https://issues.apache.org/jira/browse/HIVE-11642
>             Project: Hive
>          Issue Type: Sub-task
>            Reporter: Sergey Shelukhin
>            Assignee: Sergey Shelukhin
>         Attachments: HIVE-11642.01.patch, HIVE-11642.patch
>
>
> Tests should pass against the most recent branch and Tez 0.8.



--
This message was sent by Atlassian JIRA
(v6.3.4#6332)

Mime
View raw message