hive-issues mailing list archives

Site index · List index
Message view « Date » · « Thread »
Top « Date » · « Thread »
From "Hive QA (JIRA)" <j...@apache.org>
Subject [jira] [Commented] (HIVE-11647) Bump hbase version to 1.1.1
Date Wed, 02 Sep 2015 16:25:45 GMT

    [ https://issues.apache.org/jira/browse/HIVE-11647?page=com.atlassian.jira.plugin.system.issuetabpanels:comment-tabpanel&focusedCommentId=14727575#comment-14727575
] 

Hive QA commented on HIVE-11647:
--------------------------------



{color:red}Overall{color}: -1 no tests executed

Here are the results of testing the latest attachment:
https://issues.apache.org/jira/secure/attachment/12753657/HIVE-11647.1.patch.txt

Test results: http://ec2-174-129-184-35.compute-1.amazonaws.com/jenkins/job/PreCommit-HIVE-TRUNK-Build/5150/testReport
Console output: http://ec2-174-129-184-35.compute-1.amazonaws.com/jenkins/job/PreCommit-HIVE-TRUNK-Build/5150/console
Test logs: http://ec2-174-129-184-35.compute-1.amazonaws.com/logs/PreCommit-HIVE-TRUNK-Build-5150/

Messages:
{noformat}
**** This message was trimmed, see log for full details ****
[INFO] 
[INFO] --- maven-clean-plugin:2.5:clean (default-clean) @ hive-cli ---
[INFO] Deleting /data/hive-ptest/working/apache-github-source-source/cli/target
[INFO] Deleting /data/hive-ptest/working/apache-github-source-source/cli (includes = [datanucleus.log,
derby.log], excludes = [])
[INFO] 
[INFO] --- maven-enforcer-plugin:1.3.1:enforce (enforce-no-snapshots) @ hive-cli ---
[INFO] 
[INFO] --- maven-remote-resources-plugin:1.5:process (default) @ hive-cli ---
[WARNING] Invalid project model for artifact [pentaho-aggdesigner-algorithm:org.pentaho:5.1.5-jhyde].
It will be ignored by the remote resources Mojo.
[INFO] 
[INFO] --- maven-resources-plugin:2.6:resources (default-resources) @ hive-cli ---
[INFO] Using 'UTF-8' encoding to copy filtered resources.
[INFO] skip non existing resourceDirectory /data/hive-ptest/working/apache-github-source-source/cli/src/main/resources
[INFO] Copying 3 resources
[INFO] 
[INFO] --- maven-antrun-plugin:1.7:run (define-classpath) @ hive-cli ---
[INFO] Executing tasks

main:
[INFO] Executed tasks
[INFO] 
[INFO] --- maven-compiler-plugin:3.1:compile (default-compile) @ hive-cli ---
[INFO] Compiling 4 source files to /data/hive-ptest/working/apache-github-source-source/cli/target/classes
[WARNING] /data/hive-ptest/working/apache-github-source-source/cli/src/java/org/apache/hadoop/hive/cli/CliDriver.java:[80,16]
sun.misc.Signal is internal proprietary API and may be removed in a future release
[WARNING] /data/hive-ptest/working/apache-github-source-source/cli/src/java/org/apache/hadoop/hive/cli/CliDriver.java:[81,16]
sun.misc.SignalHandler is internal proprietary API and may be removed in a future release
[WARNING] /data/hive-ptest/working/apache-github-source-source/cli/src/java/org/apache/hadoop/hive/cli/CliDriver.java:[80,16]
sun.misc.Signal is internal proprietary API and may be removed in a future release
[WARNING] /data/hive-ptest/working/apache-github-source-source/cli/src/java/org/apache/hadoop/hive/cli/CliDriver.java:[81,16]
sun.misc.SignalHandler is internal proprietary API and may be removed in a future release
[WARNING] /data/hive-ptest/working/apache-github-source-source/cli/src/java/org/apache/hadoop/hive/cli/CliDriver.java:[80,16]
sun.misc.Signal is internal proprietary API and may be removed in a future release
[WARNING] /data/hive-ptest/working/apache-github-source-source/cli/src/java/org/apache/hadoop/hive/cli/CliDriver.java:[81,16]
sun.misc.SignalHandler is internal proprietary API and may be removed in a future release
[WARNING] /data/hive-ptest/working/apache-github-source-source/cli/src/java/org/apache/hadoop/hive/cli/CliDriver.java:[325,5]
sun.misc.SignalHandler is internal proprietary API and may be removed in a future release
[WARNING] /data/hive-ptest/working/apache-github-source-source/cli/src/java/org/apache/hadoop/hive/cli/CliDriver.java:[326,5]
sun.misc.Signal is internal proprietary API and may be removed in a future release
[WARNING] /data/hive-ptest/working/apache-github-source-source/cli/src/java/org/apache/hadoop/hive/cli/CliDriver.java:[331,29]
sun.misc.Signal is internal proprietary API and may be removed in a future release
[WARNING] /data/hive-ptest/working/apache-github-source-source/cli/src/java/org/apache/hadoop/hive/cli/CliDriver.java:[332,54]
sun.misc.SignalHandler is internal proprietary API and may be removed in a future release
[WARNING] /data/hive-ptest/working/apache-github-source-source/cli/src/java/org/apache/hadoop/hive/cli/CliDriver.java:[337,28]
sun.misc.Signal is internal proprietary API and may be removed in a future release
[WARNING] /data/hive-ptest/working/apache-github-source-source/cli/src/java/org/apache/hadoop/hive/cli/CliDriver.java:[332,19]
sun.misc.Signal is internal proprietary API and may be removed in a future release
[WARNING] /data/hive-ptest/working/apache-github-source-source/cli/src/java/org/apache/hadoop/hive/cli/CliDriver.java:[393,9]
sun.misc.Signal is internal proprietary API and may be removed in a future release
[WARNING] /data/hive-ptest/working/apache-github-source-source/cli/src/java/org/apache/hadoop/hive/cli/RCFileCat.java:
/data/hive-ptest/working/apache-github-source-source/cli/src/java/org/apache/hadoop/hive/cli/RCFileCat.java
uses or overrides a deprecated API.
[WARNING] /data/hive-ptest/working/apache-github-source-source/cli/src/java/org/apache/hadoop/hive/cli/RCFileCat.java:
Recompile with -Xlint:deprecation for details.
[WARNING] /data/hive-ptest/working/apache-github-source-source/cli/src/java/org/apache/hadoop/hive/cli/CliDriver.java:
/data/hive-ptest/working/apache-github-source-source/cli/src/java/org/apache/hadoop/hive/cli/CliDriver.java
uses unchecked or unsafe operations.
[WARNING] /data/hive-ptest/working/apache-github-source-source/cli/src/java/org/apache/hadoop/hive/cli/CliDriver.java:
Recompile with -Xlint:unchecked for details.
[INFO] 
[INFO] --- maven-resources-plugin:2.6:testResources (default-testResources) @ hive-cli ---
[INFO] Using 'UTF-8' encoding to copy filtered resources.
[INFO] skip non existing resourceDirectory /data/hive-ptest/working/apache-github-source-source/cli/src/test/resources
[INFO] Copying 3 resources
[INFO] 
[INFO] --- maven-antrun-plugin:1.7:run (setup-test-dirs) @ hive-cli ---
[INFO] Executing tasks

main:
    [mkdir] Created dir: /data/hive-ptest/working/apache-github-source-source/cli/target/tmp
    [mkdir] Created dir: /data/hive-ptest/working/apache-github-source-source/cli/target/warehouse
    [mkdir] Created dir: /data/hive-ptest/working/apache-github-source-source/cli/target/tmp/conf
     [copy] Copying 10 files to /data/hive-ptest/working/apache-github-source-source/cli/target/tmp/conf
[INFO] Executed tasks
[INFO] 
[INFO] --- maven-compiler-plugin:3.1:testCompile (default-testCompile) @ hive-cli ---
[INFO] Compiling 4 source files to /data/hive-ptest/working/apache-github-source-source/cli/target/test-classes
[WARNING] /data/hive-ptest/working/apache-github-source-source/cli/src/test/org/apache/hadoop/hive/cli/TestCliDriverMethods.java:
/data/hive-ptest/working/apache-github-source-source/cli/src/test/org/apache/hadoop/hive/cli/TestCliDriverMethods.java
uses unchecked or unsafe operations.
[WARNING] /data/hive-ptest/working/apache-github-source-source/cli/src/test/org/apache/hadoop/hive/cli/TestCliDriverMethods.java:
Recompile with -Xlint:unchecked for details.
[INFO] 
[INFO] --- maven-surefire-plugin:2.16:test (default-test) @ hive-cli ---
[INFO] Tests are skipped.
[INFO] 
[INFO] --- maven-jar-plugin:2.2:jar (default-jar) @ hive-cli ---
[INFO] Building jar: /data/hive-ptest/working/apache-github-source-source/cli/target/hive-cli-2.0.0-SNAPSHOT.jar
[INFO] 
[INFO] --- maven-site-plugin:3.3:attach-descriptor (attach-descriptor) @ hive-cli ---
[INFO] 
[INFO] --- maven-install-plugin:2.4:install (default-install) @ hive-cli ---
[INFO] Installing /data/hive-ptest/working/apache-github-source-source/cli/target/hive-cli-2.0.0-SNAPSHOT.jar
to /home/hiveptest/.m2/repository/org/apache/hive/hive-cli/2.0.0-SNAPSHOT/hive-cli-2.0.0-SNAPSHOT.jar
[INFO] Installing /data/hive-ptest/working/apache-github-source-source/cli/pom.xml to /home/hiveptest/.m2/repository/org/apache/hive/hive-cli/2.0.0-SNAPSHOT/hive-cli-2.0.0-SNAPSHOT.pom
[INFO]                                                                         
[INFO] ------------------------------------------------------------------------
[INFO] Building Hive Contrib 2.0.0-SNAPSHOT
[INFO] ------------------------------------------------------------------------
[INFO] 
[INFO] --- maven-clean-plugin:2.5:clean (default-clean) @ hive-contrib ---
[INFO] Deleting /data/hive-ptest/working/apache-github-source-source/contrib/target
[INFO] Deleting /data/hive-ptest/working/apache-github-source-source/contrib (includes = [datanucleus.log,
derby.log], excludes = [])
[INFO] 
[INFO] --- maven-enforcer-plugin:1.3.1:enforce (enforce-no-snapshots) @ hive-contrib ---
[INFO] 
[INFO] --- maven-remote-resources-plugin:1.5:process (default) @ hive-contrib ---
[WARNING] Invalid project model for artifact [pentaho-aggdesigner-algorithm:org.pentaho:5.1.5-jhyde].
It will be ignored by the remote resources Mojo.
[INFO] 
[INFO] --- maven-resources-plugin:2.6:resources (default-resources) @ hive-contrib ---
[INFO] Using 'UTF-8' encoding to copy filtered resources.
[INFO] skip non existing resourceDirectory /data/hive-ptest/working/apache-github-source-source/contrib/src/main/resources
[INFO] Copying 3 resources
[INFO] 
[INFO] --- maven-antrun-plugin:1.7:run (define-classpath) @ hive-contrib ---
[INFO] Executing tasks

main:
[INFO] Executed tasks
[INFO] 
[INFO] --- maven-compiler-plugin:3.1:compile (default-compile) @ hive-contrib ---
[INFO] Compiling 40 source files to /data/hive-ptest/working/apache-github-source-source/contrib/target/classes
[WARNING] /data/hive-ptest/working/apache-github-source-source/contrib/src/java/org/apache/hadoop/hive/contrib/udaf/example/UDAFExampleMax.java:
Some input files use or override a deprecated API.
[WARNING] /data/hive-ptest/working/apache-github-source-source/contrib/src/java/org/apache/hadoop/hive/contrib/udaf/example/UDAFExampleMax.java:
Recompile with -Xlint:deprecation for details.
[WARNING] /data/hive-ptest/working/apache-github-source-source/contrib/src/java/org/apache/hadoop/hive/contrib/udf/example/UDFExampleStructPrint.java:
/data/hive-ptest/working/apache-github-source-source/contrib/src/java/org/apache/hadoop/hive/contrib/udf/example/UDFExampleStructPrint.java
uses unchecked or unsafe operations.
[WARNING] /data/hive-ptest/working/apache-github-source-source/contrib/src/java/org/apache/hadoop/hive/contrib/udf/example/UDFExampleStructPrint.java:
Recompile with -Xlint:unchecked for details.
[INFO] 
[INFO] --- maven-resources-plugin:2.6:testResources (default-testResources) @ hive-contrib
---
[INFO] Using 'UTF-8' encoding to copy filtered resources.
[INFO] skip non existing resourceDirectory /data/hive-ptest/working/apache-github-source-source/contrib/src/test/resources
[INFO] Copying 3 resources
[INFO] 
[INFO] --- maven-antrun-plugin:1.7:run (setup-test-dirs) @ hive-contrib ---
[INFO] Executing tasks

main:
    [mkdir] Created dir: /data/hive-ptest/working/apache-github-source-source/contrib/target/tmp
    [mkdir] Created dir: /data/hive-ptest/working/apache-github-source-source/contrib/target/warehouse
    [mkdir] Created dir: /data/hive-ptest/working/apache-github-source-source/contrib/target/tmp/conf
     [copy] Copying 10 files to /data/hive-ptest/working/apache-github-source-source/contrib/target/tmp/conf
[INFO] Executed tasks
[INFO] 
[INFO] --- maven-compiler-plugin:3.1:testCompile (default-testCompile) @ hive-contrib ---
[INFO] Compiling 2 source files to /data/hive-ptest/working/apache-github-source-source/contrib/target/test-classes
[WARNING] /data/hive-ptest/working/apache-github-source-source/contrib/src/test/org/apache/hadoop/hive/contrib/serde2/TestRegexSerDe.java:
/data/hive-ptest/working/apache-github-source-source/contrib/src/test/org/apache/hadoop/hive/contrib/serde2/TestRegexSerDe.java
uses or overrides a deprecated API.
[WARNING] /data/hive-ptest/working/apache-github-source-source/contrib/src/test/org/apache/hadoop/hive/contrib/serde2/TestRegexSerDe.java:
Recompile with -Xlint:deprecation for details.
[INFO] 
[INFO] --- maven-surefire-plugin:2.16:test (default-test) @ hive-contrib ---
[INFO] Tests are skipped.
[INFO] 
[INFO] --- maven-jar-plugin:2.2:jar (default-jar) @ hive-contrib ---
[INFO] Building jar: /data/hive-ptest/working/apache-github-source-source/contrib/target/hive-contrib-2.0.0-SNAPSHOT.jar
[INFO] 
[INFO] --- maven-site-plugin:3.3:attach-descriptor (attach-descriptor) @ hive-contrib ---
[INFO] 
[INFO] --- maven-install-plugin:2.4:install (default-install) @ hive-contrib ---
[INFO] Installing /data/hive-ptest/working/apache-github-source-source/contrib/target/hive-contrib-2.0.0-SNAPSHOT.jar
to /home/hiveptest/.m2/repository/org/apache/hive/hive-contrib/2.0.0-SNAPSHOT/hive-contrib-2.0.0-SNAPSHOT.jar
[INFO] Installing /data/hive-ptest/working/apache-github-source-source/contrib/pom.xml to
/home/hiveptest/.m2/repository/org/apache/hive/hive-contrib/2.0.0-SNAPSHOT/hive-contrib-2.0.0-SNAPSHOT.pom
[INFO]                                                                         
[INFO] ------------------------------------------------------------------------
[INFO] Building Hive HBase Handler 2.0.0-SNAPSHOT
[INFO] ------------------------------------------------------------------------
Downloading: http://www.datanucleus.org/downloads/maven2/org/apache/hbase/hbase-hadoop1-compat/1.1.1/hbase-hadoop1-compat-1.1.1.pom

Downloading: https://s3-us-west-1.amazonaws.com/hive-spark/maven2/spark_2.10-1.3-rc1/org/apache/hbase/hbase-hadoop1-compat/1.1.1/hbase-hadoop1-compat-1.1.1.pom

Downloading: http://repo.maven.apache.org/maven2/org/apache/hbase/hbase-hadoop1-compat/1.1.1/hbase-hadoop1-compat-1.1.1.pom

[INFO] ------------------------------------------------------------------------
[INFO] Reactor Summary:
[INFO] 
[INFO] Hive .............................................. SUCCESS [13.887s]
[INFO] Hive Shims Common ................................. SUCCESS [15.264s]
[INFO] Hive Shims 0.20S .................................. SUCCESS [4.224s]
[INFO] Hive Shims 0.23 ................................... SUCCESS [10.341s]
[INFO] Hive Shims Scheduler .............................. SUCCESS [2.094s]
[INFO] Hive Shims ........................................ SUCCESS [2.833s]
[INFO] Hive Storage API .................................. SUCCESS [3.024s]
[INFO] Hive Common ....................................... SUCCESS [20.575s]
[INFO] Hive Serde ........................................ SUCCESS [16.903s]
[INFO] Hive Metastore .................................... SUCCESS [47.712s]
[INFO] Hive Ant Utilities ................................ SUCCESS [1.840s]
[INFO] Spark Remote Client ............................... SUCCESS [21.871s]
[INFO] Hive Query Language ............................... SUCCESS [3:14.916s]
[INFO] Hive Service ...................................... SUCCESS [13.339s]
[INFO] Hive Accumulo Handler ............................. SUCCESS [8.112s]
[INFO] Hive JDBC ......................................... SUCCESS [17.525s]
[INFO] Hive Beeline ...................................... SUCCESS [2.826s]
[INFO] Hive CLI .......................................... SUCCESS [3.815s]
[INFO] Hive Contrib ...................................... SUCCESS [2.576s]
[INFO] Hive HBase Handler ................................ FAILURE [1.252s]
[INFO] Hive HCatalog ..................................... SKIPPED
[INFO] Hive HCatalog Core ................................ SKIPPED
[INFO] Hive HCatalog Pig Adapter ......................... SKIPPED
[INFO] Hive HCatalog Server Extensions ................... SKIPPED
[INFO] Hive HCatalog Webhcat Java Client ................. SKIPPED
[INFO] Hive HCatalog Webhcat ............................. SKIPPED
[INFO] Hive HCatalog Streaming ........................... SKIPPED
[INFO] Hive HPL/SQL ...................................... SKIPPED
[INFO] Hive HWI .......................................... SKIPPED
[INFO] Hive ODBC ......................................... SKIPPED
[INFO] Hive Shims Aggregator ............................. SKIPPED
[INFO] Hive TestUtils .................................... SKIPPED
[INFO] Hive Packaging .................................... SKIPPED
[INFO] ------------------------------------------------------------------------
[INFO] BUILD FAILURE
[INFO] ------------------------------------------------------------------------
[INFO] Total time: 6:47.994s
[INFO] Finished at: Wed Sep 02 12:24:49 EDT 2015
[INFO] Final Memory: 193M/941M
[INFO] ------------------------------------------------------------------------
[ERROR] Failed to execute goal on project hive-hbase-handler: Could not resolve dependencies
for project org.apache.hive:hive-hbase-handler:jar:2.0.0-SNAPSHOT: Failed to collect dependencies
for [org.apache.hive:hive-exec:jar:2.0.0-SNAPSHOT (compile), commons-lang:commons-lang:jar:2.6
(compile), commons-logging:commons-logging:jar:1.1.3 (compile), junit:junit:jar:4.11 (test),
org.apache.avro:avro:jar:1.7.6 (compile), org.apache.hadoop:hadoop-core:jar:1.2.1 (compile?),
org.apache.hbase:hbase-hadoop1-compat:jar:tests:1.1.1 (compile), org.apache.hbase:hbase-hadoop1-compat:jar:1.1.1
(compile), org.apache.hbase:hbase-client:jar:1.1.1 (compile), org.apache.hbase:hbase-server:jar:1.1.1
(compile), org.apache.hbase:hbase-common:jar:1.1.1 (compile), org.apache.hbase:hbase-hadoop-compat:jar:1.1.1
(compile), org.apache.hadoop:hadoop-test:jar:1.2.1 (test), org.apache.hbase:hbase-common:jar:tests:1.1.1
(test), org.apache.hbase:hbase-server:jar:tests:1.1.1 (test), org.apache.hbase:hbase-hadoop-compat:jar:tests:1.1.1
(test), org.slf4j:slf4j-api:jar:1.7.5 (compile)]: Failed to read artifact descriptor for org.apache.hbase:hbase-hadoop1-compat:jar:tests:1.1.1:
Could not transfer artifact org.apache.hbase:hbase-hadoop1-compat:pom:1.1.1 from/to spark-1.3
(https://s3-us-west-1.amazonaws.com/hive-spark/maven2/spark_2.10-1.3-rc1/): Access denied
to: https://s3-us-west-1.amazonaws.com/hive-spark/maven2/spark_2.10-1.3-rc1/org/apache/hbase/hbase-hadoop1-compat/1.1.1/hbase-hadoop1-compat-1.1.1.pom
, ReasonPhrase:Forbidden. -> [Help 1]
[ERROR] 
[ERROR] To see the full stack trace of the errors, re-run Maven with the -e switch.
[ERROR] Re-run Maven using the -X switch to enable full debug logging.
[ERROR] 
[ERROR] For more information about the errors and possible solutions, please read the following
articles:
[ERROR] [Help 1] http://cwiki.apache.org/confluence/display/MAVEN/DependencyResolutionException
[ERROR] 
[ERROR] After correcting the problems, you can resume the build with the command
[ERROR]   mvn <goals> -rf :hive-hbase-handler
+ exit 1
'
{noformat}

This message is automatically generated.

ATTACHMENT ID: 12753657 - PreCommit-HIVE-TRUNK-Build

> Bump hbase version to 1.1.1
> ---------------------------
>
>                 Key: HIVE-11647
>                 URL: https://issues.apache.org/jira/browse/HIVE-11647
>             Project: Hive
>          Issue Type: Sub-task
>          Components: HBase Handler
>            Reporter: Swarnim Kulkarni
>            Assignee: Swarnim Kulkarni
>         Attachments: HIVE-11647.1.patch.txt
>
>




--
This message was sent by Atlassian JIRA
(v6.3.4#6332)

Mime
View raw message