hive-issues mailing list archives

Site index · List index
Message view « Date » · « Thread »
Top « Date » · « Thread »
From "Hive QA (JIRA)" <j...@apache.org>
Subject [jira] [Commented] (HIVE-6113) Unable to instantiate org.apache.hadoop.hive.metastore.HiveMetaStoreClient
Date Mon, 16 Nov 2015 19:22:11 GMT

    [ https://issues.apache.org/jira/browse/HIVE-6113?page=com.atlassian.jira.plugin.system.issuetabpanels:comment-tabpanel&focusedCommentId=15007158#comment-15007158 ] 

Hive QA commented on HIVE-6113:
-------------------------------



Here are the results of testing the latest attachment:
https://issues.apache.org/jira/secure/attachment/12772479/HIVE-6113.patch

{color:red}ERROR:{color} -1 due to no test(s) being added or modified.

{color:red}ERROR:{color} -1 due to 898 failed/errored test(s), 5641 tests executed
*Failed tests:*
{noformat}
TestFilterHooks - did not produce a TEST-*.xml file
TestHS2ImpersonationWithRemoteMS - did not produce a TEST-*.xml file
TestHWISessionManager - did not produce a TEST-*.xml file
TestMetastoreAuthorizationProvider - did not produce a TEST-*.xml file
TestPartitionNameWhitelistValidation - did not produce a TEST-*.xml file
TestRemoteHiveMetaStore - did not produce a TEST-*.xml file
TestSetUGIOnBothClientServer - did not produce a TEST-*.xml file
TestSetUGIOnOnlyClient - did not produce a TEST-*.xml file
TestSetUGIOnOnlyServer - did not produce a TEST-*.xml file
TestStorageBasedMetastoreAuthorizationDrops - did not produce a TEST-*.xml file
TestStorageBasedMetastoreAuthorizationReads - did not produce a TEST-*.xml file
org.apache.hadoop.hive.cli.TestCliDriver.initializationError
org.apache.hadoop.hive.cli.TestCliDriverMethods.testProcessSelectDatabase
org.apache.hadoop.hive.cli.TestCliDriverMethods.testQuit
org.apache.hadoop.hive.cli.TestCliDriverMethods.testRun
org.apache.hadoop.hive.cli.TestCliDriverMethods.testprocessInitFiles
org.apache.hadoop.hive.cli.TestCliSessionState.testgetDbName
org.apache.hadoop.hive.cli.TestCompareCliDriver.initializationError
org.apache.hadoop.hive.cli.TestContribCliDriver.initializationError
org.apache.hadoop.hive.cli.TestContribNegativeCliDriver.initializationError
org.apache.hadoop.hive.cli.TestEncryptedHDFSCliDriver.initializationError
org.apache.hadoop.hive.cli.TestHBaseCliDriver.testCliDriver_external_table_ppd
org.apache.hadoop.hive.cli.TestHBaseCliDriver.testCliDriver_hbase_binary_external_table_queries
org.apache.hadoop.hive.cli.TestHBaseCliDriver.testCliDriver_hbase_binary_map_queries
org.apache.hadoop.hive.cli.TestHBaseCliDriver.testCliDriver_hbase_binary_map_queries_prefix
org.apache.hadoop.hive.cli.TestHBaseCliDriver.testCliDriver_hbase_binary_storage_queries
org.apache.hadoop.hive.cli.TestHBaseCliDriver.testCliDriver_hbase_custom_key
org.apache.hadoop.hive.cli.TestHBaseCliDriver.testCliDriver_hbase_custom_key2
org.apache.hadoop.hive.cli.TestHBaseCliDriver.testCliDriver_hbase_custom_key3
org.apache.hadoop.hive.cli.TestHBaseCliDriver.testCliDriver_hbase_handler_bulk
org.apache.hadoop.hive.cli.TestHBaseCliDriver.testCliDriver_hbase_handler_snapshot
org.apache.hadoop.hive.cli.TestHBaseCliDriver.testCliDriver_hbase_joins
org.apache.hadoop.hive.cli.TestHBaseCliDriver.testCliDriver_hbase_null_first_col
org.apache.hadoop.hive.cli.TestHBaseCliDriver.testCliDriver_hbase_ppd_join
org.apache.hadoop.hive.cli.TestHBaseCliDriver.testCliDriver_hbase_ppd_key_range
org.apache.hadoop.hive.cli.TestHBaseCliDriver.testCliDriver_hbase_pushdown
org.apache.hadoop.hive.cli.TestHBaseCliDriver.testCliDriver_hbase_queries
org.apache.hadoop.hive.cli.TestHBaseCliDriver.testCliDriver_hbase_scan_params
org.apache.hadoop.hive.cli.TestHBaseCliDriver.testCliDriver_hbase_single_sourced_multi_insert
org.apache.hadoop.hive.cli.TestHBaseCliDriver.testCliDriver_hbase_stats3
org.apache.hadoop.hive.cli.TestHBaseCliDriver.testCliDriver_hbase_timestamp
org.apache.hadoop.hive.cli.TestHBaseCliDriver.testCliDriver_hbase_timestamp_format
org.apache.hadoop.hive.cli.TestHBaseCliDriver.testCliDriver_ppd_key_ranges
org.apache.hadoop.hive.cli.TestHBaseMinimrCliDriver.testCliDriver_hbase_bulk
org.apache.hadoop.hive.cli.TestHBaseNegativeCliDriver.testCliDriver_cascade_dbdrop
org.apache.hadoop.hive.cli.TestHBaseNegativeCliDriver.testCliDriver_cascade_dbdrop_hadoop20
org.apache.hadoop.hive.cli.TestHBaseNegativeCliDriver.testCliDriver_generatehfiles_require_family_path
org.apache.hadoop.hive.cli.TestMiniLlapCliDriver.initializationError
org.apache.hadoop.hive.cli.TestMiniSparkOnYarnCliDriver.initializationError
org.apache.hadoop.hive.cli.TestMinimrCliDriver.initializationError
org.apache.hadoop.hive.cli.TestNegativeCliDriver.initializationError
org.apache.hadoop.hive.cli.TestNegativeMinimrCliDriver.initializationError
org.apache.hadoop.hive.cli.TestSparkCliDriver.initializationError
org.apache.hadoop.hive.cli.TestSparkNegativeCliDriver.initializationError
org.apache.hadoop.hive.hooks.TestHs2Hooks.org.apache.hadoop.hive.hooks.TestHs2Hooks
org.apache.hadoop.hive.metastore.TestAdminUser.testCreateAdminNAddUser
org.apache.hadoop.hive.metastore.TestAuthzApiEmbedAuthorizerInEmbed.org.apache.hadoop.hive.metastore.TestAuthzApiEmbedAuthorizerInEmbed
org.apache.hadoop.hive.metastore.TestAuthzApiEmbedAuthorizerInRemote.testCreateRole
org.apache.hadoop.hive.metastore.TestAuthzApiEmbedAuthorizerInRemote.testDropRole
org.apache.hadoop.hive.metastore.TestAuthzApiEmbedAuthorizerInRemote.testGetPrivSet
org.apache.hadoop.hive.metastore.TestAuthzApiEmbedAuthorizerInRemote.testGrantPriv
org.apache.hadoop.hive.metastore.TestAuthzApiEmbedAuthorizerInRemote.testGrantRole
org.apache.hadoop.hive.metastore.TestAuthzApiEmbedAuthorizerInRemote.testListPriv
org.apache.hadoop.hive.metastore.TestAuthzApiEmbedAuthorizerInRemote.testListRoles
org.apache.hadoop.hive.metastore.TestAuthzApiEmbedAuthorizerInRemote.testRevokePriv
org.apache.hadoop.hive.metastore.TestAuthzApiEmbedAuthorizerInRemote.testRevokeRole
org.apache.hadoop.hive.metastore.TestEmbeddedHiveMetaStore.testAlterPartition
org.apache.hadoop.hive.metastore.TestEmbeddedHiveMetaStore.testAlterTable
org.apache.hadoop.hive.metastore.TestEmbeddedHiveMetaStore.testAlterViewParititon
org.apache.hadoop.hive.metastore.TestEmbeddedHiveMetaStore.testColumnStatistics
org.apache.hadoop.hive.metastore.TestEmbeddedHiveMetaStore.testComplexTable
org.apache.hadoop.hive.metastore.TestEmbeddedHiveMetaStore.testComplexTypeApi
org.apache.hadoop.hive.metastore.TestEmbeddedHiveMetaStore.testConcurrentMetastores
org.apache.hadoop.hive.metastore.TestEmbeddedHiveMetaStore.testDBOwner
org.apache.hadoop.hive.metastore.TestEmbeddedHiveMetaStore.testDBOwnerChange
org.apache.hadoop.hive.metastore.TestEmbeddedHiveMetaStore.testDatabase
org.apache.hadoop.hive.metastore.TestEmbeddedHiveMetaStore.testDatabaseLocation
org.apache.hadoop.hive.metastore.TestEmbeddedHiveMetaStore.testDatabaseLocationWithPermissionProblems
org.apache.hadoop.hive.metastore.TestEmbeddedHiveMetaStore.testDropTable
org.apache.hadoop.hive.metastore.TestEmbeddedHiveMetaStore.testFilterLastPartition
org.apache.hadoop.hive.metastore.TestEmbeddedHiveMetaStore.testFilterSinglePartition
org.apache.hadoop.hive.metastore.TestEmbeddedHiveMetaStore.testFunctionWithResources
org.apache.hadoop.hive.metastore.TestEmbeddedHiveMetaStore.testGetConfigValue
org.apache.hadoop.hive.metastore.TestEmbeddedHiveMetaStore.testGetTableObjects
org.apache.hadoop.hive.metastore.TestEmbeddedHiveMetaStore.testListPartitionNames
org.apache.hadoop.hive.metastore.TestEmbeddedHiveMetaStore.testListPartitions
org.apache.hadoop.hive.metastore.TestEmbeddedHiveMetaStore.testNameMethods
org.apache.hadoop.hive.metastore.TestEmbeddedHiveMetaStore.testPartition
org.apache.hadoop.hive.metastore.TestEmbeddedHiveMetaStore.testPartitionFilter
org.apache.hadoop.hive.metastore.TestEmbeddedHiveMetaStore.testRenamePartition
org.apache.hadoop.hive.metastore.TestEmbeddedHiveMetaStore.testRetriableClientWithConnLifetime
org.apache.hadoop.hive.metastore.TestEmbeddedHiveMetaStore.testSimpleFunction
org.apache.hadoop.hive.metastore.TestEmbeddedHiveMetaStore.testSimpleTable
org.apache.hadoop.hive.metastore.TestEmbeddedHiveMetaStore.testSimpleTypeApi
org.apache.hadoop.hive.metastore.TestEmbeddedHiveMetaStore.testStatsFastTrivial
org.apache.hadoop.hive.metastore.TestEmbeddedHiveMetaStore.testSynchronized
org.apache.hadoop.hive.metastore.TestEmbeddedHiveMetaStore.testTableDatabase
org.apache.hadoop.hive.metastore.TestEmbeddedHiveMetaStore.testTableFilter
org.apache.hadoop.hive.metastore.TestEmbeddedHiveMetaStore.testValidateTableCols
org.apache.hadoop.hive.metastore.TestHiveMetaStorePartitionSpecs.testAddPartitions
org.apache.hadoop.hive.metastore.TestHiveMetaStorePartitionSpecs.testFetchingPartitionsWithDifferentSchemas
org.apache.hadoop.hive.metastore.TestHiveMetaStorePartitionSpecs.testGetPartitionSpecs_WithAndWithoutPartitionGrouping
org.apache.hadoop.hive.metastore.TestHiveMetaStoreTimeout.org.apache.hadoop.hive.metastore.TestHiveMetaStoreTimeout
org.apache.hadoop.hive.metastore.TestHiveMetaStoreTxns.stringifyValidTxns
org.apache.hadoop.hive.metastore.TestHiveMetaStoreTxns.testLocks
org.apache.hadoop.hive.metastore.TestHiveMetaStoreTxns.testLocksWithTxn
org.apache.hadoop.hive.metastore.TestHiveMetaStoreTxns.testOpenTxnNotExcluded
org.apache.hadoop.hive.metastore.TestHiveMetaStoreTxns.testTxnRange
org.apache.hadoop.hive.metastore.TestHiveMetaStoreTxns.testTxns
org.apache.hadoop.hive.metastore.TestHiveMetaStoreWithEnvironmentContext.testEnvironmentContext
org.apache.hadoop.hive.metastore.TestHiveMetaTool.testExecuteJDOQL
org.apache.hadoop.hive.metastore.TestHiveMetaTool.testListFSRoot
org.apache.hadoop.hive.metastore.TestHiveMetaTool.testUpdateFSRootLocation
org.apache.hadoop.hive.metastore.TestMarkPartition.testMarkingPartitionSet
org.apache.hadoop.hive.metastore.TestMarkPartitionRemote.testMarkingPartitionSet
org.apache.hadoop.hive.metastore.TestMetaStoreAuthorization.testMetaStoreAuthorization
org.apache.hadoop.hive.metastore.TestMetaStoreEndFunctionListener.testEndFunctionListener
org.apache.hadoop.hive.metastore.TestMetaStoreEventListener.testListener
org.apache.hadoop.hive.metastore.TestMetaStoreEventListenerOnlyOnCommit.testEventStatus
org.apache.hadoop.hive.metastore.TestMetaStoreListenersError.testEventListenerException
org.apache.hadoop.hive.metastore.TestMetaStoreMetrics.testConnections
org.apache.hadoop.hive.metastore.TestMetaStoreMetrics.testMetricsFile
org.apache.hadoop.hive.metastore.TestMetastoreExpr.testPartitionExpr
org.apache.hadoop.hive.metastore.TestMetastoreVersion.testMetastoreVersion
org.apache.hadoop.hive.metastore.TestMetastoreVersion.testVersionMatching
org.apache.hadoop.hive.metastore.TestMetastoreVersion.testVersionMisMatch
org.apache.hadoop.hive.metastore.TestMetastoreVersion.testVersionRestriction
org.apache.hadoop.hive.metastore.TestObjectStore.testDatabaseOps
org.apache.hadoop.hive.metastore.TestObjectStore.testMasterKeyOps
org.apache.hadoop.hive.metastore.TestObjectStore.testPartitionOps
org.apache.hadoop.hive.metastore.TestObjectStore.testRoleOps
org.apache.hadoop.hive.metastore.TestObjectStore.testTableOps
org.apache.hadoop.hive.metastore.TestRemoteHiveMetaStoreIpAddress.testIpAddress
org.apache.hadoop.hive.metastore.TestRemoteUGIHiveMetaStoreIpAddress.testIpAddress
org.apache.hadoop.hive.metastore.TestRetryingHMSHandler.testRetryingHMSHandler
org.apache.hadoop.hive.metastore.hbase.TestHBaseImport.org.apache.hadoop.hive.metastore.hbase.TestHBaseImport
org.apache.hadoop.hive.metastore.txn.TestCompactionTxnHandler.testRevokeTimedOutWorkers
org.apache.hadoop.hive.ql.TestCreateUdfEntities.testUdfWithDfsResource
org.apache.hadoop.hive.ql.TestCreateUdfEntities.testUdfWithLocalResource
org.apache.hadoop.hive.ql.TestDDLWithRemoteMetastoreSecondNamenode.testCreateDatabaseWithTableNonDefaultNameNode
org.apache.hadoop.hive.ql.TestDDLWithRemoteMetastoreSecondNamenode.testCreateTableWithIndexAndPartitionsNonDefaultNameNode
org.apache.hadoop.hive.ql.TestLocationQueries.testAlterTablePartitionLocation_alter5
org.apache.hadoop.hive.ql.TestMTQueries.testMTQueries1
org.apache.hadoop.hive.ql.TestTxnCommands.exchangePartition
org.apache.hadoop.hive.ql.TestTxnCommands.testDelete
org.apache.hadoop.hive.ql.TestTxnCommands.testDeleteIn
org.apache.hadoop.hive.ql.TestTxnCommands.testErrors
org.apache.hadoop.hive.ql.TestTxnCommands.testExplicitRollback
org.apache.hadoop.hive.ql.TestTxnCommands.testImplicitRollback
org.apache.hadoop.hive.ql.TestTxnCommands.testInsertOverwrite
org.apache.hadoop.hive.ql.TestTxnCommands.testMultipleDelete
org.apache.hadoop.hive.ql.TestTxnCommands.testMultipleInserts
org.apache.hadoop.hive.ql.TestTxnCommands.testReadMyOwnInsert
org.apache.hadoop.hive.ql.TestTxnCommands.testSimpleAcidInsert
org.apache.hadoop.hive.ql.TestTxnCommands.testTimeOutReaper
org.apache.hadoop.hive.ql.TestTxnCommands.testUpdateDeleteOfInserts
org.apache.hadoop.hive.ql.TestTxnCommands.testUpdateOfInserts
org.apache.hadoop.hive.ql.TestTxnCommands2.testBucketizedInputFormat
org.apache.hadoop.hive.ql.TestTxnCommands2.testDeleteIn
org.apache.hadoop.hive.ql.TestTxnCommands2.testInsertOverwriteWithSelfJoin
org.apache.hadoop.hive.ql.TestTxnCommands2.testOrcNoPPD
org.apache.hadoop.hive.ql.TestTxnCommands2.testOrcPPD
org.apache.hadoop.hive.ql.TestTxnCommands2.testUpdateMixedCase
org.apache.hadoop.hive.ql.exec.TestExecDriver.initializationError
org.apache.hadoop.hive.ql.exec.TestFunctionRegistry.testCommonClass
org.apache.hadoop.hive.ql.exec.TestFunctionRegistry.testCommonClassComparison
org.apache.hadoop.hive.ql.exec.TestFunctionRegistry.testCommonClassUnionAll
org.apache.hadoop.hive.ql.exec.TestFunctionRegistry.testGetMethodInternal
org.apache.hadoop.hive.ql.exec.TestFunctionRegistry.testGetTypeInfoForPrimitiveCategory
org.apache.hadoop.hive.ql.exec.TestFunctionRegistry.testImplicitConversion
org.apache.hadoop.hive.ql.exec.TestFunctionRegistry.testImpliesOrder
org.apache.hadoop.hive.ql.exec.TestFunctionRegistry.testIsRankingFunction
org.apache.hadoop.hive.ql.exec.TestFunctionRegistry.testPrintTypeCompatibility
org.apache.hadoop.hive.ql.exec.TestFunctionRegistry.testTypeAffinity
org.apache.hadoop.hive.ql.exec.TestOperators.testFetchOperatorContext
org.apache.hadoop.hive.ql.exec.TestOperators.testScriptOperator
org.apache.hadoop.hive.ql.exec.TestUtilities.testgetDbTableName
org.apache.hadoop.hive.ql.exec.tez.TestTezTask.testBuildDag
org.apache.hadoop.hive.ql.exec.tez.TestTezTask.testClose
org.apache.hadoop.hive.ql.exec.tez.TestTezTask.testEmptyWork
org.apache.hadoop.hive.ql.exec.tez.TestTezTask.testExistingSessionGetsStorageHandlerResources
org.apache.hadoop.hive.ql.exec.tez.TestTezTask.testExtraResourcesAddedToDag
org.apache.hadoop.hive.ql.exec.tez.TestTezTask.testGetExtraLocalResources
org.apache.hadoop.hive.ql.exec.tez.TestTezTask.testSubmit
org.apache.hadoop.hive.ql.history.TestHiveHistory.testHiveHistoryConfigDisabled
org.apache.hadoop.hive.ql.history.TestHiveHistory.testHiveHistoryConfigEnabled
org.apache.hadoop.hive.ql.history.TestHiveHistory.testQueryloglocParentDirNotExist
org.apache.hadoop.hive.ql.history.TestHiveHistory.testSimpleQuery
org.apache.hadoop.hive.ql.hooks.TestHooks.org.apache.hadoop.hive.ql.hooks.TestHooks
org.apache.hadoop.hive.ql.io.TestSymlinkTextInputFormat.testCombine
org.apache.hadoop.hive.ql.lockmgr.TestDbTxnManager.concurrencyFalse
org.apache.hadoop.hive.ql.lockmgr.TestDbTxnManager.testDDLExclusive
org.apache.hadoop.hive.ql.lockmgr.TestDbTxnManager.testDDLNoLock
org.apache.hadoop.hive.ql.lockmgr.TestDbTxnManager.testDDLShared
org.apache.hadoop.hive.ql.lockmgr.TestDbTxnManager.testDelete
org.apache.hadoop.hive.ql.lockmgr.TestDbTxnManager.testExceptions
org.apache.hadoop.hive.ql.lockmgr.TestDbTxnManager.testJoin
org.apache.hadoop.hive.ql.lockmgr.TestDbTxnManager.testReadWrite
org.apache.hadoop.hive.ql.lockmgr.TestDbTxnManager.testRollback
org.apache.hadoop.hive.ql.lockmgr.TestDbTxnManager.testSingleReadMultiPartition
org.apache.hadoop.hive.ql.lockmgr.TestDbTxnManager.testSingleReadPartition
org.apache.hadoop.hive.ql.lockmgr.TestDbTxnManager.testSingleReadTable
org.apache.hadoop.hive.ql.lockmgr.TestDbTxnManager.testSingleWritePartition
org.apache.hadoop.hive.ql.lockmgr.TestDbTxnManager.testSingleWriteTable
org.apache.hadoop.hive.ql.lockmgr.TestDbTxnManager.testUpdate
org.apache.hadoop.hive.ql.lockmgr.TestDbTxnManager.testWriteDynamicPartition
org.apache.hadoop.hive.ql.lockmgr.TestDbTxnManager2.basicBlocking
org.apache.hadoop.hive.ql.lockmgr.TestDbTxnManager2.createTable
org.apache.hadoop.hive.ql.lockmgr.TestDbTxnManager2.insertOverwriteCreate
org.apache.hadoop.hive.ql.lockmgr.TestDbTxnManager2.insertOverwritePartitionedCreate
org.apache.hadoop.hive.ql.lockmgr.TestDbTxnManager2.lockConflictDbTable
org.apache.hadoop.hive.ql.lockmgr.TestDbTxnManager2.updateSelectUpdate
org.apache.hadoop.hive.ql.lockmgr.TestDummyTxnManager.testDedupLockObjects
org.apache.hadoop.hive.ql.lockmgr.TestDummyTxnManager.testSingleReadTable
org.apache.hadoop.hive.ql.metadata.TestHive.testAutoPurgeTablesAndPartitions
org.apache.hadoop.hive.ql.metadata.TestHive.testDropPartitionsWithPurge
org.apache.hadoop.hive.ql.metadata.TestHive.testDropTableTrash
org.apache.hadoop.hive.ql.metadata.TestHive.testGetAndDropTables
org.apache.hadoop.hive.ql.metadata.TestHive.testHiveCloseCurrent
org.apache.hadoop.hive.ql.metadata.TestHive.testHiveRefreshOnConfChange
org.apache.hadoop.hive.ql.metadata.TestHive.testIndex
org.apache.hadoop.hive.ql.metadata.TestHive.testMetaStoreApiTiming
org.apache.hadoop.hive.ql.metadata.TestHive.testPartition
org.apache.hadoop.hive.ql.metadata.TestHive.testTable
org.apache.hadoop.hive.ql.metadata.TestHive.testThriftTable
org.apache.hadoop.hive.ql.metadata.TestHiveMetaStoreChecker.testDataDeletion
org.apache.hadoop.hive.ql.metadata.TestHiveMetaStoreChecker.testPartitionsCheck
org.apache.hadoop.hive.ql.metadata.TestHiveMetaStoreChecker.testTableCheck
org.apache.hadoop.hive.ql.metadata.TestHiveRemote.testAutoPurgeTablesAndPartitions
org.apache.hadoop.hive.ql.metadata.TestHiveRemote.testDropPartitionsWithPurge
org.apache.hadoop.hive.ql.metadata.TestHiveRemote.testDropTableTrash
org.apache.hadoop.hive.ql.metadata.TestHiveRemote.testGetAndDropTables
org.apache.hadoop.hive.ql.metadata.TestHiveRemote.testHiveCloseCurrent
org.apache.hadoop.hive.ql.metadata.TestHiveRemote.testHiveRefreshOnConfChange
org.apache.hadoop.hive.ql.metadata.TestHiveRemote.testIndex
org.apache.hadoop.hive.ql.metadata.TestHiveRemote.testMetaStoreApiTiming
org.apache.hadoop.hive.ql.metadata.TestHiveRemote.testPartition
org.apache.hadoop.hive.ql.metadata.TestHiveRemote.testTable
org.apache.hadoop.hive.ql.metadata.TestHiveRemote.testThriftTable
org.apache.hadoop.hive.ql.metadata.TestSemanticAnalyzerHookLoading.testHookLoading
org.apache.hadoop.hive.ql.parse.TestColumnAccess.org.apache.hadoop.hive.ql.parse.TestColumnAccess
org.apache.hadoop.hive.ql.parse.TestHiveDecimalParse.testDecimalType
org.apache.hadoop.hive.ql.parse.TestHiveDecimalParse.testDecimalType1
org.apache.hadoop.hive.ql.parse.TestHiveDecimalParse.testDecimalType2
org.apache.hadoop.hive.ql.parse.TestHiveDecimalParse.testDecimalType3
org.apache.hadoop.hive.ql.parse.TestHiveDecimalParse.testDecimalType4
org.apache.hadoop.hive.ql.parse.TestHiveDecimalParse.testDecimalType5
org.apache.hadoop.hive.ql.parse.TestHiveDecimalParse.testDecimalType6
org.apache.hadoop.hive.ql.parse.TestHiveDecimalParse.testDecimalType7
org.apache.hadoop.hive.ql.parse.TestHiveDecimalParse.testDecimalType8
org.apache.hadoop.hive.ql.parse.TestHiveDecimalParse.testDecimalType9
org.apache.hadoop.hive.ql.parse.TestIUD.org.apache.hadoop.hive.ql.parse.TestIUD
org.apache.hadoop.hive.ql.parse.TestMacroSemanticAnalyzer.testCannotUseReservedWordAsName
org.apache.hadoop.hive.ql.parse.TestMacroSemanticAnalyzer.testDropMacro
org.apache.hadoop.hive.ql.parse.TestMacroSemanticAnalyzer.testDropMacroDoesNotExist
org.apache.hadoop.hive.ql.parse.TestMacroSemanticAnalyzer.testDropMacroExistsDoNotIgnoreErrors
org.apache.hadoop.hive.ql.parse.TestMacroSemanticAnalyzer.testDropMacroNonExistent
org.apache.hadoop.hive.ql.parse.TestMacroSemanticAnalyzer.testDropMacroNonExistentWithIfExists
org.apache.hadoop.hive.ql.parse.TestMacroSemanticAnalyzer.testDropMacroNonExistentWithIfExistsDoNotIgnoreNonExistent
org.apache.hadoop.hive.ql.parse.TestMacroSemanticAnalyzer.testNoBody
org.apache.hadoop.hive.ql.parse.TestMacroSemanticAnalyzer.testOneInputParamters
org.apache.hadoop.hive.ql.parse.TestMacroSemanticAnalyzer.testOneUnusedParameterName
org.apache.hadoop.hive.ql.parse.TestMacroSemanticAnalyzer.testThreeDuplicateParameters
org.apache.hadoop.hive.ql.parse.TestMacroSemanticAnalyzer.testThreeInputParamters
org.apache.hadoop.hive.ql.parse.TestMacroSemanticAnalyzer.testTwoDuplicateParameterNames
org.apache.hadoop.hive.ql.parse.TestMacroSemanticAnalyzer.testTwoInputParamters
org.apache.hadoop.hive.ql.parse.TestMacroSemanticAnalyzer.testTwoUnusedParameterNames
org.apache.hadoop.hive.ql.parse.TestMacroSemanticAnalyzer.testUnknownInputParameter
org.apache.hadoop.hive.ql.parse.TestMacroSemanticAnalyzer.testZeroInputParamters
org.apache.hadoop.hive.ql.parse.TestParseNegative.initializationError
org.apache.hadoop.hive.ql.parse.TestQBCompact.org.apache.hadoop.hive.ql.parse.TestQBCompact
org.apache.hadoop.hive.ql.parse.TestQBJoinTreeApplyPredicate.org.apache.hadoop.hive.ql.parse.TestQBJoinTreeApplyPredicate
org.apache.hadoop.hive.ql.parse.TestQBSubQuery.org.apache.hadoop.hive.ql.parse.TestQBSubQuery
org.apache.hadoop.hive.ql.parse.TestSQL11ReservedKeyWordsNegative.org.apache.hadoop.hive.ql.parse.TestSQL11ReservedKeyWordsNegative
org.apache.hadoop.hive.ql.parse.TestSQL11ReservedKeyWordsPositive.org.apache.hadoop.hive.ql.parse.TestSQL11ReservedKeyWordsPositive
org.apache.hadoop.hive.ql.parse.TestUnpermittedCharsInColumnNameCreateTableNegative.org.apache.hadoop.hive.ql.parse.TestUnpermittedCharsInColumnNameCreateTableNegative
org.apache.hadoop.hive.ql.parse.TestUpdateDeleteSemanticAnalyzer.testDeleteAllNonPartitioned
org.apache.hadoop.hive.ql.parse.TestUpdateDeleteSemanticAnalyzer.testDeleteAllPartitioned
org.apache.hadoop.hive.ql.parse.TestUpdateDeleteSemanticAnalyzer.testDeleteAllWherePartitioned
org.apache.hadoop.hive.ql.parse.TestUpdateDeleteSemanticAnalyzer.testDeleteOnePartition
org.apache.hadoop.hive.ql.parse.TestUpdateDeleteSemanticAnalyzer.testDeleteOnePartitionWhere
org.apache.hadoop.hive.ql.parse.TestUpdateDeleteSemanticAnalyzer.testDeleteWhereNoPartition
org.apache.hadoop.hive.ql.parse.TestUpdateDeleteSemanticAnalyzer.testInsertSelect
org.apache.hadoop.hive.ql.parse.TestUpdateDeleteSemanticAnalyzer.testInsertValues
org.apache.hadoop.hive.ql.parse.TestUpdateDeleteSemanticAnalyzer.testInsertValuesPartitioned
org.apache.hadoop.hive.ql.parse.TestUpdateDeleteSemanticAnalyzer.testUpdateAllNonPartitioned
org.apache.hadoop.hive.ql.parse.TestUpdateDeleteSemanticAnalyzer.testUpdateAllNonPartitionedWhere
org.apache.hadoop.hive.ql.parse.TestUpdateDeleteSemanticAnalyzer.testUpdateAllPartitioned
org.apache.hadoop.hive.ql.parse.TestUpdateDeleteSemanticAnalyzer.testUpdateAllPartitionedWhere
org.apache.hadoop.hive.ql.parse.TestUpdateDeleteSemanticAnalyzer.testUpdateOnePartition
org.apache.hadoop.hive.ql.parse.TestUpdateDeleteSemanticAnalyzer.testUpdateOnePartitionWhere
org.apache.hadoop.hive.ql.parse.authorization.TestHiveAuthorizationTaskFactory.testCreateRole
org.apache.hadoop.hive.ql.parse.authorization.TestHiveAuthorizationTaskFactory.testDropRole
org.apache.hadoop.hive.ql.parse.authorization.TestHiveAuthorizationTaskFactory.testGrantGroupTable
org.apache.hadoop.hive.ql.parse.authorization.TestHiveAuthorizationTaskFactory.testGrantRoleGroup
org.apache.hadoop.hive.ql.parse.authorization.TestHiveAuthorizationTaskFactory.testGrantRoleRole
org.apache.hadoop.hive.ql.parse.authorization.TestHiveAuthorizationTaskFactory.testGrantRoleTable
org.apache.hadoop.hive.ql.parse.authorization.TestHiveAuthorizationTaskFactory.testGrantRoleUser
org.apache.hadoop.hive.ql.parse.authorization.TestHiveAuthorizationTaskFactory.testGrantServer
org.apache.hadoop.hive.ql.parse.authorization.TestHiveAuthorizationTaskFactory.testGrantUri
org.apache.hadoop.hive.ql.parse.authorization.TestHiveAuthorizationTaskFactory.testGrantUserTable
org.apache.hadoop.hive.ql.parse.authorization.TestHiveAuthorizationTaskFactory.testRevokeGroupTable
org.apache.hadoop.hive.ql.parse.authorization.TestHiveAuthorizationTaskFactory.testRevokeRoleGroup
org.apache.hadoop.hive.ql.parse.authorization.TestHiveAuthorizationTaskFactory.testRevokeRoleRole
org.apache.hadoop.hive.ql.parse.authorization.TestHiveAuthorizationTaskFactory.testRevokeRoleTable
org.apache.hadoop.hive.ql.parse.authorization.TestHiveAuthorizationTaskFactory.testRevokeRoleUser
org.apache.hadoop.hive.ql.parse.authorization.TestHiveAuthorizationTaskFactory.testRevokeUserTable
org.apache.hadoop.hive.ql.parse.authorization.TestHiveAuthorizationTaskFactory.testShowGrantGroupOnTable
org.apache.hadoop.hive.ql.parse.authorization.TestHiveAuthorizationTaskFactory.testShowGrantRoleOnTable
org.apache.hadoop.hive.ql.parse.authorization.TestHiveAuthorizationTaskFactory.testShowGrantUserOnTable
org.apache.hadoop.hive.ql.parse.authorization.TestHiveAuthorizationTaskFactory.testShowRoleGrantGroup
org.apache.hadoop.hive.ql.parse.authorization.TestHiveAuthorizationTaskFactory.testShowRoleGrantRole
org.apache.hadoop.hive.ql.parse.authorization.TestHiveAuthorizationTaskFactory.testShowRoleGrantUser
org.apache.hadoop.hive.ql.parse.authorization.TestPrivilegesV1.testPrivInGrant
org.apache.hadoop.hive.ql.parse.authorization.TestPrivilegesV1.testPrivInGrantNotAccepted
org.apache.hadoop.hive.ql.parse.authorization.TestPrivilegesV2.testPrivInGrant
org.apache.hadoop.hive.ql.parse.positive.TestTransactionStatement.org.apache.hadoop.hive.ql.parse.positive.TestTransactionStatement
org.apache.hadoop.hive.ql.plan.TestReadEntityDirect.org.apache.hadoop.hive.ql.plan.TestReadEntityDirect
org.apache.hadoop.hive.ql.plan.TestViewEntity.org.apache.hadoop.hive.ql.plan.TestViewEntity
org.apache.hadoop.hive.ql.processors.TestCommandProcessorFactory.testAvailableCommands
org.apache.hadoop.hive.ql.processors.TestSetProcessor.testHiddenConfig
org.apache.hadoop.hive.ql.security.TestAuthorizationPreEventListener.testListener
org.apache.hadoop.hive.ql.security.TestClientSideAuthorizationProvider.testSimplePrivileges
org.apache.hadoop.hive.ql.security.TestExtendedAcls.org.apache.hadoop.hive.ql.security.TestExtendedAcls
org.apache.hadoop.hive.ql.security.TestFolderPermissions.org.apache.hadoop.hive.ql.security.TestFolderPermissions
org.apache.hadoop.hive.ql.security.TestMultiAuthorizationPreEventListener.testMultipleAuthorizationListners
org.apache.hadoop.hive.ql.security.TestStorageBasedClientSideAuthorizationProvider.testSimplePrivileges
org.apache.hadoop.hive.ql.security.TestStorageBasedMetastoreAuthorizationProvider.testSimplePrivileges
org.apache.hadoop.hive.ql.security.TestStorageBasedMetastoreAuthorizationProviderWithACL.testSimplePrivileges
org.apache.hadoop.hive.ql.security.authorization.plugin.TestHiveAuthorizerCheckInvocation.org.apache.hadoop.hive.ql.security.authorization.plugin.TestHiveAuthorizerCheckInvocation
org.apache.hadoop.hive.ql.security.authorization.plugin.TestHiveAuthorizerShowFilters.org.apache.hadoop.hive.ql.security.authorization.plugin.TestHiveAuthorizerShowFilters
org.apache.hadoop.hive.ql.session.TestAddResource.testDeleteJar
org.apache.hadoop.hive.ql.session.TestAddResource.testDeleteJarMultiple
org.apache.hadoop.hive.ql.session.TestAddResource.testDuplicateAdds
org.apache.hadoop.hive.ql.session.TestAddResource.testSanity
org.apache.hadoop.hive.ql.session.TestAddResource.testUnion
org.apache.hadoop.hive.ql.session.TestSessionState.testClassLoaderEquality[0]
org.apache.hadoop.hive.ql.session.TestSessionState.testClassLoaderEquality[1]
org.apache.hadoop.hive.ql.session.TestSessionState.testClose[0]
org.apache.hadoop.hive.ql.session.TestSessionState.testClose[1]
org.apache.hadoop.hive.ql.session.TestSessionState.testReloadAuxJars2[0]
org.apache.hadoop.hive.ql.session.TestSessionState.testReloadAuxJars2[1]
org.apache.hadoop.hive.ql.session.TestSessionState.testReloadExistingAuxJars2[0]
org.apache.hadoop.hive.ql.session.TestSessionState.testReloadExistingAuxJars2[1]
org.apache.hadoop.hive.ql.session.TestSessionState.testgetDbName[0]
org.apache.hadoop.hive.ql.session.TestSessionState.testgetDbName[1]
org.apache.hadoop.hive.ql.txn.compactor.TestCleaner.blockedByLockPartition
org.apache.hadoop.hive.ql.txn.compactor.TestCleaner.blockedByLockTable
org.apache.hadoop.hive.ql.txn.compactor.TestCleaner.cleanupAfterMajorPartitionCompaction
org.apache.hadoop.hive.ql.txn.compactor.TestCleaner.cleanupAfterMajorPartitionCompactionNoBase
org.apache.hadoop.hive.ql.txn.compactor.TestCleaner.cleanupAfterMajorTableCompaction
org.apache.hadoop.hive.ql.txn.compactor.TestCleaner.cleanupAfterMinorPartitionCompaction
org.apache.hadoop.hive.ql.txn.compactor.TestCleaner.cleanupAfterMinorTableCompaction
org.apache.hadoop.hive.ql.txn.compactor.TestCleaner.droppedPartition
org.apache.hadoop.hive.ql.txn.compactor.TestCleaner.droppedTable
org.apache.hadoop.hive.ql.txn.compactor.TestCleaner.notBlockedBySubsequentLock
org.apache.hadoop.hive.ql.txn.compactor.TestCleaner.nothing
org.apache.hadoop.hive.ql.txn.compactor.TestCleaner.partitionNotBlockedBySubsequentLock
org.apache.hadoop.hive.ql.txn.compactor.TestCleaner2.blockedByLockPartition
org.apache.hadoop.hive.ql.txn.compactor.TestCleaner2.blockedByLockTable
org.apache.hadoop.hive.ql.txn.compactor.TestCleaner2.cleanupAfterMajorPartitionCompaction
org.apache.hadoop.hive.ql.txn.compactor.TestCleaner2.cleanupAfterMajorPartitionCompactionNoBase
org.apache.hadoop.hive.ql.txn.compactor.TestCleaner2.cleanupAfterMajorTableCompaction
org.apache.hadoop.hive.ql.txn.compactor.TestCleaner2.cleanupAfterMinorPartitionCompaction
org.apache.hadoop.hive.ql.txn.compactor.TestCleaner2.cleanupAfterMinorTableCompaction
org.apache.hadoop.hive.ql.txn.compactor.TestCleaner2.droppedPartition
org.apache.hadoop.hive.ql.txn.compactor.TestCleaner2.droppedTable
org.apache.hadoop.hive.ql.txn.compactor.TestCleaner2.notBlockedBySubsequentLock
org.apache.hadoop.hive.ql.txn.compactor.TestCleaner2.nothing
org.apache.hadoop.hive.ql.txn.compactor.TestCleaner2.partitionNotBlockedBySubsequentLock
org.apache.hadoop.hive.ql.txn.compactor.TestCompactor.dynamicPartitioningDelete
org.apache.hadoop.hive.ql.txn.compactor.TestCompactor.dynamicPartitioningInsert
org.apache.hadoop.hive.ql.txn.compactor.TestCompactor.dynamicPartitioningUpdate
org.apache.hadoop.hive.ql.txn.compactor.TestCompactor.majorCompactAfterAbort
org.apache.hadoop.hive.ql.txn.compactor.TestCompactor.majorCompactWhileStreaming
org.apache.hadoop.hive.ql.txn.compactor.TestCompactor.minorCompactAfterAbort
org.apache.hadoop.hive.ql.txn.compactor.TestCompactor.minorCompactWhileStreaming
org.apache.hadoop.hive.ql.txn.compactor.TestCompactor.testStatsAfterCompactionPartTbl
org.apache.hadoop.hive.ql.txn.compactor.TestInitiator.chooseMajorOverMinorWhenBothValid
org.apache.hadoop.hive.ql.txn.compactor.TestInitiator.cleanEmptyAbortedTxns
org.apache.hadoop.hive.ql.txn.compactor.TestInitiator.compactPartitionHighDeltaPct
org.apache.hadoop.hive.ql.txn.compactor.TestInitiator.compactPartitionTooManyDeltas
org.apache.hadoop.hive.ql.txn.compactor.TestInitiator.compactTableHighDeltaPct
org.apache.hadoop.hive.ql.txn.compactor.TestInitiator.compactTableTooManyDeltas
org.apache.hadoop.hive.ql.txn.compactor.TestInitiator.dropPartition
org.apache.hadoop.hive.ql.txn.compactor.TestInitiator.dropTable
org.apache.hadoop.hive.ql.txn.compactor.TestInitiator.enoughDeltasNoBase
org.apache.hadoop.hive.ql.txn.compactor.TestInitiator.majorCompactOnPartitionTooManyAborts
org.apache.hadoop.hive.ql.txn.compactor.TestInitiator.majorCompactOnTableTooManyAborts
org.apache.hadoop.hive.ql.txn.compactor.TestInitiator.noCompactOnManyDifferentPartitionAborts
org.apache.hadoop.hive.ql.txn.compactor.TestInitiator.noCompactTableDeltaPctNotHighEnough
org.apache.hadoop.hive.ql.txn.compactor.TestInitiator.noCompactTableDynamicPartitioning
org.apache.hadoop.hive.ql.txn.compactor.TestInitiator.noCompactTableNotEnoughDeltas
org.apache.hadoop.hive.ql.txn.compactor.TestInitiator.noCompactWhenCompactAlreadyScheduled
org.apache.hadoop.hive.ql.txn.compactor.TestInitiator.noCompactWhenNoCompactSet
org.apache.hadoop.hive.ql.txn.compactor.TestInitiator.noCompactWhenNoCompactSetLowerCase
org.apache.hadoop.hive.ql.txn.compactor.TestInitiator.nothing
org.apache.hadoop.hive.ql.txn.compactor.TestInitiator.recoverFailedLocalWorkers
org.apache.hadoop.hive.ql.txn.compactor.TestInitiator.recoverFailedRemoteWorkers
org.apache.hadoop.hive.ql.txn.compactor.TestInitiator.twoTxnsOnSamePartitionGenerateOneCompactionRequest
org.apache.hadoop.hive.ql.txn.compactor.TestWorker.droppedPartition
org.apache.hadoop.hive.ql.txn.compactor.TestWorker.droppedTable
org.apache.hadoop.hive.ql.txn.compactor.TestWorker.inputSplit
org.apache.hadoop.hive.ql.txn.compactor.TestWorker.inputSplitNullBase
org.apache.hadoop.hive.ql.txn.compactor.TestWorker.majorNoBaseLotsOfDeltas
org.apache.hadoop.hive.ql.txn.compactor.TestWorker.majorPartitionWithBase
org.apache.hadoop.hive.ql.txn.compactor.TestWorker.majorPartitionWithBaseMissingBuckets
org.apache.hadoop.hive.ql.txn.compactor.TestWorker.majorTableLegacy
org.apache.hadoop.hive.ql.txn.compactor.TestWorker.majorTableNoBase
org.apache.hadoop.hive.ql.txn.compactor.TestWorker.majorTableWithBase
org.apache.hadoop.hive.ql.txn.compactor.TestWorker.majorWithAborted
org.apache.hadoop.hive.ql.txn.compactor.TestWorker.majorWithOpenInMiddle
org.apache.hadoop.hive.ql.txn.compactor.TestWorker.minorNoBaseLotsOfDeltas
org.apache.hadoop.hive.ql.txn.compactor.TestWorker.minorPartitionWithBase
org.apache.hadoop.hive.ql.txn.compactor.TestWorker.minorTableLegacy
org.apache.hadoop.hive.ql.txn.compactor.TestWorker.minorTableNoBase
org.apache.hadoop.hive.ql.txn.compactor.TestWorker.minorTableWithBase
org.apache.hadoop.hive.ql.txn.compactor.TestWorker.minorWithAborted
org.apache.hadoop.hive.ql.txn.compactor.TestWorker.minorWithOpenInMiddle
org.apache.hadoop.hive.ql.txn.compactor.TestWorker.nothing
org.apache.hadoop.hive.ql.txn.compactor.TestWorker.sortedPartition
org.apache.hadoop.hive.ql.txn.compactor.TestWorker.sortedTable
org.apache.hadoop.hive.ql.txn.compactor.TestWorker.stringableList
org.apache.hadoop.hive.ql.txn.compactor.TestWorker.stringableMap
org.apache.hadoop.hive.ql.txn.compactor.TestWorker2.droppedPartition
org.apache.hadoop.hive.ql.txn.compactor.TestWorker2.droppedTable
org.apache.hadoop.hive.ql.txn.compactor.TestWorker2.inputSplit
org.apache.hadoop.hive.ql.txn.compactor.TestWorker2.inputSplitNullBase
org.apache.hadoop.hive.ql.txn.compactor.TestWorker2.majorNoBaseLotsOfDeltas
org.apache.hadoop.hive.ql.txn.compactor.TestWorker2.majorPartitionWithBase
org.apache.hadoop.hive.ql.txn.compactor.TestWorker2.majorPartitionWithBaseMissingBuckets
org.apache.hadoop.hive.ql.txn.compactor.TestWorker2.majorTableLegacy
org.apache.hadoop.hive.ql.txn.compactor.TestWorker2.majorTableNoBase
org.apache.hadoop.hive.ql.txn.compactor.TestWorker2.majorTableWithBase
org.apache.hadoop.hive.ql.txn.compactor.TestWorker2.majorWithAborted
org.apache.hadoop.hive.ql.txn.compactor.TestWorker2.majorWithOpenInMiddle
org.apache.hadoop.hive.ql.txn.compactor.TestWorker2.minorNoBaseLotsOfDeltas
org.apache.hadoop.hive.ql.txn.compactor.TestWorker2.minorPartitionWithBase
org.apache.hadoop.hive.ql.txn.compactor.TestWorker2.minorTableLegacy
org.apache.hadoop.hive.ql.txn.compactor.TestWorker2.minorTableNoBase
org.apache.hadoop.hive.ql.txn.compactor.TestWorker2.minorTableWithBase
org.apache.hadoop.hive.ql.txn.compactor.TestWorker2.minorWithAborted
org.apache.hadoop.hive.ql.txn.compactor.TestWorker2.minorWithOpenInMiddle
org.apache.hadoop.hive.ql.txn.compactor.TestWorker2.nothing
org.apache.hadoop.hive.ql.txn.compactor.TestWorker2.sortedPartition
org.apache.hadoop.hive.ql.txn.compactor.TestWorker2.sortedTable
org.apache.hadoop.hive.ql.txn.compactor.TestWorker2.stringableList
org.apache.hadoop.hive.ql.txn.compactor.TestWorker2.stringableMap
org.apache.hadoop.hive.thrift.TestDBTokenStore.testDBTokenStore
org.apache.hadoop.hive.thrift.TestHadoopAuthBridge23.testMetastoreProxyUser
org.apache.hadoop.hive.thrift.TestHadoopAuthBridge23.testSaslWithHiveMetaStore
org.apache.hive.beeline.TestBeeLineWithArgs.org.apache.hive.beeline.TestBeeLineWithArgs
org.apache.hive.beeline.cli.TestHiveCli.testCmd
org.apache.hive.beeline.cli.TestHiveCli.testDatabaseOptions
org.apache.hive.beeline.cli.TestHiveCli.testErrOutput
org.apache.hive.beeline.cli.TestHiveCli.testHelp
org.apache.hive.beeline.cli.TestHiveCli.testInValidCmd
org.apache.hive.beeline.cli.TestHiveCli.testInvalidDatabaseOptions
org.apache.hive.beeline.cli.TestHiveCli.testInvalidOptions
org.apache.hive.beeline.cli.TestHiveCli.testInvalidOptions2
org.apache.hive.beeline.cli.TestHiveCli.testNoErrorDB
org.apache.hive.beeline.cli.TestHiveCli.testSetHeaderValue
org.apache.hive.beeline.cli.TestHiveCli.testSetPromptValue
org.apache.hive.beeline.cli.TestHiveCli.testSourceCmd
org.apache.hive.beeline.cli.TestHiveCli.testSourceCmd2
org.apache.hive.beeline.cli.TestHiveCli.testSourceCmd3
org.apache.hive.beeline.cli.TestHiveCli.testSqlFromCmd
org.apache.hive.beeline.cli.TestHiveCli.testSqlFromCmdWithDBName
org.apache.hive.beeline.cli.TestHiveCli.testUseCurrentDB1
org.apache.hive.beeline.cli.TestHiveCli.testUseCurrentDB2
org.apache.hive.beeline.cli.TestHiveCli.testUseCurrentDB3
org.apache.hive.beeline.cli.TestHiveCli.testUseInvalidDB
org.apache.hive.beeline.cli.TestHiveCli.testVariables
org.apache.hive.beeline.cli.TestHiveCli.testVariablesForSource
org.apache.hive.hcatalog.api.TestHCatClient.testBasicDDLCommands
org.apache.hive.hcatalog.api.TestHCatClient.testCreateTableLike
org.apache.hive.hcatalog.api.TestHCatClient.testDatabaseLocation
org.apache.hive.hcatalog.api.TestHCatClient.testDropPartitionsWithPartialSpec
org.apache.hive.hcatalog.api.TestHCatClient.testDropTableException
org.apache.hive.hcatalog.api.TestHCatClient.testEmptyTableInstantiation
org.apache.hive.hcatalog.api.TestHCatClient.testGetMessageBusTopicName
org.apache.hive.hcatalog.api.TestHCatClient.testGetPartitionsWithPartialSpec
org.apache.hive.hcatalog.api.TestHCatClient.testObjectNotFoundException
org.apache.hive.hcatalog.api.TestHCatClient.testOtherFailure
org.apache.hive.hcatalog.api.TestHCatClient.testPartitionRegistrationWithCustomSchema
org.apache.hive.hcatalog.api.TestHCatClient.testPartitionSchema
org.apache.hive.hcatalog.api.TestHCatClient.testPartitionSpecRegistrationWithCustomSchema
org.apache.hive.hcatalog.api.TestHCatClient.testPartitionsHCatClientImpl
org.apache.hive.hcatalog.api.TestHCatClient.testRenameTable
org.apache.hive.hcatalog.api.TestHCatClient.testReplicationTaskIter
org.apache.hive.hcatalog.api.TestHCatClient.testTableSchemaPropagation
org.apache.hive.hcatalog.api.TestHCatClient.testTransportFailure
org.apache.hive.hcatalog.api.TestHCatClient.testUpdateTableSchema
org.apache.hive.hcatalog.api.TestHCatClientNotification.org.apache.hive.hcatalog.api.TestHCatClientNotification
org.apache.hive.hcatalog.api.repl.TestReplicationTask.testCreate
org.apache.hive.hcatalog.api.repl.commands.TestCommands.testBasicReplEximCommands
org.apache.hive.hcatalog.api.repl.commands.TestCommands.testDropDatabaseCommand
org.apache.hive.hcatalog.api.repl.commands.TestCommands.testDropPartitionCommand
org.apache.hive.hcatalog.api.repl.commands.TestCommands.testDropTableCommand
org.apache.hive.hcatalog.api.repl.commands.TestCommands.testDropTableCommand2
org.apache.hive.hcatalog.api.repl.commands.TestCommands.testMetadataReplEximCommands
org.apache.hive.hcatalog.api.repl.commands.TestCommands.testNoopReplEximCommands
org.apache.hive.hcatalog.api.repl.exim.TestEximReplicationTasks.org.apache.hive.hcatalog.api.repl.exim.TestEximReplicationTasks
org.apache.hive.hcatalog.cli.SemanticAnalysis.TestHCatAuthUtil.authDisabled
org.apache.hive.hcatalog.cli.SemanticAnalysis.TestHCatAuthUtil.authEnabledV1Auth
org.apache.hive.hcatalog.cli.SemanticAnalysis.TestHCatAuthUtil.authEnabledV2Auth
org.apache.hive.hcatalog.cli.TestPermsGrp.testCustomPerms
org.apache.hive.hcatalog.cli.TestSemanticAnalysis.testAddDriverInfo
org.apache.hive.hcatalog.cli.TestSemanticAnalysis.testAddPartFail
org.apache.hive.hcatalog.cli.TestSemanticAnalysis.testAddPartPass
org.apache.hive.hcatalog.cli.TestSemanticAnalysis.testAddReplaceCols
org.apache.hive.hcatalog.cli.TestSemanticAnalysis.testAlterTableSetFF
org.apache.hive.hcatalog.cli.TestSemanticAnalysis.testAlterTblClusteredBy
org.apache.hive.hcatalog.cli.TestSemanticAnalysis.testAlterTblFFpart
org.apache.hive.hcatalog.cli.TestSemanticAnalysis.testAlterTblTouch
org.apache.hive.hcatalog.cli.TestSemanticAnalysis.testCTAS
org.apache.hive.hcatalog.cli.TestSemanticAnalysis.testCTLFail
org.apache.hive.hcatalog.cli.TestSemanticAnalysis.testCTLPass
org.apache.hive.hcatalog.cli.TestSemanticAnalysis.testChangeColumns
org.apache.hive.hcatalog.cli.TestSemanticAnalysis.testCreateTableIfNotExists
org.apache.hive.hcatalog.cli.TestSemanticAnalysis.testCreateTblWithLowerCasePartNames
org.apache.hive.hcatalog.cli.TestSemanticAnalysis.testDatabaseOperations
org.apache.hive.hcatalog.cli.TestSemanticAnalysis.testDescDB
org.apache.hive.hcatalog.cli.TestSemanticAnalysis.testInvalidateClusteredBy
org.apache.hive.hcatalog.cli.TestSemanticAnalysis.testInvalidateNonStringPartition
org.apache.hive.hcatalog.cli.TestSemanticAnalysis.testInvalidateSeqFileStoredAs
org.apache.hive.hcatalog.cli.TestSemanticAnalysis.testInvalidateTextFileStoredAs
org.apache.hive.hcatalog.cli.TestSemanticAnalysis.testStoredAs
org.apache.hive.hcatalog.cli.TestSemanticAnalysis.testUsNonExistentDB
org.apache.hive.hcatalog.cli.TestUseDatabase.testAlterTablePass
org.apache.hive.hcatalog.common.TestHiveClientCache.testCacheExpiry
org.apache.hive.hcatalog.common.TestHiveClientCache.testCacheHit
org.apache.hive.hcatalog.common.TestHiveClientCache.testCacheMiss
org.apache.hive.hcatalog.common.TestHiveClientCache.testCloseAllClients
org.apache.hive.hcatalog.common.TestHiveClientCache.testMultipleThreadAccess
org.apache.hive.hcatalog.data.TestReaderWriter.test
org.apache.hive.hcatalog.hbase.TestPigHBaseStorageHandler.org.apache.hive.hcatalog.hbase.TestPigHBaseStorageHandler
org.apache.hive.hcatalog.listener.TestDbNotificationListener.org.apache.hive.hcatalog.listener.TestDbNotificationListener
org.apache.hive.hcatalog.listener.TestMsgBusConnection.testConnection
org.apache.hive.hcatalog.listener.TestNotificationListener.testAMQListener
org.apache.hive.hcatalog.mapreduce.TestHCatDynamicPartitioned.org.apache.hive.hcatalog.mapreduce.TestHCatDynamicPartitioned
org.apache.hive.hcatalog.mapreduce.TestHCatExternalDynamicPartitioned.org.apache.hive.hcatalog.mapreduce.TestHCatExternalDynamicPartitioned
org.apache.hive.hcatalog.mapreduce.TestHCatExternalNonPartitioned.org.apache.hive.hcatalog.mapreduce.TestHCatExternalNonPartitioned
org.apache.hive.hcatalog.mapreduce.TestHCatExternalPartitioned.org.apache.hive.hcatalog.mapreduce.TestHCatExternalPartitioned
org.apache.hive.hcatalog.mapreduce.TestHCatHiveCompatibility.testPartedRead
org.apache.hive.hcatalog.mapreduce.TestHCatHiveCompatibility.testUnpartedReadWrite
org.apache.hive.hcatalog.mapreduce.TestHCatHiveThriftCompatibility.testDynamicCols
org.apache.hive.hcatalog.mapreduce.TestHCatInputFormat.testBadRecordHandlingFails
org.apache.hive.hcatalog.mapreduce.TestHCatInputFormat.testBadRecordHandlingPasses
org.apache.hive.hcatalog.mapreduce.TestHCatInputFormatMethods.testGetPartitionAndDataColumns
org.apache.hive.hcatalog.mapreduce.TestHCatMultiOutputFormat.org.apache.hive.hcatalog.mapreduce.TestHCatMultiOutputFormat
org.apache.hive.hcatalog.mapreduce.TestHCatMutableDynamicPartitioned.org.apache.hive.hcatalog.mapreduce.TestHCatMutableDynamicPartitioned
org.apache.hive.hcatalog.mapreduce.TestHCatMutableNonPartitioned.org.apache.hive.hcatalog.mapreduce.TestHCatMutableNonPartitioned
org.apache.hive.hcatalog.mapreduce.TestHCatMutablePartitioned.org.apache.hive.hcatalog.mapreduce.TestHCatMutablePartitioned
org.apache.hive.hcatalog.mapreduce.TestHCatNonPartitioned.org.apache.hive.hcatalog.mapreduce.TestHCatNonPartitioned
org.apache.hive.hcatalog.mapreduce.TestHCatOutputFormat.testSetOutput
org.apache.hive.hcatalog.mapreduce.TestHCatPartitionPublish.testPartitionPublish
org.apache.hive.hcatalog.mapreduce.TestHCatPartitioned.org.apache.hive.hcatalog.mapreduce.TestHCatPartitioned
org.apache.hive.hcatalog.mapreduce.TestInputJobInfo.test4ArgCreate
org.apache.hive.hcatalog.mapreduce.TestPassProperties.testSequenceTableWriteReadMR
org.apache.hive.hcatalog.mapreduce.TestSequenceFileReadWrite.testSequenceTableWriteRead
org.apache.hive.hcatalog.mapreduce.TestSequenceFileReadWrite.testSequenceTableWriteReadMR
org.apache.hive.hcatalog.mapreduce.TestSequenceFileReadWrite.testTextTableWriteRead
org.apache.hive.hcatalog.mapreduce.TestSequenceFileReadWrite.testTextTableWriteReadMR
org.apache.hive.hcatalog.pig.TestE2EScenarios.testReadOrcAndRCFromPig
org.apache.hive.hcatalog.pig.TestHCatLoader.testColumnarStorePushdown2[0]
org.apache.hive.hcatalog.pig.TestHCatLoader.testColumnarStorePushdown2[1]
org.apache.hive.hcatalog.pig.TestHCatLoader.testColumnarStorePushdown2[2]
org.apache.hive.hcatalog.pig.TestHCatLoader.testColumnarStorePushdown2[3]
org.apache.hive.hcatalog.pig.TestHCatLoader.testColumnarStorePushdown2[4]
org.apache.hive.hcatalog.pig.TestHCatLoader.testColumnarStorePushdown2[5]
org.apache.hive.hcatalog.pig.TestHCatLoader.testColumnarStorePushdown[0]
org.apache.hive.hcatalog.pig.TestHCatLoader.testColumnarStorePushdown[1]
org.apache.hive.hcatalog.pig.TestHCatLoader.testColumnarStorePushdown[2]
org.apache.hive.hcatalog.pig.TestHCatLoader.testColumnarStorePushdown[3]
org.apache.hive.hcatalog.pig.TestHCatLoader.testColumnarStorePushdown[4]
org.apache.hive.hcatalog.pig.TestHCatLoader.testColumnarStorePushdown[5]
org.apache.hive.hcatalog.pig.TestHCatLoader.testConvertBooleanToInt[0]
org.apache.hive.hcatalog.pig.TestHCatLoader.testConvertBooleanToInt[1]
org.apache.hive.hcatalog.pig.TestHCatLoader.testConvertBooleanToInt[2]
org.apache.hive.hcatalog.pig.TestHCatLoader.testConvertBooleanToInt[3]
org.apache.hive.hcatalog.pig.TestHCatLoader.testConvertBooleanToInt[4]
org.apache.hive.hcatalog.pig.TestHCatLoader.testConvertBooleanToInt[5]
org.apache.hive.hcatalog.pig.TestHCatLoader.testGetInputBytes[0]
org.apache.hive.hcatalog.pig.TestHCatLoader.testGetInputBytes[1]
org.apache.hive.hcatalog.pig.TestHCatLoader.testGetInputBytes[2]
org.apache.hive.hcatalog.pig.TestHCatLoader.testGetInputBytes[3]
org.apache.hive.hcatalog.pig.TestHCatLoader.testGetInputBytes[4]
org.apache.hive.hcatalog.pig.TestHCatLoader.testGetInputBytes[5]
org.apache.hive.hcatalog.pig.TestHCatLoader.testProjectionsBasic[0]
org.apache.hive.hcatalog.pig.TestHCatLoader.testProjectionsBasic[1]
org.apache.hive.hcatalog.pig.TestHCatLoader.testProjectionsBasic[2]
org.apache.hive.hcatalog.pig.TestHCatLoader.testProjectionsBasic[3]
org.apache.hive.hcatalog.pig.TestHCatLoader.testProjectionsBasic[4]
org.apache.hive.hcatalog.pig.TestHCatLoader.testProjectionsBasic[5]
org.apache.hive.hcatalog.pig.TestHCatLoader.testReadDataBasic[0]
org.apache.hive.hcatalog.pig.TestHCatLoader.testReadDataBasic[1]
org.apache.hive.hcatalog.pig.TestHCatLoader.testReadDataBasic[2]
org.apache.hive.hcatalog.pig.TestHCatLoader.testReadDataBasic[3]
org.apache.hive.hcatalog.pig.TestHCatLoader.testReadDataBasic[4]
org.apache.hive.hcatalog.pig.TestHCatLoader.testReadDataBasic[5]
org.apache.hive.hcatalog.pig.TestHCatLoader.testReadDataPrimitiveTypes[0]
org.apache.hive.hcatalog.pig.TestHCatLoader.testReadDataPrimitiveTypes[1]
org.apache.hive.hcatalog.pig.TestHCatLoader.testReadDataPrimitiveTypes[2]
org.apache.hive.hcatalog.pig.TestHCatLoader.testReadDataPrimitiveTypes[3]
org.apache.hive.hcatalog.pig.TestHCatLoader.testReadDataPrimitiveTypes[4]
org.apache.hive.hcatalog.pig.TestHCatLoader.testReadDataPrimitiveTypes[5]
org.apache.hive.hcatalog.pig.TestHCatLoader.testReadPartitionedBasic[0]
org.apache.hive.hcatalog.pig.TestHCatLoader.testReadPartitionedBasic[1]
org.apache.hive.hcatalog.pig.TestHCatLoader.testReadPartitionedBasic[2]
org.apache.hive.hcatalog.pig.TestHCatLoader.testReadPartitionedBasic[3]
org.apache.hive.hcatalog.pig.TestHCatLoader.testReadPartitionedBasic[4]
org.apache.hive.hcatalog.pig.TestHCatLoader.testReadPartitionedBasic[5]
org.apache.hive.hcatalog.pig.TestHCatLoader.testSchemaLoadBasic[0]
org.apache.hive.hcatalog.pig.TestHCatLoader.testSchemaLoadBasic[1]
org.apache.hive.hcatalog.pig.TestHCatLoader.testSchemaLoadBasic[2]
org.apache.hive.hcatalog.pig.TestHCatLoader.testSchemaLoadBasic[3]
org.apache.hive.hcatalog.pig.TestHCatLoader.testSchemaLoadBasic[4]
org.apache.hive.hcatalog.pig.TestHCatLoader.testSchemaLoadBasic[5]
org.apache.hive.hcatalog.pig.TestHCatLoader.testSchemaLoadComplex[0]
org.apache.hive.hcatalog.pig.TestHCatLoader.testSchemaLoadComplex[1]
org.apache.hive.hcatalog.pig.TestHCatLoader.testSchemaLoadComplex[2]
org.apache.hive.hcatalog.pig.TestHCatLoader.testSchemaLoadComplex[3]
org.apache.hive.hcatalog.pig.TestHCatLoader.testSchemaLoadComplex[4]
org.apache.hive.hcatalog.pig.TestHCatLoader.testSchemaLoadComplex[5]
org.apache.hive.hcatalog.pig.TestHCatLoader.testSchemaLoadPrimitiveTypes[0]
org.apache.hive.hcatalog.pig.TestHCatLoader.testSchemaLoadPrimitiveTypes[1]
org.apache.hive.hcatalog.pig.TestHCatLoader.testSchemaLoadPrimitiveTypes[2]
org.apache.hive.hcatalog.pig.TestHCatLoader.testSchemaLoadPrimitiveTypes[3]
org.apache.hive.hcatalog.pig.TestHCatLoader.testSchemaLoadPrimitiveTypes[4]
org.apache.hive.hcatalog.pig.TestHCatLoader.testSchemaLoadPrimitiveTypes[5]
org.apache.hive.hcatalog.pig.TestHCatLoaderComplexSchema.org.apache.hive.hcatalog.pig.TestHCatLoaderComplexSchema
org.apache.hive.hcatalog.pig.TestHCatLoaderEncryption.testReadDataFromEncryptedHiveTableByHCatMR[0]
org.apache.hive.hcatalog.pig.TestHCatLoaderEncryption.testReadDataFromEncryptedHiveTableByHCatMR[1]
org.apache.hive.hcatalog.pig.TestHCatLoaderEncryption.testReadDataFromEncryptedHiveTableByHCatMR[2]
org.apache.hive.hcatalog.pig.TestHCatLoaderEncryption.testReadDataFromEncryptedHiveTableByHCatMR[3]
org.apache.hive.hcatalog.pig.TestHCatLoaderEncryption.testReadDataFromEncryptedHiveTableByHCatMR[4]
org.apache.hive.hcatalog.pig.TestHCatLoaderEncryption.testReadDataFromEncryptedHiveTableByHCatMR[5]
org.apache.hive.hcatalog.pig.TestHCatLoaderEncryption.testReadDataFromEncryptedHiveTableByPig[0]
org.apache.hive.hcatalog.pig.TestHCatLoaderEncryption.testReadDataFromEncryptedHiveTableByPig[1]
org.apache.hive.hcatalog.pig.TestHCatLoaderEncryption.testReadDataFromEncryptedHiveTableByPig[2]
org.apache.hive.hcatalog.pig.TestHCatLoaderEncryption.testReadDataFromEncryptedHiveTableByPig[3]
org.apache.hive.hcatalog.pig.TestHCatLoaderEncryption.testReadDataFromEncryptedHiveTableByPig[4]
org.apache.hive.hcatalog.pig.TestHCatLoaderEncryption.testReadDataFromEncryptedHiveTableByPig[5]
org.apache.hive.hcatalog.pig.TestHCatLoaderStorer.testReadWrite
org.apache.hive.hcatalog.pig.TestHCatLoaderStorer.testSmallTinyInt
org.apache.hive.hcatalog.pig.TestHCatStorer.testBagNStruct[0]
org.apache.hive.hcatalog.pig.TestHCatStorer.testBagNStruct[1]
org.apache.hive.hcatalog.pig.TestHCatStorer.testBagNStruct[2]
org.apache.hive.hcatalog.pig.TestHCatStorer.testBagNStruct[3]
org.apache.hive.hcatalog.pig.TestHCatStorer.testBagNStruct[4]
org.apache.hive.hcatalog.pig.TestHCatStorer.testBagNStruct[5]
org.apache.hive.hcatalog.pig.TestHCatStorer.testDateCharTypes[0]
org.apache.hive.hcatalog.pig.TestHCatStorer.testDateCharTypes[1]
org.apache.hive.hcatalog.pig.TestHCatStorer.testDateCharTypes[2]
org.apache.hive.hcatalog.pig.TestHCatStorer.testDateCharTypes[3]
org.apache.hive.hcatalog.pig.TestHCatStorer.testDateCharTypes[4]
org.apache.hive.hcatalog.pig.TestHCatStorer.testDateCharTypes[5]
org.apache.hive.hcatalog.pig.TestHCatStorer.testDynamicPartitioningMultiPartColsInDataNoSpec[0]
org.apache.hive.hcatalog.pig.TestHCatStorer.testDynamicPartitioningMultiPartColsInDataNoSpec[1]
org.apache.hive.hcatalog.pig.TestHCatStorer.testDynamicPartitioningMultiPartColsInDataNoSpec[2]
org.apache.hive.hcatalog.pig.TestHCatStorer.testDynamicPartitioningMultiPartColsInDataNoSpec[3]
org.apache.hive.hcatalog.pig.TestHCatStorer.testDynamicPartitioningMultiPartColsInDataNoSpec[4]
org.apache.hive.hcatalog.pig.TestHCatStorer.testDynamicPartitioningMultiPartColsInDataNoSpec[5]
org.apache.hive.hcatalog.pig.TestHCatStorer.testDynamicPartitioningMultiPartColsInDataPartialSpec[0]
org.apache.hive.hcatalog.pig.TestHCatStorer.testDynamicPartitioningMultiPartColsInDataPartialSpec[1]
org.apache.hive.hcatalog.pig.TestHCatStorer.testDynamicPartitioningMultiPartColsInDataPartialSpec[2]
org.apache.hive.hcatalog.pig.TestHCatStorer.testDynamicPartitioningMultiPartColsInDataPartialSpec[3]
org.apache.hive.hcatalog.pig.TestHCatStorer.testDynamicPartitioningMultiPartColsInDataPartialSpec[4]
org.apache.hive.hcatalog.pig.TestHCatStorer.testDynamicPartitioningMultiPartColsInDataPartialSpec[5]
org.apache.hive.hcatalog.pig.TestHCatStorer.testDynamicPartitioningMultiPartColsNoDataInDataNoSpec[0]
org.apache.hive.hcatalog.pig.TestHCatStorer.testDynamicPartitioningMultiPartColsNoDataInDataNoSpec[1]
org.apache.hive.hcatalog.pig.TestHCatStorer.testDynamicPartitioningMultiPartColsNoDataInDataNoSpec[2]
org.apache.hive.hcatalog.pig.TestHCatStorer.testDynamicPartitioningMultiPartColsNoDataInDataNoSpec[3]
org.apache.hive.hcatalog.pig.TestHCatStorer.testDynamicPartitioningMultiPartColsNoDataInDataNoSpec[4]
org.apache.hive.hcatalog.pig.TestHCatStorer.testDynamicPartitioningMultiPartColsNoDataInDataNoSpec[5]
org.apache.hive.hcatalog.pig.TestHCatStorer.testEmptyStore[0]
org.apache.hive.hcatalog.pig.TestHCatStorer.testEmptyStore[1]
org.apache.hive.hcatalog.pig.TestHCatStorer.testEmptyStore[2]
org.apache.hive.hcatalog.pig.TestHCatStorer.testEmptyStore[3]
org.apache.hive.hcatalog.pig.TestHCatStorer.testEmptyStore[4]
org.apache.hive.hcatalog.pig.TestHCatStorer.testEmptyStore[5]
org.apache.hive.hcatalog.pig.TestHCatStorer.testMultiPartColsInData[0]
org.apache.hive.hcatalog.pig.TestHCatStorer.testMultiPartColsInData[1]
org.apache.hive.hcatalog.pig.TestHCatStorer.testMultiPartColsInData[2]
org.apache.hive.hcatalog.pig.TestHCatStorer.testMultiPartColsInData[3]
org.apache.hive.hcatalog.pig.TestHCatStorer.testMultiPartColsInData[4]
org.apache.hive.hcatalog.pig.TestHCatStorer.testMultiPartColsInData[5]
org.apache.hive.hcatalog.pig.TestHCatStorer.testNoAlias[0]
org.apache.hive.hcatalog.pig.TestHCatStorer.testNoAlias[1]
org.apache.hive.hcatalog.pig.TestHCatStorer.testNoAlias[2]
org.apache.hive.hcatalog.pig.TestHCatStorer.testNoAlias[3]
org.apache.hive.hcatalog.pig.TestHCatStorer.testNoAlias[4]
org.apache.hive.hcatalog.pig.TestHCatStorer.testNoAlias[5]
org.apache.hive.hcatalog.pig.TestHCatStorer.testPartColsInData[0]
org.apache.hive.hcatalog.pig.TestHCatStorer.testPartColsInData[1]
org.apache.hive.hcatalog.pig.TestHCatStorer.testPartColsInData[2]
org.apache.hive.hcatalog.pig.TestHCatStorer.testPartColsInData[3]
org.apache.hive.hcatalog.pig.TestHCatStorer.testPartColsInData[4]
org.apache.hive.hcatalog.pig.TestHCatStorer.testPartColsInData[5]
org.apache.hive.hcatalog.pig.TestHCatStorer.testPartitionPublish[0]
org.apache.hive.hcatalog.pig.TestHCatStorer.testPartitionPublish[1]
org.apache.hive.hcatalog.pig.TestHCatStorer.testPartitionPublish[2]
org.apache.hive.hcatalog.pig.TestHCatStorer.testPartitionPublish[3]
org.apache.hive.hcatalog.pig.TestHCatStorer.testPartitionPublish[4]
org.apache.hive.hcatalog.pig.TestHCatStorer.testPartitionPublish[5]
org.apache.hive.hcatalog.pig.TestHCatStorer.testStoreFuncAllSimpleTypes[0]
org.apache.hive.hcatalog.pig.TestHCatStorer.testStoreFuncAllSimpleTypes[1]
org.apache.hive.hcatalog.pig.TestHCatStorer.testStoreFuncAllSimpleTypes[2]
org.apache.hive.hcatalog.pig.TestHCatStorer.testStoreFuncAllSimpleTypes[3]
org.apache.hive.hcatalog.pig.TestHCatStorer.testStoreFuncAllSimpleTypes[4]
org.apache.hive.hcatalog.pig.TestHCatStorer.testStoreFuncAllSimpleTypes[5]
org.apache.hive.hcatalog.pig.TestHCatStorer.testStoreFuncSimple[0]
org.apache.hive.hcatalog.pig.TestHCatStorer.testStoreFuncSimple[1]
org.apache.hive.hcatalog.pig.TestHCatStorer.testStoreFuncSimple[2]
org.apache.hive.hcatalog.pig.TestHCatStorer.testStoreFuncSimple[3]
org.apache.hive.hcatalog.pig.TestHCatStorer.testStoreFuncSimple[4]
org.apache.hive.hcatalog.pig.TestHCatStorer.testStoreFuncSimple[5]
org.apache.hive.hcatalog.pig.TestHCatStorer.testStoreInPartiitonedTbl[0]
org.apache.hive.hcatalog.pig.TestHCatStorer.testStoreInPartiitonedTbl[1]
org.apache.hive.hcatalog.pig.TestHCatStorer.testStoreInPartiitonedTbl[2]
org.apache.hive.hcatalog.pig.TestHCatStorer.testStoreInPartiitonedTbl[3]
org.apache.hive.hcatalog.pig.TestHCatStorer.testStoreInPartiitonedTbl[4]
org.apache.hive.hcatalog.pig.TestHCatStorer.testStoreInPartiitonedTbl[5]
org.apache.hive.hcatalog.pig.TestHCatStorer.testStoreMultiTables[0]
org.apache.hive.hcatalog.pig.TestHCatStorer.testStoreMultiTables[1]
org.apache.hive.hcatalog.pig.TestHCatStorer.testStoreMultiTables[2]
org.apache.hive.hcatalog.pig.TestHCatStorer.testStoreMultiTables[3]
org.apache.hive.hcatalog.pig.TestHCatStorer.testStoreMultiTables[4]
org.apache.hive.hcatalog.pig.TestHCatStorer.testStoreMultiTables[5]
org.apache.hive.hcatalog.pig.TestHCatStorer.testStoreWithNoCtorArgs[0]
org.apache.hive.hcatalog.pig.TestHCatStorer.testStoreWithNoCtorArgs[1]
org.apache.hive.hcatalog.pig.TestHCatStorer.testStoreWithNoCtorArgs[2]
org.apache.hive.hcatalog.pig.TestHCatStorer.testStoreWithNoCtorArgs[3]
org.apache.hive.hcatalog.pig.TestHCatStorer.testStoreWithNoCtorArgs[4]
org.apache.hive.hcatalog.pig.TestHCatStorer.testStoreWithNoCtorArgs[5]
org.apache.hive.hcatalog.pig.TestHCatStorer.testStoreWithNoSchema[0]
org.apache.hive.hcatalog.pig.TestHCatStorer.testStoreWithNoSchema[1]
org.apache.hive.hcatalog.pig.TestHCatStorer.testStoreWithNoSchema[2]
org.apache.hive.hcatalog.pig.TestHCatStorer.testStoreWithNoSchema[3]
org.apache.hive.hcatalog.pig.TestHCatStorer.testStoreWithNoSchema[4]
org.apache.hive.hcatalog.pig.TestHCatStorer.testStoreWithNoSchema[5]
org.apache.hive.hcatalog.pig.TestHCatStorer.testWriteChar[0]
org.apache.hive.hcatalog.pig.TestHCatStorer.testWriteChar[1]
org.apache.hive.hcatalog.pig.TestHCatStorer.testWriteChar[2]
org.apache.hive.hcatalog.pig.TestHCatStorer.testWriteChar[3]
org.apache.hive.hcatalog.pig.TestHCatStorer.testWriteChar[4]
org.apache.hive.hcatalog.pig.TestHCatStorer.testWriteChar[5]
org.apache.hive.hcatalog.pig.TestHCatStorer.testWriteDate2[0]
org.apache.hive.hcatalog.pig.TestHCatStorer.testWriteDate2[1]
org.apache.hive.hcatalog.pig.TestHCatStorer.testWriteDate2[2]
org.apache.hive.hcatalog.pig.TestHCatStorer.testWriteDate2[3]
org.apache.hive.hcatalog.pig.TestHCatStorer.testWriteDate2[4]
org.apache.hive.hcatalog.pig.TestHCatStorer.testWriteDate2[5]
org.apache.hive.hcatalog.pig.TestHCatStorer.testWriteDate3[0]
org.apache.hive.hcatalog.pig.TestHCatStorer.testWriteDate3[1]
org.apache.hive.hcatalog.pig.TestHCatStorer.testWriteDate3[2]
org.apache.hive.hcatalog.pig.TestHCatStorer.testWriteDate3[3]
org.apache.hive.hcatalog.pig.TestHCatStorer.testWriteDate3[4]
org.apache.hive.hcatalog.pig.TestHCatStorer.testWriteDate3[5]
org.apache.hive.hcatalog.pig.TestHCatStorer.testWriteDate[0]
org.apache.hive.hcatalog.pig.TestHCatStorer.testWriteDate[1]
org.apache.hive.hcatalog.pig.TestHCatStorer.testWriteDate[2]
org.apache.hive.hcatalog.pig.TestHCatStorer.testWriteDate[3]
org.apache.hive.hcatalog.pig.TestHCatStorer.testWriteDate[4]
org.apache.hive.hcatalog.pig.TestHCatStorer.testWriteDate[5]
org.apache.hive.hcatalog.pig.TestHCatStorer.testWriteDecimalXY[0]
org.apache.hive.hcatalog.pig.TestHCatStorer.testWriteDecimalXY[1]
org.apache.hive.hcatalog.pig.TestHCatStorer.testWriteDecimalXY[2]
org.apache.hive.hcatalog.pig.TestHCatStorer.testWriteDecimalXY[3]
org.apache.hive.hcatalog.pig.TestHCatStorer.testWriteDecimalXY[4]
org.apache.hive.hcatalog.pig.TestHCatStorer.testWriteDecimalXY[5]
org.apache.hive.hcatalog.pig.TestHCatStorer.testWriteDecimalX[0]
org.apache.hive.hcatalog.pig.TestHCatStorer.testWriteDecimalX[1]
org.apache.hive.hcatalog.pig.TestHCatStorer.testWriteDecimalX[2]
org.apache.hive.hcatalog.pig.TestHCatStorer.testWriteDecimalX[3]
org.apache.hive.hcatalog.pig.TestHCatStorer.testWriteDecimalX[4]
org.apache.hive.hcatalog.pig.TestHCatStorer.testWriteDecimalX[5]
org.apache.hive.hcatalog.pig.TestHCatStorer.testWriteDecimal[0]
org.apache.hive.hcatalog.pig.TestHCatStorer.testWriteDecimal[1]
org.apache.hive.hcatalog.pig.TestHCatStorer.testWriteDecimal[2]
org.apache.hive.hcatalog.pig.TestHCatStorer.testWriteDecimal[3]
org.apache.hive.hcatalog.pig.TestHCatStorer.testWriteDecimal[4]
org.apache.hive.hcatalog.pig.TestHCatStorer.testWriteDecimal[5]
org.apache.hive.hcatalog.pig.TestHCatStorer.testWriteSmallint[0]
org.apache.hive.hcatalog.pig.TestHCatStorer.testWriteSmallint[1]
org.apache.hive.hcatalog.pig.TestHCatStorer.testWriteSmallint[2]
org.apache.hive.hcatalog.pig.TestHCatStorer.testWriteSmallint[3]
org.apache.hive.hcatalog.pig.TestHCatStorer.testWriteSmallint[4]
org.apache.hive.hcatalog.pig.TestHCatStorer.testWriteSmallint[5]
org.apache.hive.hcatalog.pig.TestHCatStorer.testWriteTimestamp[0]
org.apache.hive.hcatalog.pig.TestHCatStorer.testWriteTimestamp[1]
org.apache.hive.hcatalog.pig.TestHCatStorer.testWriteTimestamp[2]
org.apache.hive.hcatalog.pig.TestHCatStorer.testWriteTimestamp[3]
org.apache.hive.hcatalog.pig.TestHCatStorer.testWriteTimestamp[4]
org.apache.hive.hcatalog.pig.TestHCatStorer.testWriteTimestamp[5]
org.apache.hive.hcatalog.pig.TestHCatStorer.testWriteTinyint[0]
org.apache.hive.hcatalog.pig.TestHCatStorer.testWriteTinyint[1]
org.apache.hive.hcatalog.pig.TestHCatStorer.testWriteTinyint[2]
org.apache.hive.hcatalog.pig.TestHCatStorer.testWriteTinyint[3]
org.apache.hive.hcatalog.pig.TestHCatStorer.testWriteTinyint[4]
org.apache.hive.hcatalog.pig.TestHCatStorer.testWriteTinyint[5]
org.apache.hive.hcatalog.pig.TestHCatStorer.testWriteVarchar[0]
org.apache.hive.hcatalog.pig.TestHCatStorer.testWriteVarchar[1]
org.apache.hive.hcatalog.pig.TestHCatStorer.testWriteVarchar[2]
org.apache.hive.hcatalog.pig.TestHCatStorer.testWriteVarchar[3]
org.apache.hive.hcatalog.pig.TestHCatStorer.testWriteVarchar[4]
org.apache.hive.hcatalog.pig.TestHCatStorer.testWriteVarchar[5]
org.apache.hive.hcatalog.pig.TestHCatStorerMulti.testStoreBasicTable[0]
org.apache.hive.hcatalog.pig.TestHCatStorerMulti.testStoreBasicTable[1]
org.apache.hive.hcatalog.pig.TestHCatStorerMulti.testStoreBasicTable[2]
org.apache.hive.hcatalog.pig.TestHCatStorerMulti.testStoreBasicTable[3]
org.apache.hive.hcatalog.pig.TestHCatStorerMulti.testStoreBasicTable[5]
org.apache.hive.hcatalog.pig.TestHCatStorerMulti.testStorePartitionedTable[0]
org.apache.hive.hcatalog.pig.TestHCatStorerMulti.testStorePartitionedTable[1]
org.apache.hive.hcatalog.pig.TestHCatStorerMulti.testStorePartitionedTable[2]
org.apache.hive.hcatalog.pig.TestHCatStorerMulti.testStorePartitionedTable[3]
org.apache.hive.hcatalog.pig.TestHCatStorerMulti.testStorePartitionedTable[5]
org.apache.hive.hcatalog.pig.TestHCatStorerMulti.testStoreTableMulti[0]
org.apache.hive.hcatalog.pig.TestHCatStorerMulti.testStoreTableMulti[1]
org.apache.hive.hcatalog.pig.TestHCatStorerMulti.testStoreTableMulti[2]
org.apache.hive.hcatalog.pig.TestHCatStorerMulti.testStoreTableMulti[3]
org.apache.hive.hcatalog.pig.TestHCatStorerMulti.testStoreTableMulti[5]
org.apache.hive.hcatalog.pig.TestHCatStorerWrapper.testStoreExternalTableWithExternalDir
org.apache.hive.hcatalog.streaming.TestStreaming.testAddPartition
org.apache.hive.hcatalog.streaming.TestStreaming.testBucketing
org.apache.hive.hcatalog.streaming.TestStreaming.testBucketingWhereBucketColIsNotFirstCol
org.apache.hive.hcatalog.streaming.TestStreaming.testConcurrentTransactionBatchCommits
org.apache.hive.hcatalog.streaming.TestStreaming.testEndpointConnection
org.apache.hive.hcatalog.streaming.TestStreaming.testHearbeat
org.apache.hive.hcatalog.streaming.TestStreaming.testInterleavedTransactionBatchCommits
org.apache.hive.hcatalog.streaming.TestStreaming.testMultipleTransactionBatchCommits
org.apache.hive.hcatalog.streaming.TestStreaming.testRemainingTransactions
org.apache.hive.hcatalog.streaming.TestStreaming.testStreamBucketingMatchesRegularBucketing
org.apache.hive.hcatalog.streaming.TestStreaming.testTableValidation
org.apache.hive.hcatalog.streaming.TestStreaming.testTimeOutReaper
org.apache.hive.hcatalog.streaming.TestStreaming.testTransactionBatchAbort
org.apache.hive.hcatalog.streaming.TestStreaming.testTransactionBatchAbortAndCommit
org.apache.hive.hcatalog.streaming.TestStreaming.testTransactionBatchCommit_Delimited
org.apache.hive.hcatalog.streaming.TestStreaming.testTransactionBatchCommit_Json
org.apache.hive.hcatalog.streaming.TestStreaming.testTransactionBatchEmptyAbort
org.apache.hive.hcatalog.streaming.TestStreaming.testTransactionBatchEmptyCommit
org.apache.hive.hcatalog.streaming.mutate.TestMutations.testMulti
org.apache.hive.hcatalog.streaming.mutate.TestMutations.testTransactionBatchAbort
org.apache.hive.hcatalog.streaming.mutate.TestMutations.testTransactionBatchCommitPartitioned
org.apache.hive.hcatalog.streaming.mutate.TestMutations.testTransactionBatchCommitUnpartitioned
org.apache.hive.hcatalog.streaming.mutate.TestMutations.testTransactionBatchEmptyAbortPartitioned
org.apache.hive.hcatalog.streaming.mutate.TestMutations.testTransactionBatchEmptyAbortUnartitioned
org.apache.hive.hcatalog.streaming.mutate.TestMutations.testTransactionBatchEmptyCommitPartitioned
org.apache.hive.hcatalog.streaming.mutate.TestMutations.testTransactionBatchEmptyCommitUnpartitioned
org.apache.hive.hcatalog.streaming.mutate.TestMutations.testUpdatesAndDeletes
org.apache.hive.jdbc.TestJdbcDriver2.org.apache.hive.jdbc.TestJdbcDriver2
org.apache.hive.jdbc.TestJdbcWithLocalClusterSpark.org.apache.hive.jdbc.TestJdbcWithLocalClusterSpark
org.apache.hive.jdbc.TestJdbcWithMiniHS2.org.apache.hive.jdbc.TestJdbcWithMiniHS2
org.apache.hive.jdbc.TestJdbcWithMiniMr.org.apache.hive.jdbc.TestJdbcWithMiniMr
org.apache.hive.jdbc.TestMultiSessionsHS2WithLocalClusterSpark.org.apache.hive.jdbc.TestMultiSessionsHS2WithLocalClusterSpark
org.apache.hive.jdbc.TestNoSaslAuth.org.apache.hive.jdbc.TestNoSaslAuth
org.apache.hive.jdbc.TestSSL.testConnectionMismatch
org.apache.hive.jdbc.TestSSL.testInvalidConfig
org.apache.hive.jdbc.TestSSL.testSSLConnectionWithProperty
org.apache.hive.jdbc.TestSSL.testSSLConnectionWithURL
org.apache.hive.jdbc.TestSSL.testSSLFetch
org.apache.hive.jdbc.TestSSL.testSSLFetchHttp
org.apache.hive.jdbc.TestSSL.testSSLVersion
org.apache.hive.jdbc.TestSchedulerQueue.testFairSchedulerPrimaryQueueMapping
org.apache.hive.jdbc.TestSchedulerQueue.testFairSchedulerQueueMapping
org.apache.hive.jdbc.TestSchedulerQueue.testFairSchedulerSecondaryQueueMapping
org.apache.hive.jdbc.TestSchedulerQueue.testQueueMappingCheckDisabled
org.apache.hive.jdbc.authorization.TestCLIAuthzSessionContext.org.apache.hive.jdbc.authorization.TestCLIAuthzSessionContext
org.apache.hive.jdbc.authorization.TestHS2AuthzContext.org.apache.hive.jdbc.authorization.TestHS2AuthzContext
org.apache.hive.jdbc.authorization.TestHS2AuthzSessionContext.org.apache.hive.jdbc.authorization.TestHS2AuthzSessionContext
org.apache.hive.jdbc.authorization.TestJdbcMetadataApiAuth.org.apache.hive.jdbc.authorization.TestJdbcMetadataApiAuth
org.apache.hive.jdbc.authorization.TestJdbcWithSQLAuthUDFBlacklist.testBlackListedUdfUsage
org.apache.hive.jdbc.authorization.TestJdbcWithSQLAuthorization.org.apache.hive.jdbc.authorization.TestJdbcWithSQLAuthorization
org.apache.hive.jdbc.miniHS2.TestHiveServer2.org.apache.hive.jdbc.miniHS2.TestHiveServer2
org.apache.hive.jdbc.miniHS2.TestHiveServer2SessionTimeout.testConnection
org.apache.hive.jdbc.miniHS2.TestMiniHS2.testConfInSession
org.apache.hive.minikdc.TestHiveAuthFactory.testStartTokenManagerForDBTokenStore
org.apache.hive.minikdc.TestHs2HooksWithMiniKdc.org.apache.hive.minikdc.TestHs2HooksWithMiniKdc
org.apache.hive.minikdc.TestJdbcWithMiniKdc.org.apache.hive.minikdc.TestJdbcWithMiniKdc
org.apache.hive.minikdc.TestJdbcWithMiniKdcCookie.org.apache.hive.minikdc.TestJdbcWithMiniKdcCookie
org.apache.hive.minikdc.TestJdbcWithMiniKdcSQLAuthBinary.org.apache.hive.minikdc.TestJdbcWithMiniKdcSQLAuthBinary
org.apache.hive.minikdc.TestJdbcWithMiniKdcSQLAuthHttp.org.apache.hive.minikdc.TestJdbcWithMiniKdcSQLAuthHttp
org.apache.hive.service.auth.TestCustomAuthentication.org.apache.hive.service.auth.TestCustomAuthentication
org.apache.hive.service.auth.TestPlainSaslHelper.testDoAsSetting
org.apache.hive.service.cli.TestEmbeddedThriftBinaryCLIService.org.apache.hive.service.cli.TestEmbeddedThriftBinaryCLIService
org.apache.hive.service.cli.TestRetryingThriftCLIServiceClient.testRetryBehaviour
org.apache.hive.service.cli.operation.TestOperationLoggingAPIWithMr.org.apache.hive.service.cli.operation.TestOperationLoggingAPIWithMr
org.apache.hive.service.cli.operation.TestOperationLoggingAPIWithTez.org.apache.hive.service.cli.operation.TestOperationLoggingAPIWithTez
org.apache.hive.service.cli.operation.TestOperationLoggingLayout.org.apache.hive.service.cli.operation.TestOperationLoggingLayout
org.apache.hive.service.cli.session.TestSessionGlobalInitFile.testSessionGlobalInitDir
org.apache.hive.service.cli.session.TestSessionGlobalInitFile.testSessionGlobalInitFile
org.apache.hive.service.cli.session.TestSessionGlobalInitFile.testSessionGlobalInitFileAndConfOverlay
org.apache.hive.service.cli.session.TestSessionGlobalInitFile.testSessionGlobalInitFileWithUser
org.apache.hive.service.cli.session.TestSessionHooks.testProxyUser
org.apache.hive.service.cli.session.TestSessionHooks.testSessionHook
org.apache.hive.service.cli.thrift.TestThriftBinaryCLIService.org.apache.hive.service.cli.thrift.TestThriftBinaryCLIService
org.apache.hive.service.cli.thrift.TestThriftHttpCLIService.org.apache.hive.service.cli.thrift.TestThriftHttpCLIService
{noformat}

Test results: http://ec2-174-129-184-35.compute-1.amazonaws.com/jenkins/job/PreCommit-HIVE-TRUNK-Build/6049/testReport
Console output: http://ec2-174-129-184-35.compute-1.amazonaws.com/jenkins/job/PreCommit-HIVE-TRUNK-Build/6049/console
Test logs: http://ec2-174-129-184-35.compute-1.amazonaws.com/logs/PreCommit-HIVE-TRUNK-Build-6049/

Messages:
{noformat}
Executing org.apache.hive.ptest.execution.TestCheckPhase
Executing org.apache.hive.ptest.execution.PrepPhase
Executing org.apache.hive.ptest.execution.ExecutionPhase
Executing org.apache.hive.ptest.execution.ReportingPhase
Tests exited with: TestsFailedException: 898 tests failed
{noformat}

This message is automatically generated.

ATTACHMENT ID: 12772479 - PreCommit-HIVE-TRUNK-Build

> Unable to instantiate org.apache.hadoop.hive.metastore.HiveMetaStoreClient
> --------------------------------------------------------------------------
>
>                 Key: HIVE-6113
>                 URL: https://issues.apache.org/jira/browse/HIVE-6113
>             Project: Hive
>          Issue Type: Bug
>          Components: Database/Schema
>    Affects Versions: 0.12.0, 0.13.0, 0.14.0, 1.0.0, 1.2.1
>         Environment: hadoop-0.20.2-cdh3u3,hive-0.12.0
>            Reporter: William Stone
>            Assignee: Oleksiy Sayankin
>            Priority: Critical
>              Labels: HiveMetaStoreClient, metastore, unable_instantiate
>         Attachments: HIVE-6113.patch
>
>
> When I exccute SQL "use fdm; desc formatted fdm.tableName;"  in python, throw Error as followed.
> but when I tryit again , It will success.
> 2013-12-25 03:01:32,290 ERROR exec.DDLTask (DDLTask.java:execute(435)) - org.apache.hadoop.hive.ql.metadata.HiveException: java.lang.RuntimeException: Unable to instantiate org.apache.hadoop.hive.metastore.HiveMetaStoreClient
> 	at org.apache.hadoop.hive.ql.metadata.Hive.getDatabase(Hive.java:1143)
> 	at org.apache.hadoop.hive.ql.metadata.Hive.databaseExists(Hive.java:1128)
> 	at org.apache.hadoop.hive.ql.exec.DDLTask.switchDatabase(DDLTask.java:3479)
> 	at org.apache.hadoop.hive.ql.exec.DDLTask.execute(DDLTask.java:237)
> 	at org.apache.hadoop.hive.ql.exec.Task.executeTask(Task.java:151)
> 	at org.apache.hadoop.hive.ql.exec.TaskRunner.runSequential(TaskRunner.java:65)
> 	at org.apache.hadoop.hive.ql.Driver.launchTask(Driver.java:1414)
> 	at org.apache.hadoop.hive.ql.Driver.execute(Driver.java:1192)
> 	at org.apache.hadoop.hive.ql.Driver.runInternal(Driver.java:1020)
> 	at org.apache.hadoop.hive.ql.Driver.run(Driver.java:888)
> 	at org.apache.hadoop.hive.cli.CliDriver.processLocalCmd(CliDriver.java:260)
> 	at org.apache.hadoop.hive.cli.CliDriver.processCmd(CliDriver.java:217)
> 	at org.apache.hadoop.hive.cli.CliDriver.processLine(CliDriver.java:507)
> 	at org.apache.hadoop.hive.cli.CliDriver.executeDriver(CliDriver.java:875)
> 	at org.apache.hadoop.hive.cli.CliDriver.run(CliDriver.java:769)
> 	at org.apache.hadoop.hive.cli.CliDriver.main(CliDriver.java:708)
> 	at sun.reflect.NativeMethodAccessorImpl.invoke0(Native Method)
> 	at sun.reflect.NativeMethodAccessorImpl.invoke(NativeMethodAccessorImpl.java:39)
> 	at sun.reflect.DelegatingMethodAccessorImpl.invoke(DelegatingMethodAccessorImpl.java:25)
> 	at java.lang.reflect.Method.invoke(Method.java:597)
> 	at org.apache.hadoop.util.RunJar.main(RunJar.java:197)
> Caused by: java.lang.RuntimeException: Unable to instantiate org.apache.hadoop.hive.metastore.HiveMetaStoreClient
> 	at org.apache.hadoop.hive.metastore.MetaStoreUtils.newInstance(MetaStoreUtils.java:1217)
> 	at org.apache.hadoop.hive.metastore.RetryingMetaStoreClient.<init>(RetryingMetaStoreClient.java:62)
> 	at org.apache.hadoop.hive.metastore.RetryingMetaStoreClient.getProxy(RetryingMetaStoreClient.java:72)
> 	at org.apache.hadoop.hive.ql.metadata.Hive.createMetaStoreClient(Hive.java:2372)
> 	at org.apache.hadoop.hive.ql.metadata.Hive.getMSC(Hive.java:2383)
> 	at org.apache.hadoop.hive.ql.metadata.Hive.getDatabase(Hive.java:1139)
> 	... 20 more
> Caused by: java.lang.reflect.InvocationTargetException
> 	at sun.reflect.NativeConstructorAccessorImpl.newInstance0(Native Method)
> 	at sun.reflect.NativeConstructorAccessorImpl.newInstance(NativeConstructorAccessorImpl.java:39)
> 	at sun.reflect.DelegatingConstructorAccessorImpl.newInstance(DelegatingConstructorAccessorImpl.java:27)
> 	at java.lang.reflect.Constructor.newInstance(Constructor.java:513)
> 	at org.apache.hadoop.hive.metastore.MetaStoreUtils.newInstance(MetaStoreUtils.java:1210)
> 	... 25 more
> Caused by: javax.jdo.JDODataStoreException: Exception thrown flushing changes to datastore
> NestedThrowables:
> java.sql.BatchUpdateException: Duplicate entry 'default' for key 'UNIQUE_DATABASE'
> 	at org.datanucleus.api.jdo.NucleusJDOHelper.getJDOExceptionForNucleusException(NucleusJDOHelper.java:451)
> 	at org.datanucleus.api.jdo.JDOTransaction.commit(JDOTransaction.java:165)
> 	at org.apache.hadoop.hive.metastore.ObjectStore.commitTransaction(ObjectStore.java:358)
> 	at org.apache.hadoop.hive.metastore.ObjectStore.createDatabase(ObjectStore.java:404)
> 	at sun.reflect.NativeMethodAccessorImpl.invoke0(Native Method)
> 	at sun.reflect.NativeMethodAccessorImpl.invoke(NativeMethodAccessorImpl.java:39)
> 	at sun.reflect.DelegatingMethodAccessorImpl.invoke(DelegatingMethodAccessorImpl.java:25)
> 	at java.lang.reflect.Method.invoke(Method.java:597)
> 	at org.apache.hadoop.hive.metastore.RetryingRawStore.invoke(RetryingRawStore.java:124)
> 	at $Proxy9.createDatabase(Unknown Source)
> 	at org.apache.hadoop.hive.metastore.HiveMetaStore$HMSHandler.createDefaultDB_core(HiveMetaStore.java:422)
> 	at org.apache.hadoop.hive.metastore.HiveMetaStore$HMSHandler.createDefaultDB(HiveMetaStore.java:441)
> 	at org.apache.hadoop.hive.metastore.HiveMetaStore$HMSHandler.init(HiveMetaStore.java:326)
> 	at org.apache.hadoop.hive.metastore.HiveMetaStore$HMSHandler.<init>(HiveMetaStore.java:286)
> 	at org.apache.hadoop.hive.metastore.RetryingHMSHandler.<init>(RetryingHMSHandler.java:54)
> 	at org.apache.hadoop.hive.metastore.RetryingHMSHandler.getProxy(RetryingHMSHandler.java:59)
> 	at org.apache.hadoop.hive.metastore.HiveMetaStore.newHMSHandler(HiveMetaStore.java:4060)
> 	at org.apache.hadoop.hive.metastore.HiveMetaStoreClient.<init>(HiveMetaStoreClient.java:121)
> 	... 30 more
> Caused by: java.sql.BatchUpdateException: Duplicate entry 'default' for key 'UNIQUE_DATABASE'
> 	at com.mysql.jdbc.PreparedStatement.executeBatchSerially(PreparedStatement.java:2028)
> 	at com.mysql.jdbc.PreparedStatement.executeBatch(PreparedStatement.java:1451)
> 	at com.jolbox.bonecp.StatementHandle.executeBatch(StatementHandle.java:469)
> 	at org.datanucleus.store.rdbms.ParamLoggingPreparedStatement.executeBatch(ParamLoggingPreparedStatement.java:372)
> 	at org.datanucleus.store.rdbms.SQLController.processConnectionStatement(SQLController.java:628)
> 	at org.datanucleus.store.rdbms.SQLController.processStatementsForConnection(SQLController.java:596)
> 	at org.datanucleus.store.rdbms.SQLController$1.transactionFlushed(SQLController.java:683)
> 	at org.datanucleus.store.connection.AbstractManagedConnection.transactionFlushed(AbstractManagedConnection.java:86)
> 	at org.datanucleus.store.connection.ConnectionManagerImpl$2.transactionFlushed(ConnectionManagerImpl.java:454)
> 	at org.datanucleus.TransactionImpl.flush(TransactionImpl.java:199)
> 	at org.datanucleus.TransactionImpl.commit(TransactionImpl.java:263)
> 	at org.datanucleus.api.jdo.JDOTransaction.commit(JDOTransaction.java:98)
> 	... 46 more
> Caused by: com.mysql.jdbc.exceptions.jdbc4.MySQLIntegrityConstraintViolationException: Duplicate entry 'default' for key 'UNIQUE_DATABASE'
> 	at sun.reflect.NativeConstructorAccessorImpl.newInstance0(Native Method)
> 	at sun.reflect.NativeConstructorAccessorImpl.newInstance(NativeConstructorAccessorImpl.java:39)
> 	at sun.reflect.DelegatingConstructorAccessorImpl.newInstance(DelegatingConstructorAccessorImpl.java:27)
> 	at java.lang.reflect.Constructor.newInstance(Constructor.java:513)
> 	at com.mysql.jdbc.Util.handleNewInstance(Util.java:411)
> 	at com.mysql.jdbc.Util.getInstance(Util.java:386)
> 	at com.mysql.jdbc.SQLError.createSQLException(SQLError.java:1039)
> 	at com.mysql.jdbc.MysqlIO.checkErrorPacket(MysqlIO.java:3609)
> 	at com.mysql.jdbc.MysqlIO.checkErrorPacket(MysqlIO.java:3541)
> 	at com.mysql.jdbc.MysqlIO.sendCommand(MysqlIO.java:2002)
> 	at com.mysql.jdbc.MysqlIO.sqlQueryDirect(MysqlIO.java:2163)
> 	at com.mysql.jdbc.ConnectionImpl.execSQL(ConnectionImpl.java:2624)
> 	at com.mysql.jdbc.PreparedStatement.executeInternal(PreparedStatement.java:2127)
> 	at com.mysql.jdbc.PreparedStatement.executeUpdate(PreparedStatement.java:2427)
> 	at com.mysql.jdbc.PreparedStatement.executeBatchSerially(PreparedStatement.java:1980)
> 	... 57 more



--
This message was sent by Atlassian JIRA
(v6.3.4#6332)

Mime
View raw message