hive-issues mailing list archives

Site index · List index
Message view « Date » · « Thread »
Top « Date » · « Thread »
From "Hive QA (JIRA)" <j...@apache.org>
Subject [jira] [Commented] (HIVE-13000) Hive returns useless parsing error
Date Tue, 09 Feb 2016 09:55:18 GMT

    [ https://issues.apache.org/jira/browse/HIVE-13000?page=com.atlassian.jira.plugin.system.issuetabpanels:comment-tabpanel&focusedCommentId=15138674#comment-15138674
] 

Hive QA commented on HIVE-13000:
--------------------------------



Here are the results of testing the latest attachment:
https://issues.apache.org/jira/secure/attachment/12786791/HIVE-13000.2.patch

{color:red}ERROR:{color} -1 due to no test(s) being added or modified.

{color:red}ERROR:{color} -1 due to 33 failed/errored test(s), 10039 tests executed
*Failed tests:*
{noformat}
TestSparkCliDriver-timestamp_lazy.q-bucketsortoptimize_insert_4.q-date_udf.q-and-12-more -
did not produce a TEST-*.xml file
org.apache.hadoop.hive.cli.TestCliDriver.testCliDriver_cbo_gby
org.apache.hadoop.hive.cli.TestCliDriver.testCliDriver_cbo_limit
org.apache.hadoop.hive.cli.TestCliDriver.testCliDriver_cbo_rp_cross_product_check_2
org.apache.hadoop.hive.cli.TestCliDriver.testCliDriver_cbo_rp_gby
org.apache.hadoop.hive.cli.TestCliDriver.testCliDriver_cbo_rp_limit
org.apache.hadoop.hive.cli.TestCliDriver.testCliDriver_cbo_rp_semijoin
org.apache.hadoop.hive.cli.TestCliDriver.testCliDriver_cbo_semijoin
org.apache.hadoop.hive.cli.TestCliDriver.testCliDriver_cross_product_check_1
org.apache.hadoop.hive.cli.TestCliDriver.testCliDriver_cross_product_check_2
org.apache.hadoop.hive.cli.TestCliDriver.testCliDriver_groupby_resolution
org.apache.hadoop.hive.cli.TestCliDriver.testCliDriver_notable_alias3
org.apache.hadoop.hive.cli.TestCliDriver.testCliDriver_special_character_in_tabnames_1
org.apache.hadoop.hive.cli.TestCliDriver.testCliDriver_subquery_exists_having
org.apache.hadoop.hive.cli.TestCliDriver.testCliDriver_subquery_views
org.apache.hadoop.hive.cli.TestMiniTezCliDriver.testCliDriver_cbo_gby
org.apache.hadoop.hive.cli.TestMiniTezCliDriver.testCliDriver_cbo_limit
org.apache.hadoop.hive.cli.TestMiniTezCliDriver.testCliDriver_cbo_semijoin
org.apache.hadoop.hive.cli.TestMiniTezCliDriver.testCliDriver_cross_product_check_1
org.apache.hadoop.hive.cli.TestMiniTezCliDriver.testCliDriver_cross_product_check_2
org.apache.hadoop.hive.cli.TestMiniTezCliDriver.testCliDriver_explainuser_1
org.apache.hadoop.hive.cli.TestNegativeCliDriver.testNegativeCliDriver_authorization_uri_import
org.apache.hadoop.hive.cli.TestNegativeCliDriver.testNegativeCliDriver_subquery_notexists_implicit_gby
org.apache.hadoop.hive.cli.TestSparkCliDriver.testCliDriver_cbo_gby
org.apache.hadoop.hive.cli.TestSparkCliDriver.testCliDriver_cbo_limit
org.apache.hadoop.hive.cli.TestSparkCliDriver.testCliDriver_cbo_semijoin
org.apache.hadoop.hive.cli.TestSparkCliDriver.testCliDriver_cross_product_check_1
org.apache.hadoop.hive.cli.TestSparkCliDriver.testCliDriver_cross_product_check_2
org.apache.hadoop.hive.cli.TestSparkCliDriver.testCliDriver_groupby_resolution
org.apache.hadoop.hive.ql.parse.TestParseNegative.testParseNegative_nonkey_groupby
org.apache.hive.jdbc.TestJdbcWithLocalClusterSpark.testSparkQuery
org.apache.hive.jdbc.TestJdbcWithLocalClusterSpark.testTempTable
org.apache.hive.jdbc.TestSSL.testSSLVersion
{noformat}

Test results: http://ec2-174-129-184-35.compute-1.amazonaws.com/jenkins/job/PreCommit-HIVE-TRUNK-Build/6916/testReport
Console output: http://ec2-174-129-184-35.compute-1.amazonaws.com/jenkins/job/PreCommit-HIVE-TRUNK-Build/6916/console
Test logs: http://ec2-174-129-184-35.compute-1.amazonaws.com/logs/PreCommit-HIVE-TRUNK-Build-6916/

Messages:
{noformat}
Executing org.apache.hive.ptest.execution.TestCheckPhase
Executing org.apache.hive.ptest.execution.PrepPhase
Executing org.apache.hive.ptest.execution.ExecutionPhase
Executing org.apache.hive.ptest.execution.ReportingPhase
Tests exited with: TestsFailedException: 33 tests failed
{noformat}

This message is automatically generated.

ATTACHMENT ID: 12786791 - PreCommit-HIVE-TRUNK-Build

> Hive returns useless parsing error 
> -----------------------------------
>
>                 Key: HIVE-13000
>                 URL: https://issues.apache.org/jira/browse/HIVE-13000
>             Project: Hive
>          Issue Type: Bug
>    Affects Versions: 0.13.0, 1.0.0, 1.2.1
>            Reporter: Alina Abramova
>            Assignee: Alina Abramova
>            Priority: Minor
>         Attachments: HIVE-13000.1.patch, HIVE-13000.2.patch
>
>
> When I run query like these I receive unclear exception
> hive> SELECT record FROM ctest GROUP BY record.instance_id;
> FAILED: SemanticException Error in parsing 
> It will be clearer if it would be like:
> hive> SELECT record FROM ctest GROUP BY record.instance_id;
> FAILED: SemanticException  Expression not in GROUP BY key record



--
This message was sent by Atlassian JIRA
(v6.3.4#6332)

Mime
View raw message