hive-issues mailing list archives

Site index · List index
Message view « Date » · « Thread »
Top « Date » · « Thread »
From "Hive QA (JIRA)" <j...@apache.org>
Subject [jira] [Commented] (HIVE-13394) Analyze table fails in tez on empty partitions
Date Sat, 02 Apr 2016 11:57:25 GMT

    [ https://issues.apache.org/jira/browse/HIVE-13394?page=com.atlassian.jira.plugin.system.issuetabpanels:comment-tabpanel&focusedCommentId=15222866#comment-15222866
] 

Hive QA commented on HIVE-13394:
--------------------------------



Here are the results of testing the latest attachment:
https://issues.apache.org/jira/secure/attachment/12796397/HIVE-13394.2.patch

{color:red}ERROR:{color} -1 due to no test(s) being added or modified.

{color:red}ERROR:{color} -1 due to 1 failed/errored test(s), 9962 tests executed
*Failed tests:*
{noformat}
org.apache.hadoop.hive.cli.TestMiniSparkOnYarnCliDriver.testCliDriver_index_bitmap3
{noformat}

Test results: http://ec2-174-129-184-35.compute-1.amazonaws.com/jenkins/job/PreCommit-HIVE-TRUNK-Build/7441/testReport
Console output: http://ec2-174-129-184-35.compute-1.amazonaws.com/jenkins/job/PreCommit-HIVE-TRUNK-Build/7441/console
Test logs: http://ec2-174-129-184-35.compute-1.amazonaws.com/logs/PreCommit-HIVE-TRUNK-Build-7441/

Messages:
{noformat}
Executing org.apache.hive.ptest.execution.TestCheckPhase
Executing org.apache.hive.ptest.execution.PrepPhase
Executing org.apache.hive.ptest.execution.ExecutionPhase
Executing org.apache.hive.ptest.execution.ReportingPhase
Tests exited with: TestsFailedException: 1 tests failed
{noformat}

This message is automatically generated.

ATTACHMENT ID: 12796397 - PreCommit-HIVE-TRUNK-Build

> Analyze table fails in tez on empty partitions
> ----------------------------------------------
>
>                 Key: HIVE-13394
>                 URL: https://issues.apache.org/jira/browse/HIVE-13394
>             Project: Hive
>          Issue Type: Bug
>          Components: Tez
>    Affects Versions: 1.2.1, 2.0.0
>            Reporter: Vikram Dixit K
>            Assignee: Vikram Dixit K
>         Attachments: HIVE-13394.1.patch, HIVE-13394.2.patch
>
>
> {code}
>         at org.apache.hadoop.hive.ql.exec.tez.ReduceRecordSource$GroupIterator.next(ReduceRecordSource.java:352)
>         at org.apache.hadoop.hive.ql.exec.tez.ReduceRecordSource.pushRecord(ReduceRecordSource.java:237)
>         at org.apache.hadoop.hive.ql.exec.tez.ReduceRecordProcessor.run(ReduceRecordProcessor.java:252)
>         at org.apache.hadoop.hive.ql.exec.tez.TezProcessor.initializeAndRunProcessor(TezProcessor.java:150)
>         ... 14 more
> Caused by: org.apache.hadoop.hive.ql.metadata.HiveException: java.lang.ArrayIndexOutOfBoundsException:
0
>         at org.apache.hadoop.hive.ql.exec.GroupByOperator.process(GroupByOperator.java:766)
>         at org.apache.hadoop.hive.ql.exec.tez.ReduceRecordSource$GroupIterator.next(ReduceRecordSource.java:343)
>         ... 17 more
> Caused by: java.lang.ArrayIndexOutOfBoundsException: 0
>         at org.apache.hadoop.hive.ql.udf.generic.NumDistinctValueEstimator.deserialize(NumDistinctValueEstimator.java:219)
>         at org.apache.hadoop.hive.ql.udf.generic.NumDistinctValueEstimator.<init>(NumDistinctValueEstimator.java:112)
>         at org.apache.hadoop.hive.ql.udf.generic.GenericUDAFComputeStats$GenericUDAFNumericStatsEvaluator.merge(GenericUDAFComputeStats.java:556)
>         at org.apache.hadoop.hive.ql.udf.generic.GenericUDAFEvaluator.aggregate(GenericUDAFEvaluator.java:188)
>         at org.apache.hadoop.hive.ql.exec.GroupByOperator.updateAggregations(GroupByOperator.java:612)
>         at org.apache.hadoop.hive.ql.exec.GroupByOperator.processAggr(GroupByOperator.java:851)
>         at org.apache.hadoop.hive.ql.exec.GroupByOperator.processKey(GroupByOperator.java:695)
>         at org.apache.hadoop.hive.ql.exec.GroupByOperator.process(GroupByOperator.java:761)
>         ... 18 more
> ]], Vertex did not succeed due to OWN_TASK_FAILURE, failedTasks:1 killedTasks:0, Vertex
vertex_1455918888034_27748_1_01 [Reducer 2] killed/failed due to:OWN_TASK_FAILURE]DAG did
not succeed due to VERTEX_FAILURE. failedVertices:1 killedVertices:0
> {code}



--
This message was sent by Atlassian JIRA
(v6.3.4#6332)

Mime
View raw message