hive-issues mailing list archives

Site index · List index
Message view « Date » · « Thread »
Top « Date » · « Thread »
From "Hive QA (JIRA)" <j...@apache.org>
Subject [jira] [Commented] (HIVE-16843) PrimaryToReplicaResourceFunctionTest.createDestinationPath fails with AssertionError
Date Wed, 07 Jun 2017 14:00:24 GMT

    [ https://issues.apache.org/jira/browse/HIVE-16843?page=com.atlassian.jira.plugin.system.issuetabpanels:comment-tabpanel&focusedCommentId=16040914#comment-16040914
] 

Hive QA commented on HIVE-16843:
--------------------------------



Here are the results of testing the latest attachment:
https://issues.apache.org/jira/secure/attachment/12871826/HIVE-16843.patch

{color:green}SUCCESS:{color} +1 due to 1 test(s) being added or modified.

{color:red}ERROR:{color} -1 due to 6 failed/errored test(s), 10820 tests executed
*Failed tests:*
{noformat}
org.apache.hadoop.hive.cli.TestCliDriver.testCliDriver[cbo_rp_gby_empty] (batchId=77)
org.apache.hadoop.hive.cli.TestMiniLlapCliDriver.testCliDriver[orc_ppd_basic] (batchId=140)
org.apache.hadoop.hive.cli.TestMiniLlapLocalCliDriver.testCliDriver[vector_if_expr] (batchId=145)
org.apache.hadoop.hive.cli.TestPerfCliDriver.testCliDriver[query14] (batchId=232)
org.apache.hadoop.hive.cli.TestPerfCliDriver.testCliDriver[query23] (batchId=232)
org.apache.hadoop.hive.cli.TestPerfCliDriver.testCliDriver[query78] (batchId=232)
{noformat}

Test results: https://builds.apache.org/job/PreCommit-HIVE-Build/5567/testReport
Console output: https://builds.apache.org/job/PreCommit-HIVE-Build/5567/console
Test logs: http://104.198.109.242/logs/PreCommit-HIVE-Build-5567/

Messages:
{noformat}
Executing org.apache.hive.ptest.execution.TestCheckPhase
Executing org.apache.hive.ptest.execution.PrepPhase
Executing org.apache.hive.ptest.execution.ExecutionPhase
Executing org.apache.hive.ptest.execution.ReportingPhase
Tests exited with: TestsFailedException: 6 tests failed
{noformat}

This message is automatically generated.

ATTACHMENT ID: 12871826 - PreCommit-HIVE-Build

> PrimaryToReplicaResourceFunctionTest.createDestinationPath fails with AssertionError
> ------------------------------------------------------------------------------------
>
>                 Key: HIVE-16843
>                 URL: https://issues.apache.org/jira/browse/HIVE-16843
>             Project: Hive
>          Issue Type: Bug
>          Components: Tests
>    Affects Versions: 3.0.0
>         Environment: # cat /etc/lsb-release
> DISTRIB_ID=Ubuntu
> DISTRIB_RELEASE=14.04
> DISTRIB_CODENAME=trusty
> DISTRIB_DESCRIPTION="Ubuntu 14.04.5 LTS"
> # uname -a
> Linux 9efcdb4d8880 3.19.0-37-generic #42-Ubuntu SMP Fri Nov 20 18:22:05 UTC 2015 x86_64
x86_64 x86_64 GNU/Linux
>            Reporter: Yussuf Shaikh
>            Assignee: Yussuf Shaikh
>            Priority: Minor
>             Fix For: 3.0.0
>
>         Attachments: HIVE-16843.patch
>
>
> Stacktrace:
> java.lang.AssertionError: 
> Expected: is "hdfs://somehost:9000/someBasePath/withADir/replicaDbName/somefunctionname/9223372036854775807/ab.jar"
>      but: was "hdfs://somehost:9000/someBasePath/withADir/replicadbname/somefunctionname/0/ab.jar"
> 	at org.hamcrest.MatcherAssert.assertThat(MatcherAssert.java:20)
> 	at org.junit.Assert.assertThat(Assert.java:865)
> 	at org.junit.Assert.assertThat(Assert.java:832)
> 	at org.apache.hadoop.hive.ql.parse.repl.load.message.PrimaryToReplicaResourceFunctionTest.createDestinationPath(PrimaryToReplicaResourceFunctionTest.java:82)
> 	at sun.reflect.NativeMethodAccessorImpl.invoke0(Native Method)
> 	at sun.reflect.NativeMethodAccessorImpl.invoke(NativeMethodAccessorImpl.java:62)
> 	at sun.reflect.DelegatingMethodAccessorImpl.invoke(DelegatingMethodAccessorImpl.java:43)
> 	at java.lang.reflect.Method.invoke(Method.java:498)



--
This message was sent by Atlassian JIRA
(v6.3.15#6346)

Mime
View raw message