hive-issues mailing list archives

Site index · List index
Message view « Date » · « Thread »
Top « Date » · « Thread »
From "Hive QA (JIRA)" <j...@apache.org>
Subject [jira] [Commented] (HIVE-17928) branch-2.3 does not compile due to using incorrect storage-api version
Date Sun, 29 Oct 2017 19:21:01 GMT

    [ https://issues.apache.org/jira/browse/HIVE-17928?page=com.atlassian.jira.plugin.system.issuetabpanels:comment-tabpanel&focusedCommentId=16224150#comment-16224150
] 

Hive QA commented on HIVE-17928:
--------------------------------



Here are the results of testing the latest attachment:
https://issues.apache.org/jira/secure/attachment/12894643/HIVE-17928.1-branch-2.3.patch

{color:red}ERROR:{color} -1 due to no test(s) being added or modified.

{color:red}ERROR:{color} -1 due to 7 failed/errored test(s), 10560 tests executed
*Failed tests:*
{noformat}
org.apache.hadoop.hive.cli.TestCliDriver.testCliDriver[comments] (batchId=35)
org.apache.hadoop.hive.cli.TestMiniLlapLocalCliDriver.testCliDriver[vector_if_expr] (batchId=142)
org.apache.hadoop.hive.ql.TestTxnCommands2.testNonAcidToAcidConversion02 (batchId=263)
org.apache.hadoop.hive.ql.TestTxnCommands2WithSplitUpdate.testNonAcidToAcidConversion02 (batchId=275)
org.apache.hadoop.hive.ql.TestTxnCommands2WithSplitUpdateAndVectorization.testNonAcidToAcidConversion02
(batchId=272)
org.apache.hadoop.hive.thrift.TestHadoopAuthBridge23.testSaslWithHiveMetaStore (batchId=226)
org.apache.hive.hcatalog.api.TestHCatClient.testTransportFailure (batchId=174)
{noformat}

Test results: https://builds.apache.org/job/PreCommit-HIVE-Build/7550/testReport
Console output: https://builds.apache.org/job/PreCommit-HIVE-Build/7550/console
Test logs: http://104.198.109.242/logs/PreCommit-HIVE-Build-7550/

Messages:
{noformat}
Executing org.apache.hive.ptest.execution.TestCheckPhase
Executing org.apache.hive.ptest.execution.PrepPhase
Executing org.apache.hive.ptest.execution.ExecutionPhase
Executing org.apache.hive.ptest.execution.ReportingPhase
Tests exited with: TestsFailedException: 7 tests failed
{noformat}

This message is automatically generated.

ATTACHMENT ID: 12894643 - PreCommit-HIVE-Build

> branch-2.3 does not compile due to using incorrect storage-api version
> ----------------------------------------------------------------------
>
>                 Key: HIVE-17928
>                 URL: https://issues.apache.org/jira/browse/HIVE-17928
>             Project: Hive
>          Issue Type: Bug
>          Components: Hive
>    Affects Versions: 2.3.2
>            Reporter: Sergio Peña
>            Assignee: Sergio Peña
>         Attachments: HIVE-17928.1-branch-2.3.patch, HIVE-17928.1-branch2.3.patch
>
>
> This is the error when building branch-2.3
> {noformat}
> [INFO] Reactor Summary:
> [INFO]
> [INFO] Hive ............................................... SUCCESS [  1.401 s]
> [INFO] Hive Shims Common .................................. SUCCESS [  3.091 s]
> [INFO] Hive Shims 0.23 .................................... SUCCESS [  2.299 s]
> [INFO] Hive Shims Scheduler ............................... SUCCESS [  1.026 s]
> [INFO] Hive Shims ......................................... SUCCESS [  0.560 s]
> [INFO] Hive Common ........................................ FAILURE [  0.090 s]
> [INFO] Hive Service RPC ................................... SKIPPED
> [INFO] Hive Serde ......................................... SKIPPED
> [INFO] Hive Metastore ..................................... SKIPPED
> [INFO] Hive Vector-Code-Gen Utilities ..................... SKIPPED
> [INFO] Hive Llap Common ................................... SKIPPED
> [INFO] Hive Llap Client ................................... SKIPPED
> [INFO] Hive Llap Tez ...................................... SKIPPED
> [INFO] Spark Remote Client ................................ SKIPPED
> [INFO] Hive Query Language ................................ SKIPPED
> [INFO] Hive Llap Server ................................... SKIPPED
> [INFO] Hive Service ....................................... SKIPPED
> [INFO] Hive Accumulo Handler .............................. SKIPPED
> [INFO] Hive JDBC .......................................... SKIPPED
> [INFO] Hive Beeline ....................................... SKIPPED
> [INFO] Hive CLI ........................................... SKIPPED
> [INFO] Hive Contrib ....................................... SKIPPED
> [INFO] Hive Druid Handler ................................. SKIPPED
> [INFO] Hive HBase Handler ................................. SKIPPED
> [INFO] Hive JDBC Handler .................................. SKIPPED
> [INFO] Hive HCatalog ...................................... SKIPPED
> [INFO] Hive HCatalog Core ................................. SKIPPED
> [INFO] Hive HCatalog Pig Adapter .......................... SKIPPED
> [INFO] Hive HCatalog Server Extensions .................... SKIPPED
> [INFO] Hive HCatalog Webhcat Java Client .................. SKIPPED
> [INFO] Hive HCatalog Webhcat .............................. SKIPPED
> [INFO] Hive HCatalog Streaming ............................ SKIPPED
> [INFO] Hive HPL/SQL ....................................... SKIPPED
> [INFO] Hive Llap External Client .......................... SKIPPED
> [INFO] Hive Shims Aggregator .............................. SKIPPED
> [INFO] Hive TestUtils ..................................... SKIPPED
> [INFO] Hive Packaging ..................................... SKIPPED
> [INFO] ------------------------------------------------------------------------
> [INFO] BUILD FAILURE
> [INFO] ------------------------------------------------------------------------
> [INFO] Total time: 8.991 s
> [INFO] Finished at: 2017-10-28T12:33:51-05:00
> [INFO] Final Memory: 67M/975M
> [INFO] ------------------------------------------------------------------------
> [ERROR] Failed to execute goal on project hive-common: Could not resolve dependencies
for project org.apache.hive:hive-common:jar:2.3.2-SNAPSHOT: Could not find artifact org.apache.hive:hive-storage-api:jar:2.3.2-SNAPSHOT
-> [Help 1]
> {noformat}



--
This message was sent by Atlassian JIRA
(v6.4.14#64029)

Mime
View raw message