hive-issues mailing list archives

Site index · List index
Message view « Date » · « Thread »
Top « Date » · « Thread »
From "Hive QA (JIRA)" <j...@apache.org>
Subject [jira] [Commented] (HIVE-19084) Test case in Hive Query Language fails with a java.lang.AssertionError.
Date Fri, 01 Jun 2018 07:00:00 GMT

    [ https://issues.apache.org/jira/browse/HIVE-19084?page=com.atlassian.jira.plugin.system.issuetabpanels:comment-tabpanel&focusedCommentId=16497652#comment-16497652
] 

Hive QA commented on HIVE-19084:
--------------------------------

| (/) *{color:green}+1 overall{color}* |
\\
\\
|| Vote || Subsystem || Runtime || Comment ||
|| || || || {color:brown} Prechecks {color} ||
| {color:green}+1{color} | {color:green} @author {color} | {color:green}  0m  0s{color} |
{color:green} The patch does not contain any @author tags. {color} |
|| || || || {color:brown} master Compile Tests {color} ||
| {color:green}+1{color} | {color:green} mvninstall {color} | {color:green}  7m 13s{color}
| {color:green} master passed {color} |
| {color:green}+1{color} | {color:green} compile {color} | {color:green}  1m  0s{color} |
{color:green} master passed {color} |
| {color:green}+1{color} | {color:green} checkstyle {color} | {color:green}  0m 35s{color}
| {color:green} master passed {color} |
| {color:blue}0{color} | {color:blue} findbugs {color} | {color:blue}  3m 37s{color} | {color:blue}
ql in master has 2278 extant Findbugs warnings. {color} |
| {color:green}+1{color} | {color:green} javadoc {color} | {color:green}  0m 50s{color} |
{color:green} master passed {color} |
|| || || || {color:brown} Patch Compile Tests {color} ||
| {color:green}+1{color} | {color:green} mvninstall {color} | {color:green}  1m 14s{color}
| {color:green} the patch passed {color} |
| {color:green}+1{color} | {color:green} compile {color} | {color:green}  0m 55s{color} |
{color:green} the patch passed {color} |
| {color:green}+1{color} | {color:green} javac {color} | {color:green}  0m 55s{color} | {color:green}
the patch passed {color} |
| {color:green}+1{color} | {color:green} checkstyle {color} | {color:green}  0m 34s{color}
| {color:green} ql: The patch generated 0 new + 122 unchanged - 1 fixed = 122 total (was 123)
{color} |
| {color:green}+1{color} | {color:green} whitespace {color} | {color:green}  0m  0s{color}
| {color:green} The patch has no whitespace issues. {color} |
| {color:green}+1{color} | {color:green} findbugs {color} | {color:green}  3m 38s{color} |
{color:green} the patch passed {color} |
| {color:green}+1{color} | {color:green} javadoc {color} | {color:green}  0m 51s{color} |
{color:green} the patch passed {color} |
|| || || || {color:brown} Other Tests {color} ||
| {color:green}+1{color} | {color:green} asflicense {color} | {color:green}  0m 12s{color}
| {color:green} The patch does not generate ASF License warnings. {color} |
| {color:black}{color} | {color:black} {color} | {color:black} 21m  6s{color} | {color:black}
{color} |
\\
\\
|| Subsystem || Report/Notes ||
| Optional Tests |  asflicense  javac  javadoc  findbugs  checkstyle  compile  |
| uname | Linux hiveptest-server-upstream 3.16.0-4-amd64 #1 SMP Debian 3.16.36-1+deb8u1 (2016-09-03)
x86_64 GNU/Linux |
| Build tool | maven |
| Personality | /data/hiveptest/working/yetus_PreCommit-HIVE-Build-11404/dev-support/hive-personality.sh
|
| git revision | master / 06807bc |
| Default Java | 1.8.0_111 |
| findbugs | v3.0.0 |
| modules | C: ql U: ql |
| Console output | http://104.198.109.242/logs//PreCommit-HIVE-Build-11404/yetus.txt |
| Powered by | Apache Yetus    http://yetus.apache.org |


This message was automatically generated.



> Test case in Hive Query Language fails with a java.lang.AssertionError.
> -----------------------------------------------------------------------
>
>                 Key: HIVE-19084
>                 URL: https://issues.apache.org/jira/browse/HIVE-19084
>             Project: Hive
>          Issue Type: Bug
>          Components: Test, Transactions
>         Environment: uname -a
> Linux pts00607-vm3 4.4.0-112-generic #135-Ubuntu SMP Fri Jan 19 11:48:46 UTC 2018 ppc64le
ppc64le ppc64le GNU/Linux
>            Reporter: Alisha Prabhu
>            Assignee: Steve Yeom
>            Priority: Major
>              Labels: patch-available
>         Attachments: HIVE-19084.02.patch, HIVE-19084.03.patch, HIVE-19084.1.patch
>
>
> The test case testInsertOverwriteForPartitionedMmTable in TestTxnCommandsForMmTable.java
and TestTxnCommandsForOrcMmTable.java fails with a java.lang.AssertionError on ppc arch.
> Maven command used is mvn -Dtest=TestTxnCommandsForMmTable test
> The test case fails as the listStatus function of the FileSystem does not guarantee to
return the List of files/directories status in a sorted order.
> Error :
> {code:java}
> [INFO] Running org.apache.hadoop.hive.ql.TestTxnCommandsForMmTable
> [ERROR] Tests run: 7, Failures: 1, Errors: 0, Skipped: 0, Time elapsed: 125.463 s <<<
FAILURE! - in org.apache.hadoop.hive.ql.TestTxnCommandsForMmTable
> [ERROR] testInsertOverwriteForPartitionedMmTable(org.apache.hadoop.hive.ql.TestTxnCommandsForMmTable) 
Time elapsed: 13.57 s  <<< FAILURE!
> java.lang.AssertionError
>         at org.junit.Assert.fail(Assert.java:86)
>         at org.junit.Assert.assertTrue(Assert.java:41)
>         at org.junit.Assert.assertTrue(Assert.java:52)
>         at org.apache.hadoop.hive.ql.TestTxnCommandsForMmTable.testInsertOverwriteForPartitionedMmTable(TestTxnCommandsForMmTable.java:296)
> {code}



--
This message was sent by Atlassian JIRA
(v7.6.3#76005)

Mime
View raw message